{"text_format":"2","workbook":"xlsx","n_sheets":6,"sheets":["Orçamento","Eventograma","Composições","BDI","Desembolso-cronograma","Transporte - memória"],"not_rendered":{"charts":0,"images":0,"macros":0,"external_links":0,"defined_names":7,"comments":0,"pivot_tables":0},"unopened":[],"bounds":{"document_bytes":16777216,"sheet_cells":100000,"run_cost":"one","rows_first":2000,"rows_last":500,"rows_between":2000,"halvings":0,"cell_chars":16384,"cell_head_chars":4096},"cells_cut":0,"cells_raw":0,"read":"whole","date_system":"1900"}

{"sheet":"Orçamento","index":0,"n_rows":126,"n_cols":12,"rows_kept":126,"cut":false,"hidden":false,"merged":[[0,0,0,9]]}
["ORÇAMENTO PROJETO DE RECUPERAÇÃO - BARRAGEM PARANÃ"]
["ítem","Base","Código","Descrição","Und","Qtd","Custo Unitário (R$)","Custo Total (R$)","Preço Unitário (R$)","Preço Total (R$)"]
[1,null,null,"Serviços Preliminares e Administração Local",null,null,null,{"$f":"SUBTOTAL(9,H4:H15)","v":772771.08180000004},null,{"$f":"SUBTOTAL(9,J4:J15)","v":961743.6}]
["1.1.1","COMPOS.","0.001","Mobilizaçãos de Equipamentos e Pessoal","un.",1,{"$f":"Composições!G14","v":45458.25},{"$f":"G4*F4","v":45458.25},{"$f":"ROUND(G4*(1+BDI!$C$17),2)","v":56575.3},{"$f":"I4*F4","v":56575.3},null,{"$f":"SUM(J4:J8)","v":944809.79999999993}]
["1.1.2","COMPOS.","0.002","Desmobilização de Equipamentos e Pessoal","un.",1,{"$f":"Composições!G39","v":45458.25},{"$f":"G5*F5","v":45458.25},{"$f":"ROUND(G5*(1+BDI!$C$17),2)","v":56575.3},{"$f":"I5*F5","v":56575.3}]
["1.1.3","COMPOS.","0.003","Placa de obra","un.",1,{"$f":"Composições!G76","v":324.43579999999997},{"$f":"G6*F6","v":324.43579999999997},{"$f":"ROUND(G6*(1+BDI!$C$17),2)","v":403.78},{"$f":"I6*F6","v":403.78}]
["1.1.4","COMPOS.","0.004","Administração Local e Manutenção do Canteiro","mês",12,{"$f":"Composições!G103","v":45626.058000000005},{"$f":"F7*G7","v":547512.696},{"$f":"ROUND(G7*(1+BDI!$C$17),2)","v":56784.14},681409.67999999993]
["1.1.5","COMPOS.","0.005","Instalação de Canteiro de Obra","un.",1,{"$f":"Composições!G133","v":120401.05},{"$f":"F8*G8","v":120401.05},{"$f":"ROUND(G8*(1+BDI!$C$17),2)","v":149845.74},149845.74]
[]
["1.3",null,null,"Acessos",null,null,null,{"$f":"SUBTOTAL(9,H11:H14)","v":13616.4},null,{"$f":"SUBTOTAL(9,J11:J14)","v":16933.8}]
["1.3.1","SICRO",5502986,"Expurgo","m³",{"$f":"2000*3*0.25","v":1500},1.78,{"$f":"G11*F11","v":2670},{"$f":"ROUND(G11*(1+BDI!$C$17),2)","v":2.2200000000000002},{"$f":"I11*F11","v":3330.0000000000005},null,{"$f":"SUM(J11:J14)","v":16933.8}]
["1.3.2","SICRO",4011209,"Regularização do Subleito","m²",{"$f":"2000*3","v":6000},0.67,{"$f":"G12*F12","v":4020.0000000000005},{"$f":"ROUND(G12*(1+BDI!$C$17),2)","v":0.83},{"$f":"I12*F12","v":4980}]
["1.3.3","SICRO",4015612,"Revestimento Primário de Acesso","m³",{"$f":"F12*0.15","v":900},6.81,{"$f":"G13*F13","v":6129},{"$f":"ROUND(G13*(1+BDI!$C$17),2)","v":8.48},{"$f":"I13*F13","v":7632}]
["1.3.4","SICRO",4915611,"Recomposição de revestimento primário","m³",{"$f":"F13*20%","v":180},4.43,{"$f":"G14*F14","v":797.4},{"$f":"ROUND(G14*(1+BDI!$C$17),2)","v":5.51},{"$f":"I14*F14","v":991.8}]
[]
{"$rows_left_out":112}
{"sheet":"Eventograma","index":1,"n_rows":200,"n_cols":24,"rows_kept":200,"cut":false,"hidden":true,"merged":[]}
["ORÇAMENTO PROJETO DE RECUPERAÇÃO - BARRAGEM PARANÃ",{"$nulls":5},"BDI",{"$f":"126.023944549464%-1","v":0.26023944549463995},"2020-04-01","2020-05-01","2020-06-01","2020-07-01","2020-08-01","2020-09-01","2020-10-01","2020-11-01","2020-12-01","2021-01-01","2021-02-01","2021-03-01","2021-04-01","2021-05-01"]
["ítem","Base","Código","Descrição","Und","Qtd",null,"M1","M2","M3","M4","M5","M6","M7","M8","M9","M10","M11","M12","M13","M14","M15"]
[1,null,null,"Serviços Preliminares",null,null,null,0,0,0,0,0,0,0,0,0,0,0,0,0,0,0]
["1.1",null,null,"Mobilizações e Desmobilizações",null,null,null,0,0,0,0,0,0,0,0,0,0,0,0,0,0,0]
["1.1.1",{"$f":"VLOOKUP($A5,Orçamento!$A$3:$J$126,2,FALSE)","v":"COMPOS."},{"$f":"VLOOKUP($A5,Orçamento!$A$3:$J$126,3,FALSE)","v":"0.001"},{"$f":"VLOOKUP($A5,Orçamento!$A$3:$J$126,4,FALSE)","v":"Mobilizaçãos de Equipamentos e Pessoal"},{"$f":"VLOOKUP($A5,Orçamento!$A$3:$J$126,5,FALSE)","v":"un."},{"$f":"VLOOKUP($A5,Orçamento!$A$3:$J$126,6,FALSE)","v":1},null,1,0,0,0,0,0,0,0,0,0,0,0,0,0,0,null,{"$f":"F5-SUM(H5:V5)","v":0}]
["1.1.2",{"$f":"VLOOKUP($A6,Orçamento!$A$3:$J$126,2,FALSE)","v":"COMPOS."},{"$f":"VLOOKUP($A6,Orçamento!$A$3:$J$126,3,FALSE)","v":"0.002"},{"$f":"VLOOKUP($A6,Orçamento!$A$3:$J$126,4,FALSE)","v":"Desmobilização de Equipamentos e Pessoal"},{"$f":"VLOOKUP($A6,Orçamento!$A$3:$J$126,5,FALSE)","v":"un."},{"$f":"VLOOKUP($A6,Orçamento!$A$3:$J$126,6,FALSE)","v":1},null,0,0,0,0,0,0,0,0,0,0,0,0,0,0,1,null,0]
[{"$nulls":5},{"$f":"Orçamento!#REF!","v":{"$error":"#REF!"}},{"$nulls":17},{"$error":"#REF!"}]
["1.2",null,null,"Estruturas de Canteiro",null,{"$f":"Orçamento!#REF!","v":{"$error":"#REF!"}},null,0,0,0,0,0,0,0,0,0,0,0,0,0,0,0,null,{"$error":"#REF!"}]
["1.2.1",{"$f":"VLOOKUP($A9,Orçamento!$A$3:$J$126,2,FALSE)","v":{"$error":"#N/A"}},{"$f":"VLOOKUP($A9,Orçamento!$A$3:$J$126,3,FALSE)","v":{"$error":"#N/A"}},{"$f":"VLOOKUP($A9,Orçamento!$A$3:$J$126,4,FALSE)","v":{"$error":"#N/A"}},{"$f":"VLOOKUP($A9,Orçamento!$A$3:$J$126,5,FALSE)","v":{"$error":"#N/A"}},{"$f":"VLOOKUP($A9,Orçamento!$A$3:$J$126,6,FALSE)","v":{"$error":"#N/A"}},null,280.61,0,0,0,0,0,0,0,0,0,0,0,0,0,0,null,{"$error":"#N/A"}]
["1.2.2",{"$f":"VLOOKUP($A10,Orçamento!$A$3:$J$126,2,FALSE)","v":{"$error":"#N/A"}},{"$f":"VLOOKUP($A10,Orçamento!$A$3:$J$126,3,FALSE)","v":{"$error":"#N/A"}},{"$f":"VLOOKUP($A10,Orçamento!$A$3:$J$126,4,FALSE)","v":{"$error":"#N/A"}},{"$f":"VLOOKUP($A10,Orçamento!$A$3:$J$126,5,FALSE)","v":{"$error":"#N/A"}},{"$f":"VLOOKUP($A10,Orçamento!$A$3:$J$126,6,FALSE)","v":{"$error":"#N/A"}},null,1122.42,0,0,0,0,0,0,0,0,0,0,0,0,0,0,null,{"$error":"#N/A"}]
["1.2.3",{"$f":"VLOOKUP($A11,Orçamento!$A$3:$J$126,2,FALSE)","v":{"$error":"#N/A"}},{"$f":"VLOOKUP($A11,Orçamento!$A$3:$J$126,3,FALSE)","v":{"$error":"#N/A"}},{"$f":"VLOOKUP($A11,Orçamento!$A$3:$J$126,4,FALSE)","v":{"$error":"#N/A"}},{"$f":"VLOOKUP($A11,Orçamento!$A$3:$J$126,5,FALSE)","v":{"$error":"#N/A"}},{"$f":"VLOOKUP($A11,Orçamento!$A$3:$J$126,6,FALSE)","v":{"$error":"#N/A"}},null,112.24,0,0,0,0,0,0,0,0,0,0,0,0,0,0,null,{"$error":"#N/A"}]
["1.2.4",{"$f":"VLOOKUP($A12,Orçamento!$A$3:$J$126,2,FALSE)","v":{"$error":"#N/A"}},{"$f":"VLOOKUP($A12,Orçamento!$A$3:$J$126,3,FALSE)","v":{"$error":"#N/A"}},{"$f":"VLOOKUP($A12,Orçamento!$A$3:$J$126,4,FALSE)","v":{"$error":"#N/A"}},{"$f":"VLOOKUP($A12,Orçamento!$A$3:$J$126,5,FALSE)","v":{"$error":"#N/A"}},{"$f":"VLOOKUP($A12,Orçamento!$A$3:$J$126,6,FALSE)","v":{"$error":"#N/A"}},null,0,59.26,0,0,0,0,0,0,0,0,0,0,0,0,0,null,{"$error":"#N/A"}]
["1.2.5",{"$f":"VLOOKUP($A13,Orçamento!$A$3:$J$126,2,FALSE)","v":{"$error":"#N/A"}},{"$f":"VLOOKUP($A13,Orçamento!$A$3:$J$126,3,FALSE)","v":{"$error":"#N/A"}},{"$f":"VLOOKUP($A13,Orçamento!$A$3:$J$126,4,FALSE)","v":{"$error":"#N/A"}},{"$f":"VLOOKUP($A13,Orçamento!$A$3:$J$126,5,FALSE)","v":{"$error":"#N/A"}},{"$f":"VLOOKUP($A13,Orçamento!$A$3:$J$126,6,FALSE)","v":{"$error":"#N/A"}},null,0,0,89.89,0,0,0,0,0,0,0,0,0,0,0,0,null,{"$error":"#N/A"}]
["1.2.6",{"$f":"VLOOKUP($A14,Orçamento!$A$3:$J$126,2,FALSE)","v":{"$error":"#N/A"}},{"$f":"VLOOKUP($A14,Orçamento!$A$3:$J$126,3,FALSE)","v":{"$error":"#N/A"}},{"$f":"VLOOKUP($A14,Orçamento!$A$3:$J$126,4,FALSE)","v":{"$error":"#N/A"}},{"$f":"VLOOKUP($A14,Orçamento!$A$3:$J$126,5,FALSE)","v":{"$error":"#N/A"}},{"$f":"VLOOKUP($A14,Orçamento!$A$3:$J$126,6,FALSE)","v":{"$error":"#N/A"}},null,0,0,84.79,0,0,0,0,0,0,0,0,0,0,0,0,null,{"$error":"#N/A"}]
["1.2.7",{"$f":"VLOOKUP($A15,Orçamento!$A$3:$J$126,2,FALSE)","v":{"$error":"#N/A"}},{"$f":"VLOOKUP($A15,Orçamento!$A$3:$J$126,3,FALSE)","v":{"$error":"#N/A"}},{"$f":"VLOOKUP($A15,Orçamento!$A$3:$J$126,4,FALSE)","v":{"$error":"#N/A"}},{"$f":"VLOOKUP($A15,Orçamento!$A$3:$J$126,5,FALSE)","v":{"$error":"#N/A"}},{"$f":"VLOOKUP($A15,Orçamento!$A$3:$J$126,6,FALSE)","v":{"$error":"#N/A"}},null,0,88.65,0,0,0,0,0,0,0,0,0,0,0,0,0,null,{"$error":"#N/A"}]
{"$rows_left_out":186}
{"sheet":"Composições","index":2,"n_rows":177,"n_cols":12,"rows_kept":177,"cut":false,"hidden":false,"merged":[[160,1,160,4],[108,1,108,4]]}
["COMPOSIÇÃO ANALÍTICA DE CUSTOS"]
["CÓDIGO:","0.001",null,null,null,"DATA BASE: "]
[" DESCRIÇÃO:   ","Mobilização",null,null,null,"UNIDADE:","und"]
["CÓDIGO",null,"DESCRIÇÃO","UN.","INCIDÊNCIA","CUSTO UNITÁRIO","SUB TOTAL"]
[null,null,"A - EQUIPAMENTOS",null,null,"TOTAL",{"$f":"SUM(G13:G13)","v":0}]
[]
["Sicro","E9134","Minônibus - 111kW","h",34,126.66,{"$f":"E7*F7","v":4306.4399999999996}]
["Sicro","E9571","Caminhão tanque com capacidade 10.000 l - 188kw","h",4.2,189.89,{"$f":"E8*F8","v":797.53800000000001}]
["Sicro","E9600","Caminhão betoneira com capacidade - 8m³ - 188kW","h",12.6,165.1,2080.2599999999998]
["Sicro","E9508","Caminhão carroceria com capacidade - 9t - 136kW","h",8.4,105.91,889.64400000000001]
["Sicro","E9667","Caminhão basculante com capacidade - 14m³ - 188kW","h",33.6,156.38,5254.3680000000004]
["Sicro",5914640,"Transporte com cavalo mecânico de 30t","Txkm",107100,0.3,32130]
[]
[null,null,"B - MATERIAIS",null,null,"TOTAL",{"$f":"SUM(G7:G12)","v":45458.25}]
[]
{"$rows_left_out":163}
{"sheet":"BDI","index":3,"n_rows":17,"n_cols":4,"rows_kept":17,"cut":false,"hidden":false,"merged":[[1,1,1,2]]}
[]
[null,"Detalhamento do BDI"]
[null,"Itens Relativos à Administração da Obra",{"$f":"SUM(C4:C8)","v":6.0999999999999999E-2}]
["B","Administração Central",3.7999999999999999E-2]
["C","Despesa Financeira",9.4000000000000004E-3]
["D","Riscos",0.01]
["E","Seguros e Garantias Contratuais",3.5999999999999999E-3]
[]
[null,"Lucro",{"$f":"SUM(C10:C11)","v":6.9000000000000006E-2}]
["F","Margem Bruta",6.9000000000000006E-2]
[]
[null,"Tributos",{"$f":"SUM(C13:C16)","v":6.6500000000000004E-2}]
["G","PIS",6.4999999999999997E-3]
["H","COFINS",0.03]
["I","ISS",0.03,"Informado pela Secretaria de Finanças de Formosa-GO (ligação telefônica - 09h40 - 04/11/2020)."]
{"$rows_left_out":3}
{"sheet":"Desembolso-cronograma","index":4,"n_rows":127,"n_cols":28,"rows_kept":127,"cut":false,"hidden":false,"merged":[]}
["ORÇAMENTO PROJETO DE RECUPERAÇÃO - BARRAGEM PARANÃ",{"$nulls":9},"BDI"]
["ítem","Base","Código","Descrição","Und","Qtd","Custo Unitário (R$)","Custo Total (R$)","Preço Unitário (R$)","Preço Total (R$)",null,"M1","M2","M3","M4","M5","M6","M7","M8","M9","M10","M11","M12","M13","M14","M15"]
[1,null,null,"Serviços Preliminares",null,null,null,{"$f":"SUBTOTAL(9,H4:H16)","v":772771.08180000004},null,{"$f":"SUBTOTAL(9,J4:J16)","v":961743.6},null,{"$f":"SUBTOTAL(9,L4:L16)","v":188686.09},140017.00999999998,64416.139999999992,56784.139999999992,56784.139999999992,56784.139999999992,56784.139999999992,57775.939999999995,56784.139999999992,56784.139999999992,56784.139999999992,113359.44,0,0,0]
["1.1",null,null,"Mobilizações e Desmobilizações",null,null,null,{"$f":"SUBTOTAL(9,H5:H10)","v":759154.68180000002},null,{"$f":"SUBTOTAL(9,J5:J10)","v":944809.79999999993},null,{"$f":"SUBTOTAL(9,L5:L10)","v":188686.09},131707.00999999998,56784.139999999992,56784.139999999992,56784.139999999992,56784.139999999992,56784.139999999992,56784.139999999992,56784.139999999992,56784.139999999992,56784.139999999992,113359.44,0,0,0]
["1.1.1",{"$f":"VLOOKUP($A5,Orçamento!$A$3:$J$125,2,FALSE)","v":"COMPOS."},null,{"$f":"VLOOKUP($A5,Orçamento!$A$3:$J$125,4,FALSE)","v":"Mobilizaçãos de Equipamentos e Pessoal"},{"$f":"VLOOKUP($A5,Orçamento!$A$3:$J$125,5,FALSE)","v":"un."},{"$f":"VLOOKUP($A5,Orçamento!$A$3:$J$125,6,FALSE)","v":1},{"$f":"VLOOKUP($A5,Orçamento!$A$3:$J$125,7,FALSE)","v":45458.25},{"$f":"VLOOKUP($A5,Orçamento!$A$3:$J$125,8,FALSE)","v":45458.25},{"$f":"VLOOKUP($A5,Orçamento!$A$3:$J$125,9,FALSE)","v":56575.3},{"$f":"VLOOKUP($A5,Orçamento!$A$3:$J$125,10,FALSE)","v":56575.3},null,{"$f":"Eventograma!H5*'Desembolso-cronograma'!$I5","v":56575.3},{"$f":"Eventograma!I5*'Desembolso-cronograma'!$I5","v":0},{"$f":"Eventograma!J5*'Desembolso-cronograma'!$I5","v":0},{"$f":"Eventograma!K5*'Desembolso-cronograma'!$I5","v":0},{"$f":"Eventograma!L5*'Desembolso-cronograma'!$I5","v":0},{"$f":"Eventograma!M5*'Desembolso-cronograma'!$I5","v":0},{"$f":"Eventograma!N5*'Desembolso-cronograma'!$I5","v":0},{"$f":"Eventograma!O5*'Desembolso-cronograma'!$I5","v":0},{"$f":"Eventograma!P5*'Desembolso-cronograma'!$I5","v":0},{"$f":"Eventograma!Q5*'Desembolso-cronograma'!$I5","v":0},{"$f":"Eventograma!R5*'Desembolso-cronograma'!$I5","v":0},{"$f":"Eventograma!S5*'Desembolso-cronograma'!$I5","v":0},{"$f":"Eventograma!T5*'Desembolso-cronograma'!$I5","v":0},{"$f":"Eventograma!U5*'Desembolso-cronograma'!$I5","v":0},{"$f":"Eventograma!V5*'Desembolso-cronograma'!$I5","v":0}]
["1.1.2",{"$f":"VLOOKUP($A6,Orçamento!$A$3:$J$125,2,FALSE)","v":"COMPOS."},null,{"$f":"VLOOKUP($A6,Orçamento!$A$3:$J$125,4,FALSE)","v":"Desmobilização de Equipamentos e Pessoal"},{"$f":"VLOOKUP($A6,Orçamento!$A$3:$J$125,5,FALSE)","v":"un."},{"$f":"VLOOKUP($A6,Orçamento!$A$3:$J$125,6,FALSE)","v":1},{"$f":"VLOOKUP($A6,Orçamento!$A$3:$J$125,7,FALSE)","v":45458.25},{"$f":"VLOOKUP($A6,Orçamento!$A$3:$J$125,8,FALSE)","v":45458.25},{"$f":"VLOOKUP($A6,Orçamento!$A$3:$J$125,9,FALSE)","v":56575.3},{"$f":"VLOOKUP($A6,Orçamento!$A$3:$J$125,10,FALSE)","v":56575.3},null,{"$f":"Eventograma!H6*'Desembolso-cronograma'!$I6","v":0},{"$f":"Eventograma!I6*'Desembolso-cronograma'!$I6","v":0},{"$f":"Eventograma!J6*'Desembolso-cronograma'!$I6","v":0},{"$f":"Eventograma!K6*'Desembolso-cronograma'!$I6","v":0},{"$f":"Eventograma!L6*'Desembolso-cronograma'!$I6","v":0},{"$f":"Eventograma!M6*'Desembolso-cronograma'!$I6","v":0},{"$f":"Eventograma!N6*'Desembolso-cronograma'!$I6","v":0},{"$f":"Eventograma!O6*'Desembolso-cronograma'!$I6","v":0},{"$f":"Eventograma!P6*'Desembolso-cronograma'!$I6","v":0},{"$f":"Eventograma!Q6*'Desembolso-cronograma'!$I6","v":0},{"$f":"Eventograma!R6*'Desembolso-cronograma'!$I6","v":0},{"$f":"Eventograma!V6*'Desembolso-cronograma'!$I6","v":56575.3},{"$f":"Eventograma!T6*'Desembolso-cronograma'!$I6","v":0},{"$f":"Eventograma!U6*'Desembolso-cronograma'!$I6","v":0}]
["1.1.3",{"$f":"VLOOKUP($A7,Orçamento!$A$3:$J$125,2,FALSE)","v":"COMPOS."},null,"Placa de obra","un.",1,{"$f":"VLOOKUP($A7,Orçamento!$A$3:$J$125,7,FALSE)","v":324.43579999999997},{"$f":"VLOOKUP($A7,Orçamento!$A$3:$J$125,8,FALSE)","v":324.43579999999997},{"$f":"VLOOKUP($A7,Orçamento!$A$3:$J$125,9,FALSE)","v":403.78},{"$f":"VLOOKUP($A7,Orçamento!$A$3:$J$125,10,FALSE)","v":403.78},null,{"$f":"J7","v":403.78}]
["1.1.4",{"$f":"VLOOKUP($A8,Orçamento!$A$3:$J$125,2,FALSE)","v":"COMPOS."},null,"Administração Local e manutenção","mês",12,{"$f":"VLOOKUP($A8,Orçamento!$A$3:$J$125,7,FALSE)","v":45626.058000000005},{"$f":"VLOOKUP($A8,Orçamento!$A$3:$J$125,8,FALSE)","v":547512.696},{"$f":"VLOOKUP($A8,Orçamento!$A$3:$J$125,9,FALSE)","v":56784.14},{"$f":"VLOOKUP($A8,Orçamento!$A$3:$J$125,10,FALSE)","v":681409.67999999993},null,{"$f":"$J$8/12","v":56784.139999999992},{"$f":"$J$8/12","v":56784.139999999992},56784.139999999992,56784.139999999992,56784.139999999992,56784.139999999992,56784.139999999992,56784.139999999992,56784.139999999992,56784.139999999992,56784.139999999992,56784.139999999992]
["1.1.5",{"$f":"VLOOKUP($A9,Orçamento!$A$3:$J$125,2,FALSE)","v":"COMPOS."},null,"Instalação de Canteiro de Obra","un.",1,{"$f":"VLOOKUP($A9,Orçamento!$A$3:$J$125,7,FALSE)","v":120401.05},{"$f":"VLOOKUP($A9,Orçamento!$A$3:$J$125,8,FALSE)","v":120401.05},{"$f":"VLOOKUP($A9,Orçamento!$A$3:$J$125,9,FALSE)","v":149845.74},{"$f":"VLOOKUP($A9,Orçamento!$A$3:$J$125,10,FALSE)","v":149845.74},null,{"$f":"$J$9/2","v":74922.87},{"$f":"$J$9/2","v":74922.87}]
[]
["1.3",null,null,"Acessos",null,{"$f":"Orçamento!F10","v":0},{"$f":"Orçamento!G10","v":0},{"$f":"SUBTOTAL(9,H12:H15)","v":13616.4},null,{"$f":"SUBTOTAL(9,J12:J15)","v":16933.8},null,{"$f":"SUBTOTAL(9,L12:L16)","v":0},8310,7632,0,0,0,0,991.8,0,0,0,0,0,0,0]
["1.3.1",{"$f":"VLOOKUP($A12,Orçamento!$A$3:$J$125,2,FALSE)","v":"SICRO"},{"$f":"VLOOKUP($A12,Orçamento!$A$3:$J$125,3,FALSE)","v":5502986},{"$f":"VLOOKUP($A12,Orçamento!$A$3:$J$125,4,FALSE)","v":"Expurgo"},{"$f":"VLOOKUP($A12,Orçamento!$A$3:$J$125,5,FALSE)","v":"m³"},{"$f":"VLOOKUP($A12,Orçamento!$A$3:$J$125,6,FALSE)","v":1500},{"$f":"VLOOKUP($A12,Orçamento!$A$3:$J$125,7,FALSE)","v":1.78},{"$f":"VLOOKUP($A12,Orçamento!$A$3:$J$125,8,FALSE)","v":2670},{"$f":"VLOOKUP($A12,Orçamento!$A$3:$J$125,9,FALSE)","v":2.2200000000000002},{"$f":"VLOOKUP($A12,Orçamento!$A$3:$J$125,10,FALSE)","v":3330.0000000000005},null,{"$f":"Eventograma!H33*'Desembolso-cronograma'!$I12","v":0},{"$f":"Eventograma!I33*'Desembolso-cronograma'!$I12","v":3330.0000000000005},{"$f":"Eventograma!J33*'Desembolso-cronograma'!$I12","v":0},{"$f":"Eventograma!K33*'Desembolso-cronograma'!$I12","v":0},{"$f":"Eventograma!L33*'Desembolso-cronograma'!$I12","v":0},{"$f":"Eventograma!M33*'Desembolso-cronograma'!$I12","v":0},{"$f":"Eventograma!N33*'Desembolso-cronograma'!$I12","v":0},{"$f":"Eventograma!O33*'Desembolso-cronograma'!$I12","v":0},{"$f":"Eventograma!P33*'Desembolso-cronograma'!$I12","v":0},{"$f":"Eventograma!Q33*'Desembolso-cronograma'!$I12","v":0},{"$f":"Eventograma!R33*'Desembolso-cronograma'!$I12","v":0},{"$f":"Eventograma!S33*'Desembolso-cronograma'!$I12","v":0},{"$f":"Eventograma!T33*'Desembolso-cronograma'!$I12","v":0},{"$f":"Eventograma!U33*'Desembolso-cronograma'!$I12","v":0},{"$f":"Eventograma!V33*'Desembolso-cronograma'!$I12","v":0}]
["1.3.2",{"$f":"VLOOKUP($A13,Orçamento!$A$3:$J$125,2,FALSE)","v":"SICRO"},{"$f":"VLOOKUP($A13,Orçamento!$A$3:$J$125,3,FALSE)","v":4011209},{"$f":"VLOOKUP($A13,Orçamento!$A$3:$J$125,4,FALSE)","v":"Regularização do Subleito"},{"$f":"VLOOKUP($A13,Orçamento!$A$3:$J$125,5,FALSE)","v":"m²"},{"$f":"VLOOKUP($A13,Orçamento!$A$3:$J$125,6,FALSE)","v":6000},{"$f":"VLOOKUP($A13,Orçamento!$A$3:$J$125,7,FALSE)","v":0.67},{"$f":"VLOOKUP($A13,Orçamento!$A$3:$J$125,8,FALSE)","v":4020.0000000000005},{"$f":"VLOOKUP($A13,Orçamento!$A$3:$J$125,9,FALSE)","v":0.83},{"$f":"VLOOKUP($A13,Orçamento!$A$3:$J$125,10,FALSE)","v":4980},null,{"$f":"Eventograma!H34*'Desembolso-cronograma'!$I13","v":0},{"$f":"Eventograma!I34*'Desembolso-cronograma'!$I13","v":4980},{"$f":"Eventograma!J34*'Desembolso-cronograma'!$I13","v":0},{"$f":"Eventograma!K34*'Desembolso-cronograma'!$I13","v":0},{"$f":"Eventograma!L34*'Desembolso-cronograma'!$I13","v":0},{"$f":"Eventograma!M34*'Desembolso-cronograma'!$I13","v":0},{"$f":"Eventograma!N34*'Desembolso-cronograma'!$I13","v":0},{"$f":"Eventograma!O34*'Desembolso-cronograma'!$I13","v":0},{"$f":"Eventograma!P34*'Desembolso-cronograma'!$I13","v":0},{"$f":"Eventograma!Q34*'Desembolso-cronograma'!$I13","v":0},{"$f":"Eventograma!R34*'Desembolso-cronograma'!$I13","v":0},{"$f":"Eventograma!S34*'Desembolso-cronograma'!$I13","v":0},{"$f":"Eventograma!T34*'Desembolso-cronograma'!$I13","v":0},{"$f":"Eventograma!U34*'Desembolso-cronograma'!$I13","v":0},{"$f":"Eventograma!V34*'Desembolso-cronograma'!$I13","v":0}]
["1.3.3",{"$f":"VLOOKUP($A14,Orçamento!$A$3:$J$125,2,FALSE)","v":"SICRO"},{"$f":"VLOOKUP($A14,Orçamento!$A$3:$J$125,3,FALSE)","v":4015612},{"$f":"VLOOKUP($A14,Orçamento!$A$3:$J$125,4,FALSE)","v":"Revestimento Primário de Acesso"},{"$f":"VLOOKUP($A14,Orçamento!$A$3:$J$125,5,FALSE)","v":"m³"},{"$f":"VLOOKUP($A14,Orçamento!$A$3:$J$125,6,FALSE)","v":900},{"$f":"VLOOKUP($A14,Orçamento!$A$3:$J$125,7,FALSE)","v":6.81},{"$f":"VLOOKUP($A14,Orçamento!$A$3:$J$125,8,FALSE)","v":6129},{"$f":"VLOOKUP($A14,Orçamento!$A$3:$J$125,9,FALSE)","v":8.48},{"$f":"VLOOKUP($A14,Orçamento!$A$3:$J$125,10,FALSE)","v":7632},null,{"$f":"Eventograma!H35*'Desembolso-cronograma'!$I14","v":0},{"$f":"Eventograma!I35*'Desembolso-cronograma'!$I14","v":0},{"$f":"Eventograma!J35*'Desembolso-cronograma'!$I14","v":7632},{"$f":"Eventograma!K35*'Desembolso-cronograma'!$I14","v":0},{"$f":"Eventograma!L35*'Desembolso-cronograma'!$I14","v":0},{"$f":"Eventograma!M35*'Desembolso-cronograma'!$I14","v":0},{"$f":"Eventograma!N35*'Desembolso-cronograma'!$I14","v":0},{"$f":"Eventograma!O35*'Desembolso-cronograma'!$I14","v":0},{"$f":"Eventograma!P35*'Desembolso-cronograma'!$I14","v":0},{"$f":"Eventograma!Q35*'Desembolso-cronograma'!$I14","v":0},{"$f":"Eventograma!R35*'Desembolso-cronograma'!$I14","v":0},{"$f":"Eventograma!S35*'Desembolso-cronograma'!$I14","v":0},{"$f":"Eventograma!T35*'Desembolso-cronograma'!$I14","v":0},{"$f":"Eventograma!U35*'Desembolso-cronograma'!$I14","v":0},{"$f":"Eventograma!V35*'Desembolso-cronograma'!$I14","v":0}]
["1.3.4",{"$f":"VLOOKUP($A15,Orçamento!$A$3:$J$125,2,FALSE)","v":"SICRO"},{"$f":"VLOOKUP($A15,Orçamento!$A$3:$J$125,3,FALSE)","v":4915611},{"$f":"VLOOKUP($A15,Orçamento!$A$3:$J$125,4,FALSE)","v":"Recomposição de revestimento primário"},{"$f":"VLOOKUP($A15,Orçamento!$A$3:$J$125,5,FALSE)","v":"m³"},{"$f":"VLOOKUP($A15,Orçamento!$A$3:$J$125,6,FALSE)","v":180},{"$f":"VLOOKUP($A15,Orçamento!$A$3:$J$125,7,FALSE)","v":4.43},{"$f":"VLOOKUP($A15,Orçamento!$A$3:$J$125,8,FALSE)","v":797.4},{"$f":"VLOOKUP($A15,Orçamento!$A$3:$J$125,9,FALSE)","v":5.51},{"$f":"VLOOKUP($A15,Orçamento!$A$3:$J$125,10,FALSE)","v":991.8},null,{"$f":"Eventograma!H36*'Desembolso-cronograma'!$I15","v":0},{"$f":"Eventograma!I36*'Desembolso-cronograma'!$I15","v":0},{"$f":"Eventograma!J36*'Desembolso-cronograma'!$I15","v":0},{"$f":"Eventograma!K36*'Desembolso-cronograma'!$I15","v":0},{"$f":"Eventograma!L36*'Desembolso-cronograma'!$I15","v":0},{"$f":"Eventograma!M36*'Desembolso-cronograma'!$I15","v":0},{"$f":"Eventograma!N36*'Desembolso-cronograma'!$I15","v":0},{"$f":"Eventograma!O36*'Desembolso-cronograma'!$I15","v":991.8},{"$f":"Eventograma!P36*'Desembolso-cronograma'!$I15","v":0},{"$f":"Eventograma!Q36*'Desembolso-cronograma'!$I15","v":0},{"$f":"Eventograma!R36*'Desembolso-cronograma'!$I15","v":0},{"$f":"Eventograma!S36*'Desembolso-cronograma'!$I15","v":0},{"$f":"Eventograma!T36*'Desembolso-cronograma'!$I15","v":0},{"$f":"Eventograma!U36*'Desembolso-cronograma'!$I15","v":0},{"$f":"Eventograma!V36*'Desembolso-cronograma'!$I15","v":0}]
{"$rows_left_out":113}
{"sheet":"Transporte - memória","index":5,"n_rows":49,"n_cols":14,"rows_kept":49,"cut":false,"hidden":false,"merged":[]}
["Ítem","Base","Código","Descrição ","und","Volume Planilha","Quantidade Composição","Densidade","Peso Total (t)","Distância (km)","Transporte (txkm)"]
[1,null,null,"Transporte (estimativa - Serviços medidos a preços unitários)."]
["1.2","SICRO",5914374,"Revestimento Acesso","m³",{"$f":"Orçamento!F13","v":900},1.1000000000000001,{"$f":"1.5*1.25","v":1.875},{"$f":"H3*G3*F3","v":1856.25},1,{"$f":"I3*J3","v":1856.25}]
["1.3","SICRO",5914329,"Recomposição Revestimento Acesso","m³",{"$f":"Orçamento!F14","v":180},1.1000000000000001,{"$f":"1.5*1.25","v":1.875},371.25,1,371.25]
["1.4","SICRO",5914329,"Material Demolido","m³",{"$f":"Orçamento!F36","v":23.383749999999999},1,2.5,58.459374999999994,1,58.459374999999994]
["1.5","SICRO",5914374,"Valas de Montante","m³",{"$f":"Orçamento!F68-Orçamento!F69*1.1","v":1283.5999999999999},1,{"$f":"1.5*1.25","v":1.875},2406.75,1,2406.75]
["1.6","SICRO",5914374,"Pedra de mão enrocamento","m³",{"$f":"Orçamento!F77","v":1029},1.2,1.5,1852.1999999999998,102,188924.4]
["1.7","SICRO",5914374,"Bica corrida","m³",{"$f":"Orçamento!F84","v":1029},1.05,1.5,1620.6750000000002,102,165308.85]
["1.8","SICRO",5914374,"Valas de Jusante","m³",{"$f":"Orçamento!F95","v":976},1,{"$f":"1.5*1.25","v":1.875},1830,1,1830]
["1.9","SICRO",5914374,"Brita Geocélula","m³",{"$f":"Orçamento!F101","v":131.92499999999998},1.05,1.5,207.78187499999999,102,21193.751249999998]
["1.10","SICRO",5914374,"Pedra de mão dissipador","m³",{"$f":"Orçamento!F114*0.87","v":15.66},0.87,1.5,20.436299999999999,102,2084.5025999999998]
["1.11","SICRO",5914554,"Concreto 25MPa",null,46.583749999999995,1,2.4,111.80099999999999,0.1,11.180099999999999]
["1.11.1","SICRO",5914374,"Areia","m³",46.583749999999995,0.62995000000000001,1.5,{"$f":"H13*G13*F13","v":44.018149968749995},150,{"$f":"I13*J13","v":6602.7224953124996}]
["1.11.2","SICRO",5914374,"Brita","m³",46.583749999999995,0.68813000000000002,1.5,48.083513831249995,102,4904.5184107874993]
["1.11.3","SICRO",5914365,"Cimento","kg",46.583749999999995,340.98453999999998,1E-3,15.884338565224999,150,2382.6507847837497]
{"$rows_left_out":34}