{"text_format":"2","workbook":"xlsx","n_sheets":6,"sheets":["Orçamento","Eventograma","Composições","BDI","Desembolso-cronograma","Transporte - memória"],"not_rendered":{"charts":0,"images":0,"macros":0,"external_links":0,"defined_names":7,"comments":0,"pivot_tables":0},"unopened":[],"bounds":{"document_bytes":16777216,"sheet_cells":100000,"run_cost":"one","rows_first":2000,"rows_last":500,"rows_between":2000,"halvings":0,"cell_chars":16384,"cell_head_chars":4096},"cells_cut":0,"cells_raw":0,"read":"whole","date_system":"1900"}

{"sheet":"Orçamento","index":0,"n_rows":126,"n_cols":12,"rows_kept":126,"cut":false,"hidden":false,"merged":[[0,0,0,9]]}
["ORÇAMENTO PROJETO DE RECUPERAÇÃO - BARRAGEM PARANÃ"]
["ítem","Base","Código","Descrição","Und","Qtd","Custo Unitário (R$)","Custo Total (R$)","Preço Unitário (R$)","Preço Total (R$)"]
[1,null,null,"Serviços Preliminares e Administração Local",null,null,null,{"$f":"SUBTOTAL(9,H4:H15)","v":772771.08180000004},null,{"$f":"SUBTOTAL(9,J4:J15)","v":961743.6}]
["1.1.1","COMPOS.","0.001","Mobilizaçãos de Equipamentos e Pessoal","un.",1,{"$f":"Composições!G14","v":45458.25},{"$f":"G4*F4","v":45458.25},{"$f":"ROUND(G4*(1+BDI!$C$17),2)","v":56575.3},{"$f":"I4*F4","v":56575.3},null,{"$f":"SUM(J4:J8)","v":944809.79999999993}]
["1.1.2","COMPOS.","0.002","Desmobilização de Equipamentos e Pessoal","un.",1,{"$f":"Composições!G39","v":45458.25},{"$f":"G5*F5","v":45458.25},{"$f":"ROUND(G5*(1+BDI!$C$17),2)","v":56575.3},{"$f":"I5*F5","v":56575.3}]
["1.1.3","COMPOS.","0.003","Placa de obra","un.",1,{"$f":"Composições!G76","v":324.43579999999997},{"$f":"G6*F6","v":324.43579999999997},{"$f":"ROUND(G6*(1+BDI!$C$17),2)","v":403.78},{"$f":"I6*F6","v":403.78}]
["1.1.4","COMPOS.","0.004","Administração Local e Manutenção do Canteiro","mês",12,{"$f":"Composições!G103","v":45626.058000000005},{"$f":"F7*G7","v":547512.696},{"$f":"ROUND(G7*(1+BDI!$C$17),2)","v":56784.14},681409.67999999993]
["1.1.5","COMPOS.","0.005","Instalação de Canteiro de Obra","un.",1,{"$f":"Composições!G133","v":120401.05},{"$f":"F8*G8","v":120401.05},{"$f":"ROUND(G8*(1+BDI!$C$17),2)","v":149845.74},149845.74]
[]
["1.3",null,null,"Acessos",null,null,null,{"$f":"SUBTOTAL(9,H11:H14)","v":13616.4},null,{"$f":"SUBTOTAL(9,J11:J14)","v":16933.8}]
["1.3.1","SICRO",5502986,"Expurgo","m³",{"$f":"2000*3*0.25","v":1500},1.78,{"$f":"G11*F11","v":2670},{"$f":"ROUND(G11*(1+BDI!$C$17),2)","v":2.2200000000000002},{"$f":"I11*F11","v":3330.0000000000005},null,{"$f":"SUM(J11:J14)","v":16933.8}]
["1.3.2","SICRO",4011209,"Regularização do Subleito","m²",{"$f":"2000*3","v":6000},0.67,{"$f":"G12*F12","v":4020.0000000000005},{"$f":"ROUND(G12*(1+BDI!$C$17),2)","v":0.83},{"$f":"I12*F12","v":4980}]
["1.3.3","SICRO",4015612,"Revestimento Primário de Acesso","m³",{"$f":"F12*0.15","v":900},6.81,{"$f":"G13*F13","v":6129},{"$f":"ROUND(G13*(1+BDI!$C$17),2)","v":8.48},{"$f":"I13*F13","v":7632}]
["1.3.4","SICRO",4915611,"Recomposição de revestimento primário","m³",{"$f":"F13*20%","v":180},4.43,{"$f":"G14*F14","v":797.4},{"$f":"ROUND(G14*(1+BDI!$C$17),2)","v":5.51},{"$f":"I14*F14","v":991.8}]
[]
[2,null,null,"Vertedouro Complementar",null,null,null,{"$f":"SUBTOTAL(9,H17:H33)","v":207985.61208799999},null,{"$f":"SUBTOTAL(9,J17:J33)","v":258984.82088699998}]
["2.1",null,null,"Canal de Aproximação",null,null,null,{"$f":"SUBTOTAL(9,H18:H21)","v":120224.95},null,{"$f":"SUBTOTAL(9,J18:J21)","v":149714.625},null,{"$f":"SUM(J18:J20)","v":149714.625}]
["2.1.1","SICRO",5502139,"Escavação Comum","m³",27100,3.55,{"$f":"G18*F18","v":96205},{"$f":"ROUND(G18*(1+BDI!$C$17),2)","v":4.42},{"$f":"I18*F18","v":119782}]
["2.1.2","SICRO",2003864,"Esgotamento de água com bomba submersa","h",122,10.85,{"$f":"G19*F19","v":1323.7},{"$f":"ROUND(G19*(1+BDI!$C$17),2)","v":13.5},{"$f":"I19*F19","v":1647}]
["2.1.3","SICRO",4413942,"Espalhamento de solo em bota fora","m³",{"$f":"F18*50%*1.25","v":16937.5},1.34,{"$f":"G20*F20","v":22696.25},{"$f":"ROUND(G20*(1+BDI!$C$17),2)","v":1.67},{"$f":"I20*F20","v":28285.625}]
[]
["2.2",null,null,"Canal de Restituição",null,null,null,{"$f":"SUBTOTAL(9,H23:H26)","v":8421.4893749999992},null,{"$f":"SUBTOTAL(9,J23:J26)","v":10487.174887499999}]
["2.2.1","SICRO",5502139,"Escavaçao Comum","m³",{"$f":"1898.21","v":1898.21},{"$f":"G18","v":3.55},{"$f":"G23*F23","v":6738.6454999999996},{"$f":"ROUND(G23*(1+BDI!$C$17),2)","v":4.42},{"$f":"I23*F23","v":8390.0882000000001},null,{"$f":"SUM(J23:J25)","v":10487.174887499999}]
["2.2.2","SICRO",2003864,"Esgotamento de água com bomba submersa","h",8.58,{"$f":"G19","v":10.85},{"$f":"G24*F24","v":93.093000000000004},{"$f":"ROUND(G24*(1+BDI!$C$17),2)","v":13.5},{"$f":"I24*F24","v":115.83}]
["2.2.3","SICRO",4413942,"Espalhamento de solo em bota fora","m³",{"$f":"F23*50%*1.25","v":1186.3812499999999},1.34,{"$f":"G25*F25","v":1589.750875},{"$f":"ROUND(G25*(1+BDI!$C$17),2)","v":1.67},{"$f":"I25*F25","v":1981.2566874999998}]
[]
["2.3",null,null,"Dique de Proteção",null,null,null,{"$f":"SUBTOTAL(9,H28:H33)","v":79339.172712999993},null,{"$f":"SUBTOTAL(9,J28:J33)","v":98783.020999500004}]
["2.3.1","SICRO",5502139,"Escavação comum","m³",11318.65,{"$f":"G23","v":3.55},{"$f":"G28*F28","v":40181.207499999997},{"$f":"ROUND(G28*(1+BDI!$C$17),2)","v":4.42},{"$f":"I28*F28","v":50028.432999999997},null,{"$f":"SUM(J28:J32)","v":98783.020999500004}]
["2.3.2","SICRO",5502978,"Aterro Compactado","m³",6766.82,2.99,{"$f":"G29*F29","v":20232.791799999999},{"$f":"ROUND(G29*(1+BDI!$C$17),2)","v":3.72},{"$f":"I29*F29","v":25172.570400000001}]
["2.3.3","SICRO",5502986,"Expurgo","m³",{"$f":"F31*10%","v":372.17510000000004},{"$f":"G11","v":1.78},{"$f":"G30*F30","v":662.47167800000011},{"$f":"ROUND(G30*(1+BDI!$C$17),2)","v":2.2200000000000002},{"$f":"I30*F30","v":826.22872200000018}]
["2.3.4","SICRO",4016008,"Escavação de jazida ","m³",{"$f":"(F29/2)*1.1","v":3721.7510000000002},2.36,{"$f":"G31*F31","v":8783.3323600000003},{"$f":"ROUND(G31*(1+BDI!$C$17),2)","v":2.94},{"$f":"I31*F31","v":10941.94794}]
["2.3.5","SICRO",4413942,"Espalhamento de solo em bota fora","m³",{"$f":"F28*50%*1.25","v":7074.15625},{"$f":"G20","v":1.34},{"$f":"G32*F32","v":9479.3693750000002},{"$f":"ROUND(G32*(1+BDI!$C$17),2)","v":1.67},{"$f":"I32*F32","v":11813.840937499999}]
[]
[3,null,null,"Vertedouro Soleira Livre",null,null,null,{"$f":"SUBTOTAL(9,H35:H61)","v":453392.28663749999},null,{"$f":"SUBTOTAL(9,J35:J61)","v":564258.939075}]
["3.1",null,null,"Reparo na calha e sistema de drenagem",null,null,null,{"$f":"SUBTOTAL(9,H36:H45)","v":28831.231637499997},null,{"$f":"SUBTOTAL(9,J36:J45)","v":35880.729074999996},null,{"$f":"+SUM(J36:J44)","v":35880.729074999996}]
["3.1.1","SICRO",1600990,"Demolição de concreto armado","m³",{"$f":"16*1.3*0.25+55.95*1.3*0.25","v":23.383749999999999},392.17,{"$f":"G36*F36","v":9170.4052374999992},{"$f":"ROUND(G36*(1+BDI!$C$17),2)","v":488.08},{"$f":"I36*F36","v":11413.1407}]
["3.1.2","SICRO",3806402,"Limpeza em superfície de concreto ","m²",{"$f":"(16+57.25)*2*0.25","v":36.625},2.66,97.422499999999999,{"$f":"ROUND(G37*(1+BDI!$C$17),2)","v":3.31},121.22875000000001]
["3.1.3","SICRO",3108007,"Forma em Compensado Plastificado e=10mm","m²",{"$f":"1.3*0.5*8","v":5.2},111.51,{"$f":"G38*F38","v":579.85200000000009},{"$f":"ROUND(G38*(1+BDI!$C$17),2)","v":138.78},{"$f":"I38*F38","v":721.65600000000006}]
["3.1.4","SICRO",407819,"Armação em Aço CA-50","kg",477,9.2100000000000009,4393.17,{"$f":"ROUND(G39*(1+BDI!$C$17),2)","v":11.46},5466.42]
["3.1.5","SICRO",1116263,"Concreto Fck 25 Mpa","m³",{"$f":"F36","v":23.383749999999999},243.98,5705.1673249999994,{"$f":"ROUND(G40*(1+BDI!$C$17),2)","v":303.64999999999998},7100.4756874999994]
["3.1.6","SICRO",1107860,"Bombeamento de Concreto","m³",{"$f":"F40","v":23.383749999999999},28.93,676.49188749999996,{"$f":"ROUND(G41*(1+BDI!$C$17),2)","v":36},841.81499999999994]
["3.1.7","SICRO",1100657,"Adensamento de Concreto","m³",{"$f":"F41","v":23.383749999999999},2.4500000000000002,{"$f":"G42*F42","v":57.290187500000002},{"$f":"ROUND(G42*(1+BDI!$C$17),2)","v":3.05},{"$f":"I42*F42","v":71.320437499999997}]
["3.1.8","COMPOS.","0.006","Veda Juntas O-22","m",16,{"$f":"Composições!G155","v":90.0625},1441,{"$f":"ROUND(G43*(1+BDI!$C$17),2)","v":112.09},1793.44]
["3.1.9","SICRO",2003578,"Drenagem Interna","m",{"$f":"16+57.25","v":73.25},91.61,6710.4324999999999,{"$f":"ROUND(G44*(1+BDI!$C$17),2)","v":114.01},8351.2325000000001]
[]
["3.2",null,null,"Proteção Gabião",null,null,null,{"$f":"SUBTOTAL(9,H47:H51)","v":398418.01},null,{"$f":"SUBTOTAL(9,J47:J51)","v":495841.88},null,{"$f":"SUM(J47:J50)","v":495841.88}]
["3.2.1","SICRO",3108007,"Forma em Compensado Plastificado e=10mm","m²",{"$f":"9*0.2*60","v":108},111.51,12043.08,{"$f":"ROUND(G47*(1+BDI!$C$17),2)","v":138.78},14988.24]
["3.2.2","SICRO",1106109,"Concreto fck = 20 Mpa","m³",1541,219.35,338018.35,{"$f":"ROUND(G48*(1+BDI!$C$17),2)","v":272.99},420677.59]
["3.2.3","SICRO",1107860,"Bombeamento","m³",{"$f":"F48","v":1541},28.93,{"$f":"G49*F49","v":44581.13},{"$f":"ROUND(G49*(1+BDI!$C$17),2)","v":36},{"$f":"I49*F49","v":55476}]
["3.2.4","SICRO",1100657,"Adensamento de Concreto","m³",{"$f":"F49","v":1541},2.4500000000000002,{"$f":"G50*F50","v":3775.4500000000003},{"$f":"ROUND(G50*(1+BDI!$C$17),2)","v":3.05},{"$f":"I50*F50","v":4700.0499999999993}]
[]
["3.3",null,null,"Reparos estruturas de concreto",null,null,null,{"$f":"SUBTOTAL(9,H53:H61)","v":26143.044999999998},null,{"$f":"SUBTOTAL(9,J53:J61)","v":32536.329999999998},null,{"$f":"SUM(J53:J60)","v":32536.329999999998}]
["3.3.1","SICRO",3806413,"Apicoamento","m²",50,9.2100000000000009,{"$f":"G53*F53","v":460.50000000000006},{"$f":"ROUND(G53*(1+BDI!$C$17),2)","v":11.46},{"$f":"I53*F53","v":573}]
["3.3.2","SICRO",3806402,"Limpeza em superfície de concreto ","m²",{"$f":"F53","v":50},2.66,133,{"$f":"ROUND(G54*(1+BDI!$C$17),2)","v":3.31},165.5]
["3.3.3","COMPOS.","0.006","Veda Juntas O-22","m",30,{"$f":"Composições!G155","v":90.0625},2701.875,{"$f":"ROUND(G55*(1+BDI!$C$17),2)","v":112.09},3362.7000000000003]
["3.3.4","SICRO",2407972,"Adesivo estrutural à base de resina epóxi","kg",{"$f":"F54*0.8","v":40},55.17,2206.8000000000002,{"$f":"ROUND(G56*(1+BDI!$C$17),2)","v":68.66},2746.3999999999996]
["3.3.5","SICRO",1108060,"Argamassa polimérica com microssílica","m³",3,382.96,1148.8799999999999,{"$f":"ROUND(G57*(1+BDI!$C$17),2)","v":476.61},1429.83]
["3.3.6","SICRO",1109667,"Argamassa Dry Pack","m³",3,364.36,1093.08,{"$f":"ROUND(G58*(1+BDI!$C$17),2)","v":453.47},1360.41]
["3.3.7","SICRO",1108056,"Microconcreto autoadensável ","m³",9,1823.22,16408.98,{"$f":"ROUND(G59*(1+BDI!$C$17),2)","v":2269.1},20421.899999999998]
["3.3.8","SICRO",3806415,"Demolição controlada ","m³",3,663.31,1989.9299999999998,{"$f":"ROUND(G60*(1+BDI!$C$17),2)","v":825.53},2476.59]
[]
[4,null,null,"Barragem de Terra",null,null,null,{"$f":"SUBTOTAL(9,H63:H115)","v":3030938.3232643143},null,{"$f":"SUBTOTAL(9,J63:J115)","v":3772419.794206996}]
["4.1",null,null,"Montante",null,null,null,{"$f":"SUBTOTAL(9,H64:H78)","v":1710065.4573833141},null,{"$f":"SUBTOTAL(9,J64:J78)","v":2128275.8231899953},null,{"$f":"SUM(J64:J77)","v":2128275.8231899953}]
["4.2.1","SICRO",5502985,"Limpeza da camada vegetal","m²",16840,0.31,{"$f":"G64*F64","v":5220.3999999999996},{"$f":"ROUND(G64*(1+BDI!$C$17),2)","v":0.39},{"$f":"I64*F64","v":6567.6}]
["4.2.2","SINAPI",98527,"Remoção de raízes e cupinzeiros","und",{"$f":"ROUNDUP(F64/500,0)","v":34},133.78,{"$f":"G65*F65","v":4548.5200000000004},{"$f":"ROUND(G65*(1+BDI!$C$17),2)","v":166.5},{"$f":"I65*F65","v":5661}]
["4.2.3","SICRO",4915625,"Recomposição em Solo Cimento","m³",{"$f":"F65*1+F64*0.1","v":1718},27.05,{"$f":"G66*F66","v":46471.9},{"$f":"ROUND(G66*(1+BDI!$C$17),2)","v":33.67},{"$f":"I66*F66","v":57845.060000000005}]
["4.2.5","SICRO",4805754,"Compactação Manual","m³",{"$f":"F66","v":1718},4.93,{"$f":"G67*F67","v":8469.74},{"$f":"ROUND(G67*(1+BDI!$C$17),2)","v":6.14},{"$f":"I67*F67","v":10548.519999999999}]
["4.2.6","SICRO",4805757,"Escavação mecânica de vala","m³",2058,3.95,{"$f":"G68*F68","v":8129.1},{"$f":"ROUND(G68*(1+BDI!$C$17),2)","v":4.92},{"$f":"I68*F68","v":10125.36}]
["4.2.7","SICRO",2004505,"Reaterro e compactação em vala","m³",704,17.11,{"$f":"G69*F69","v":12045.439999999999},{"$f":"ROUND(G69*(1+BDI!$C$17),2)","v":21.29},{"$f":"I69*F69","v":14988.16}]
["4.2.8","SICRO",2003867,"Aplicação de geotextil","m²",14765,14.11,208334.15,{"$f":"ROUND(G70*(1+BDI!$C$17),2)","v":17.559999999999999},259273.4]
["4.2.9","SICRO",407820,"Armação em aço CA-60 ","kg",{"$f":"0.55*0.109*3*F70","v":2655.4852500000002},9.17,{"$f":"G71*F71","v":24350.799742500003},{"$f":"ROUND(G71*(1+BDI!$C$17),2)","v":11.41},{"$f":"I71*F71","v":30299.086702500001}]
["4.2.10","SICRO",1516303,"Geocélula de PEAD","m²",{"$f":"F70","v":14765},36.409999999999997,537593.64999999991,{"$f":"ROUND(G72*(1+BDI!$C$17),2)","v":45.31},669002.15]
["4.2.11","SICRO",2008091,"Tubo PVC de ancoragem ","m",1759,78.08,137342.72,{"$f":"ROUND(G73*(1+BDI!$C$17),2)","v":97.17},170922.03]
["4.2.12","SICRO",1106109,"Concreto fck = 20 Mpa","m³",{"$f":"932.3+422+PI()*(0.075^2)*F73+F72*0.075","v":2492.7590958118626},219.85,{"$f":"G74*F74","v":548033.08721423801},{"$f":"ROUND(G74*(1+BDI!$C$17),2)","v":273.62},{"$f":"I74*F74","v":682068.74379604182}]
["4.2.13","SICRO",1107860,"Bombeamento","m³",{"$f":"F74","v":2492.7590958118626},28.93,{"$f":"G75*F75","v":72115.520641837182},{"$f":"ROUND(G75*(1+BDI!$C$17),2)","v":36},{"$f":"I75*F75","v":89739.327449227058}]
["4.2.14","SICRO",1100657,"Adensamento de Concreto","m³",{"$f":"F75","v":2492.7590958118626},2.4500000000000002,{"$f":"G76*F76","v":6107.2597847390634},{"$f":"ROUND(G76*(1+BDI!$C$17),2)","v":3.05},{"$f":"I76*F76","v":7602.9152422261805}]
["4.2.15","SICRO",1505877,"Enrocamento de Proteção","m³",1029,88.73,{"$f":"G77*F77","v":91303.17},{"$f":"ROUND(G77*(1+BDI!$C$17),2)","v":110.43},{"$f":"I77*F77","v":113632.47}]
[]
["4.3",null,null,"Crista",null,null,null,{"$f":"SUBTOTAL(9,H80:H90)","v":324432.07713100006},null,{"$f":"SUBTOTAL(9,J80:J90)","v":403810.92901699996},null,{"$f":"SUM(J80:J89)","v":403810.92901699996}]
["4.3.1","SICRO",5502985,"Limpeza da camada vegetal","m²",7032,0.31,{"$f":"G80*F80","v":2179.92},{"$f":"ROUND(G80*(1+BDI!$C$17),2)","v":0.39},{"$f":"I80*F80","v":2742.48}]
["4.3.2","SINAPI",98527,"Remoção de raízes e cupinzeiros","und",{"$f":"ROUNDUP(F80/500,0)","v":15},133.78,2006.7,{"$f":"ROUND(G81*(1+BDI!$C$17),2)","v":166.5},2497.5]
["4.3.3","SICRO",4915625,"Recomposição em Solo Cimento","m³",{"$f":"F81*1","v":15},27.05,405.75,{"$f":"ROUND(G82*(1+BDI!$C$17),2)","v":33.67},505.05]
["4.3.5","SICRO",4805754,"Compactação Manual","m³",{"$f":"F82","v":15},4.93,73.949999999999989,{"$f":"ROUND(G83*(1+BDI!$C$17),2)","v":6.14},92.1]
["4.3.6","SICRO",903845,"Bica Corrida","m³",1029,73.98,76125.42,{"$f":"ROUND(G84*(1+BDI!$C$17),2)","v":92.07},94740.03]
["4.3.7","SICRO",2003939,"Meio fio de concreto","m",1759,45.06,79260.540000000008,{"$f":"ROUND(G85*(1+BDI!$C$17),2)","v":56.08},98644.72]
["4.3.8","SICRO",3713826,"Barreira simples tipo New Jersey","m",1759,46.72,82180.479999999996,{"$f":"ROUND(G86*(1+BDI!$C$17),2)","v":58.15},102285.84999999999]
["4.3.9","SICRO",1106109,"Concreto fck = 20 Mpa","m³",{"$f":"F86*0.1917","v":337.20030000000003},219.85,74133.485955000011,{"$f":"ROUND(G87*(1+BDI!$C$17),2)","v":273.62},92264.746086000014]
["4.3.10","SICRO",1106051,"Lançamento livre de concreto","m³",{"$f":"F87","v":337.20030000000003},21.47,7239.6904410000006,{"$f":"ROUND(G88*(1+BDI!$C$17),2)","v":26.72},9009.9920160000001]
["4.3.11","SICRO",1100657,"Adensamento de Concreto","m³",{"$f":"F88","v":337.20030000000003},2.4500000000000002,{"$f":"G89*F89","v":826.14073500000018},{"$f":"ROUND(G89*(1+BDI!$C$17),2)","v":3.05},{"$f":"I89*F89","v":1028.4609150000001}]
[]
["4.4",null,null,"Jusante",null,null,null,{"$f":"SUBTOTAL(9,H92:H104)","v":813278.44874999998},null,{"$f":"SUBTOTAL(9,J92:J104)","v":1012375.7620000001},null,{"$f":"SUM(J92:J103)","v":1012375.7620000001}]
["4.4.1","SICRO",5502985,"Limpeza da camada vegetal","m²",65800,0.31,{"$f":"G92*F92","v":20398},{"$f":"ROUND(G92*(1+BDI!$C$17),2)","v":0.39},{"$f":"I92*F92","v":25662}]
["4.4.2","SINAPI",98527,"Remoção de raízes e cupinzeiros","und",{"$f":"ROUNDUP(F92/500,0)","v":132},133.78,17658.96,{"$f":"ROUND(G93*(1+BDI!$C$17),2)","v":166.5},21978]
["4.4.3","SICRO",4915774,"Recomposição de erosão ","m³",{"$f":"F93+F92*0.1","v":6712},11.95,80208.399999999994,{"$f":"ROUND(G94*(1+BDI!$C$17),2)","v":14.87},99807.439999999988]
["4.4.4","SICRO",4805757,"Escavação mecânica de vala ","m³",{"$f":"515+461","v":976},3.95,3855.2000000000003,{"$f":"ROUND(G95*(1+BDI!$C$17),2)","v":4.92},4801.92]
["4.4.5","SICRO",1106109,"Concreto fck = 20 Mpa","m³",{"$f":"5759*0.075","v":431.92500000000001},219.85,94958.711249999993,{"$f":"ROUND(G96*(1+BDI!$C$17),2)","v":273.62},118183.31850000001]
["4.4.6","SICRO",1107860,"Bombeamento","m³",{"$f":"F96","v":431.92500000000001},28.93,12495.590250000001,{"$f":"ROUND(G97*(1+BDI!$C$17),2)","v":36},15549.300000000001]
["4.4.7","SICRO",1100657,"Adensamento de Concreto","m³",{"$f":"F97","v":431.92500000000001},2.4500000000000002,1058.2162500000002,{"$f":"ROUND(G98*(1+BDI!$C$17),2)","v":3.05},1317.3712499999999]
["4.4.8","SICRO",4915625,"Recomposição em Solo Cimento","m³",{"$f":"35818*0.075","v":2686.35},27.05,72665.767500000002,{"$f":"ROUND(G99*(1+BDI!$C$17),2)","v":33.67},90449.404500000004]
["4.4.10","SICRO",4805754,"Compactação Manual","m³",{"$f":"F99","v":2686.35},4.93,13243.705499999998,{"$f":"ROUND(G100*(1+BDI!$C$17),2)","v":6.14},16494.188999999998]
["4.4.11","SICRO",2003850,"Lastro de Brita","m³",{"$f":"1759*0.075","v":131.92499999999998},81.760000000000005,{"$f":"G101*F101","v":10786.188},{"$f":"ROUND(G101*(1+BDI!$C$17),2)","v":101.75},{"$f":"I101*F101","v":13423.368749999998}]
["4.4.12","SICRO",2003947,"Meio fio de concreto","m",1759,14.13,{"$f":"G102*F102","v":24854.670000000002},{"$f":"ROUND(G102*(1+BDI!$C$17),2)","v":17.59},{"$f":"I102*F102","v":30940.81}]
["4.4.13","SICRO",4915673,"Revestimento vegetal com grama em mudas (superficies inclinadas)","m²",43336,10.64,{"$f":"G103*F103","v":461095.04000000004},{"$f":"ROUND(G103*(1+BDI!$C$17),2)","v":13.24},{"$f":"I103*F103","v":573768.64}]
[]
["4.5",null,null,"Drenagem Superficial",null,null,null,{"$f":"SUBTOTAL(9,H106:H115)","v":183162.34},null,{"$f":"SUBTOTAL(9,J106:J115)","v":227957.28},null,{"$f":"SUM(J106:J114)","v":227957.28}]
["4.5.1","SICRO",4915711,"Limpeza de Descida d'água","m",482,1.06,{"$f":"G106*F106","v":510.92},{"$f":"ROUND(G106*(1+BDI!$C$17),2)","v":1.32},{"$f":"I106*F106","v":636.24}]
["4.5.2","SICRO",2003353,"Valeta trapezoidal de concreto ","m",1848,38.68,{"$f":"G107*F107","v":71480.639999999999},{"$f":"ROUND(G107*(1+BDI!$C$17),2)","v":48.14},{"$f":"I107*F107","v":88962.72}]
["4.5.3","SICRO",2003477,"Caixa Coletora ","und",18,2665.19,47973.42,{"$f":"ROUND(G108*(1+BDI!$C$17),2)","v":3316.98},59705.64]
["4.5.4","SICRO",804021,"BSTC 600mm","m",24,227.47,5459.28,{"$f":"ROUND(G109*(1+BDI!$C$17),2)","v":283.10000000000002},6794.4000000000005]
["4.5.5","SICRO",804037,"Corpo BSTC 1000mm","m",20,531.45000000000005,{"$f":"G110*F110","v":10629},{"$f":"ROUND(G110*(1+BDI!$C$17),2)","v":661.42},{"$f":"I110*F110","v":13228.4}]
["4.5.6","SICRO",804393,"Boca BSTC 1000mm","und",2,1836.7,{"$f":"G111*F111","v":3673.4},{"$f":"ROUND(G111*(1+BDI!$C$17),2)","v":2285.87},{"$f":"I111*F111","v":4571.74}]
["4.5.7","SICRO",804189,"Corpo BDTC 1000mm","m",20,1023.62,{"$f":"G112*F112","v":20472.400000000001},{"$f":"ROUND(G112*(1+BDI!$C$17),2)","v":1273.95},{"$f":"I112*F112","v":25479}]
["4.5.8","SICRO",804417,"Boca BDTC 1000mm","und",2,2554.09,{"$f":"G113*F113","v":5108.18},{"$f":"ROUND(G113*(1+BDI!$C$17),2)","v":3178.71},{"$f":"I113*F113","v":6357.42}]
["4.5.9","SICRO",2003453,"Dissipador de Energia","und",18,991.95,17855.100000000002,{"$f":"ROUND(G114*(1+BDI!$C$17),2)","v":1234.54},22221.72]
[]
[5,null,null,"Momento de Transporte",null,null,null,{"$f":"SUBTOTAL(9,H117:H124)","v":978774.08386030269},null,{"$f":"SUBTOTAL(9,J117:J124)","v":1218700.0309231761}]
["5.1","SICRO",5914329,"Transporte com caminhão basculante de 6 m³","txkm",{"$f":"SUMIF('Transporte - memória'!$C$2:$C$84,Orçamento!C117,'Transporte - memória'!$K$2:$K$84)","v":429.70937500000002},0.6,{"$f":"G117*F117","v":257.825625},{"$f":"ROUND(G117*(1+BDI!$C$17),2)","v":0.75},{"$f":"I117*F117","v":322.28203125000005},null,{"$f":"SUM(J117:J123)","v":1218700.0309231761}]
["5.2","SICRO",5914365,"Transporte de cimento a granel com caminhão silo 30 m³ ","txkm",{"$f":"SUMIF('Transporte - memória'!$C$2:$C$84,Orçamento!C118,'Transporte - memória'!$K$2:$K$84)","v":212313.31407912378},0.41,87048.458772440747,{"$f":"ROUND(G118*(1+BDI!$C$17),2)","v":0.51},108279.79018035313]
["5.3","SICRO",5914374,"Transporte com caminhão basculante de 10 m³ ","txkm",{"$f":"SUMIF('Transporte - memória'!$C$3:$C$49,Orçamento!C119,'Transporte - memória'!$K$3:$K$49)","v":1620483.7990248003},0.49,794037.06152215216,{"$f":"ROUND(G119*(1+BDI!$C$17),2)","v":0.61},988495.1174051282]
["5.4","SICRO",5914464,"Transporte com caminhão carroceria de 15 t ","txkm",{"$f":"SUMIF('Transporte - memória'!$C$2:$C$84,Orçamento!C120,'Transporte - memória'!$K$2:$K$84)","v":5909.2150769587497},0.49,2895.5153877097873,{"$f":"ROUND(G120*(1+BDI!$C$17),2)","v":0.61},3604.6211969448373]
["5.5","SICRO",5915323,"Transporte com caminhão carroceria de 5 t ","txkm",{"$f":"SUMIF('Transporte - memória'!$C$2:$C$84,Orçamento!C121,'Transporte - memória'!$K$2:$K$84)","v":85474.648350000003},0.84,71798.704614000002,{"$f":"ROUND(G121*(1+BDI!$C$17),2)","v":1.05},89748.380767500013]
["5.6","SICRO",5914554,"Transporte com caminhão betoneira ","txkm",{"$f":"SUMIF('Transporte - memória'!$C$2:$C$84,Orçamento!C122,'Transporte - memória'!$K$2:$K$84)","v":1164.1113},0.43,500.567859,{"$f":"ROUND(G122*(1+BDI!$C$17),2)","v":0.54},628.62010200000009]
["5.7","SICRO",5914599,"Transporte com caminhão carroceria com guindauto de 20 t.m","txkm",{"$f":"SUMIF('Transporte - memória'!$C$2:$C$84,Orçamento!C123,'Transporte - memória'!$K$2:$K$84)","v":17371.835999999999},1.28,22235.950079999999,{"$f":"ROUND(G123*(1+BDI!$C$17),2)","v":1.59},27621.219239999999]
[]
[]
[{"$nulls":6},"TOTAL",{"$f":"SUBTOTAL(9,H3:H125)","v":5443861.3876501163},null,{"$f":"SUBTOTAL(9,J3:J125)","v":6776107.1850921726},null,{"$f":"SUM(L4:L117)","v":6776107.1850921717}]

{"sheet":"Eventograma","index":1,"n_rows":200,"n_cols":24,"rows_kept":200,"cut":false,"hidden":true,"merged":[]}
["ORÇAMENTO PROJETO DE RECUPERAÇÃO - BARRAGEM PARANÃ",{"$nulls":5},"BDI",{"$f":"126.023944549464%-1","v":0.26023944549463995},"2020-04-01","2020-05-01","2020-06-01","2020-07-01","2020-08-01","2020-09-01","2020-10-01","2020-11-01","2020-12-01","2021-01-01","2021-02-01","2021-03-01","2021-04-01","2021-05-01"]
["ítem","Base","Código","Descrição","Und","Qtd",null,"M1","M2","M3","M4","M5","M6","M7","M8","M9","M10","M11","M12","M13","M14","M15"]
[1,null,null,"Serviços Preliminares",null,null,null,0,0,0,0,0,0,0,0,0,0,0,0,0,0,0]
["1.1",null,null,"Mobilizações e Desmobilizações",null,null,null,0,0,0,0,0,0,0,0,0,0,0,0,0,0,0]
["1.1.1",{"$f":"VLOOKUP($A5,Orçamento!$A$3:$J$126,2,FALSE)","v":"COMPOS."},{"$f":"VLOOKUP($A5,Orçamento!$A$3:$J$126,3,FALSE)","v":"0.001"},{"$f":"VLOOKUP($A5,Orçamento!$A$3:$J$126,4,FALSE)","v":"Mobilizaçãos de Equipamentos e Pessoal"},{"$f":"VLOOKUP($A5,Orçamento!$A$3:$J$126,5,FALSE)","v":"un."},{"$f":"VLOOKUP($A5,Orçamento!$A$3:$J$126,6,FALSE)","v":1},null,1,0,0,0,0,0,0,0,0,0,0,0,0,0,0,null,{"$f":"F5-SUM(H5:V5)","v":0}]
["1.1.2",{"$f":"VLOOKUP($A6,Orçamento!$A$3:$J$126,2,FALSE)","v":"COMPOS."},{"$f":"VLOOKUP($A6,Orçamento!$A$3:$J$126,3,FALSE)","v":"0.002"},{"$f":"VLOOKUP($A6,Orçamento!$A$3:$J$126,4,FALSE)","v":"Desmobilização de Equipamentos e Pessoal"},{"$f":"VLOOKUP($A6,Orçamento!$A$3:$J$126,5,FALSE)","v":"un."},{"$f":"VLOOKUP($A6,Orçamento!$A$3:$J$126,6,FALSE)","v":1},null,0,0,0,0,0,0,0,0,0,0,0,0,0,0,1,null,0]
[{"$nulls":5},{"$f":"Orçamento!#REF!","v":{"$error":"#REF!"}},{"$nulls":17},{"$error":"#REF!"}]
["1.2",null,null,"Estruturas de Canteiro",null,{"$f":"Orçamento!#REF!","v":{"$error":"#REF!"}},null,0,0,0,0,0,0,0,0,0,0,0,0,0,0,0,null,{"$error":"#REF!"}]
["1.2.1",{"$f":"VLOOKUP($A9,Orçamento!$A$3:$J$126,2,FALSE)","v":{"$error":"#N/A"}},{"$f":"VLOOKUP($A9,Orçamento!$A$3:$J$126,3,FALSE)","v":{"$error":"#N/A"}},{"$f":"VLOOKUP($A9,Orçamento!$A$3:$J$126,4,FALSE)","v":{"$error":"#N/A"}},{"$f":"VLOOKUP($A9,Orçamento!$A$3:$J$126,5,FALSE)","v":{"$error":"#N/A"}},{"$f":"VLOOKUP($A9,Orçamento!$A$3:$J$126,6,FALSE)","v":{"$error":"#N/A"}},null,280.61,0,0,0,0,0,0,0,0,0,0,0,0,0,0,null,{"$error":"#N/A"}]
["1.2.2",{"$f":"VLOOKUP($A10,Orçamento!$A$3:$J$126,2,FALSE)","v":{"$error":"#N/A"}},{"$f":"VLOOKUP($A10,Orçamento!$A$3:$J$126,3,FALSE)","v":{"$error":"#N/A"}},{"$f":"VLOOKUP($A10,Orçamento!$A$3:$J$126,4,FALSE)","v":{"$error":"#N/A"}},{"$f":"VLOOKUP($A10,Orçamento!$A$3:$J$126,5,FALSE)","v":{"$error":"#N/A"}},{"$f":"VLOOKUP($A10,Orçamento!$A$3:$J$126,6,FALSE)","v":{"$error":"#N/A"}},null,1122.42,0,0,0,0,0,0,0,0,0,0,0,0,0,0,null,{"$error":"#N/A"}]
["1.2.3",{"$f":"VLOOKUP($A11,Orçamento!$A$3:$J$126,2,FALSE)","v":{"$error":"#N/A"}},{"$f":"VLOOKUP($A11,Orçamento!$A$3:$J$126,3,FALSE)","v":{"$error":"#N/A"}},{"$f":"VLOOKUP($A11,Orçamento!$A$3:$J$126,4,FALSE)","v":{"$error":"#N/A"}},{"$f":"VLOOKUP($A11,Orçamento!$A$3:$J$126,5,FALSE)","v":{"$error":"#N/A"}},{"$f":"VLOOKUP($A11,Orçamento!$A$3:$J$126,6,FALSE)","v":{"$error":"#N/A"}},null,112.24,0,0,0,0,0,0,0,0,0,0,0,0,0,0,null,{"$error":"#N/A"}]
["1.2.4",{"$f":"VLOOKUP($A12,Orçamento!$A$3:$J$126,2,FALSE)","v":{"$error":"#N/A"}},{"$f":"VLOOKUP($A12,Orçamento!$A$3:$J$126,3,FALSE)","v":{"$error":"#N/A"}},{"$f":"VLOOKUP($A12,Orçamento!$A$3:$J$126,4,FALSE)","v":{"$error":"#N/A"}},{"$f":"VLOOKUP($A12,Orçamento!$A$3:$J$126,5,FALSE)","v":{"$error":"#N/A"}},{"$f":"VLOOKUP($A12,Orçamento!$A$3:$J$126,6,FALSE)","v":{"$error":"#N/A"}},null,0,59.26,0,0,0,0,0,0,0,0,0,0,0,0,0,null,{"$error":"#N/A"}]
["1.2.5",{"$f":"VLOOKUP($A13,Orçamento!$A$3:$J$126,2,FALSE)","v":{"$error":"#N/A"}},{"$f":"VLOOKUP($A13,Orçamento!$A$3:$J$126,3,FALSE)","v":{"$error":"#N/A"}},{"$f":"VLOOKUP($A13,Orçamento!$A$3:$J$126,4,FALSE)","v":{"$error":"#N/A"}},{"$f":"VLOOKUP($A13,Orçamento!$A$3:$J$126,5,FALSE)","v":{"$error":"#N/A"}},{"$f":"VLOOKUP($A13,Orçamento!$A$3:$J$126,6,FALSE)","v":{"$error":"#N/A"}},null,0,0,89.89,0,0,0,0,0,0,0,0,0,0,0,0,null,{"$error":"#N/A"}]
["1.2.6",{"$f":"VLOOKUP($A14,Orçamento!$A$3:$J$126,2,FALSE)","v":{"$error":"#N/A"}},{"$f":"VLOOKUP($A14,Orçamento!$A$3:$J$126,3,FALSE)","v":{"$error":"#N/A"}},{"$f":"VLOOKUP($A14,Orçamento!$A$3:$J$126,4,FALSE)","v":{"$error":"#N/A"}},{"$f":"VLOOKUP($A14,Orçamento!$A$3:$J$126,5,FALSE)","v":{"$error":"#N/A"}},{"$f":"VLOOKUP($A14,Orçamento!$A$3:$J$126,6,FALSE)","v":{"$error":"#N/A"}},null,0,0,84.79,0,0,0,0,0,0,0,0,0,0,0,0,null,{"$error":"#N/A"}]
["1.2.7",{"$f":"VLOOKUP($A15,Orçamento!$A$3:$J$126,2,FALSE)","v":{"$error":"#N/A"}},{"$f":"VLOOKUP($A15,Orçamento!$A$3:$J$126,3,FALSE)","v":{"$error":"#N/A"}},{"$f":"VLOOKUP($A15,Orçamento!$A$3:$J$126,4,FALSE)","v":{"$error":"#N/A"}},{"$f":"VLOOKUP($A15,Orçamento!$A$3:$J$126,5,FALSE)","v":{"$error":"#N/A"}},{"$f":"VLOOKUP($A15,Orçamento!$A$3:$J$126,6,FALSE)","v":{"$error":"#N/A"}},null,0,88.65,0,0,0,0,0,0,0,0,0,0,0,0,0,null,{"$error":"#N/A"}]
["1.2.8",{"$f":"VLOOKUP($A16,Orçamento!$A$3:$J$126,2,FALSE)","v":{"$error":"#N/A"}},{"$f":"VLOOKUP($A16,Orçamento!$A$3:$J$126,3,FALSE)","v":{"$error":"#N/A"}},{"$f":"VLOOKUP($A16,Orçamento!$A$3:$J$126,4,FALSE)","v":{"$error":"#N/A"}},{"$f":"VLOOKUP($A16,Orçamento!$A$3:$J$126,5,FALSE)","v":{"$error":"#N/A"}},{"$f":"VLOOKUP($A16,Orçamento!$A$3:$J$126,6,FALSE)","v":{"$error":"#N/A"}},null,0,54.81,54.81,0,0,0,0,0,0,0,0,0,0,0,0,null,{"$error":"#N/A"}]
["1.2.9",{"$f":"VLOOKUP($A17,Orçamento!$A$3:$J$126,2,FALSE)","v":{"$error":"#N/A"}},{"$f":"VLOOKUP($A17,Orçamento!$A$3:$J$126,3,FALSE)","v":{"$error":"#N/A"}},{"$f":"VLOOKUP($A17,Orçamento!$A$3:$J$126,4,FALSE)","v":{"$error":"#N/A"}},{"$f":"VLOOKUP($A17,Orçamento!$A$3:$J$126,5,FALSE)","v":{"$error":"#N/A"}},{"$f":"VLOOKUP($A17,Orçamento!$A$3:$J$126,6,FALSE)","v":{"$error":"#N/A"}},null,0,31.454999999999998,31.454999999999998,0,0,0,0,0,0,0,0,0,0,0,0,null,{"$error":"#N/A"}]
["1.2.10",{"$f":"VLOOKUP($A18,Orçamento!$A$3:$J$126,2,FALSE)","v":{"$error":"#N/A"}},{"$f":"VLOOKUP($A18,Orçamento!$A$3:$J$126,3,FALSE)","v":{"$error":"#N/A"}},{"$f":"VLOOKUP($A18,Orçamento!$A$3:$J$126,4,FALSE)","v":{"$error":"#N/A"}},{"$f":"VLOOKUP($A18,Orçamento!$A$3:$J$126,5,FALSE)","v":{"$error":"#N/A"}},{"$f":"VLOOKUP($A18,Orçamento!$A$3:$J$126,6,FALSE)","v":{"$error":"#N/A"}},null,0,0,18.100000000000001,0,0,0,0,0,0,0,0,0,0,0,0,null,{"$error":"#N/A"}]
["1.2.11",{"$f":"VLOOKUP($A19,Orçamento!$A$3:$J$126,2,FALSE)","v":{"$error":"#N/A"}},{"$f":"VLOOKUP($A19,Orçamento!$A$3:$J$126,3,FALSE)","v":{"$error":"#N/A"}},{"$f":"VLOOKUP($A19,Orçamento!$A$3:$J$126,4,FALSE)","v":{"$error":"#N/A"}},{"$f":"VLOOKUP($A19,Orçamento!$A$3:$J$126,5,FALSE)","v":{"$error":"#N/A"}},{"$f":"VLOOKUP($A19,Orçamento!$A$3:$J$126,6,FALSE)","v":{"$error":"#N/A"}},null,0,0,14.86,0,0,0,0,0,0,0,0,0,0,0,0,null,{"$error":"#N/A"}]
["1.2.12",{"$f":"VLOOKUP($A20,Orçamento!$A$3:$J$126,2,FALSE)","v":{"$error":"#N/A"}},{"$f":"VLOOKUP($A20,Orçamento!$A$3:$J$126,3,FALSE)","v":{"$error":"#N/A"}},{"$f":"VLOOKUP($A20,Orçamento!$A$3:$J$126,4,FALSE)","v":{"$error":"#N/A"}},{"$f":"VLOOKUP($A20,Orçamento!$A$3:$J$126,5,FALSE)","v":{"$error":"#N/A"}},{"$f":"VLOOKUP($A20,Orçamento!$A$3:$J$126,6,FALSE)","v":{"$error":"#N/A"}},null,0,0,1,0,0,0,0,0,0,0,0,0,0,0,0,null,{"$error":"#N/A"}]
["1.2.13",{"$f":"VLOOKUP($A21,Orçamento!$A$3:$J$126,2,FALSE)","v":{"$error":"#N/A"}},{"$f":"VLOOKUP($A21,Orçamento!$A$3:$J$126,3,FALSE)","v":{"$error":"#N/A"}},{"$f":"VLOOKUP($A21,Orçamento!$A$3:$J$126,4,FALSE)","v":{"$error":"#N/A"}},{"$f":"VLOOKUP($A21,Orçamento!$A$3:$J$126,5,FALSE)","v":{"$error":"#N/A"}},{"$f":"VLOOKUP($A21,Orçamento!$A$3:$J$126,6,FALSE)","v":{"$error":"#N/A"}},null,0,0,11.17,0,0,0,0,0,0,0,0,0,0,0,0,null,{"$error":"#N/A"}]
["1.2.14",{"$f":"VLOOKUP($A22,Orçamento!$A$3:$J$126,2,FALSE)","v":{"$error":"#N/A"}},{"$f":"VLOOKUP($A22,Orçamento!$A$3:$J$126,3,FALSE)","v":{"$error":"#N/A"}},{"$f":"VLOOKUP($A22,Orçamento!$A$3:$J$126,4,FALSE)","v":{"$error":"#N/A"}},{"$f":"VLOOKUP($A22,Orçamento!$A$3:$J$126,5,FALSE)","v":{"$error":"#N/A"}},{"$f":"VLOOKUP($A22,Orçamento!$A$3:$J$126,6,FALSE)","v":{"$error":"#N/A"}},null,0,6.1,0,0,0,0,0,0,0,0,0,0,0,0,0,null,{"$error":"#N/A"}]
["1.2.15",{"$f":"VLOOKUP($A23,Orçamento!$A$3:$J$126,2,FALSE)","v":{"$error":"#N/A"}},{"$f":"VLOOKUP($A23,Orçamento!$A$3:$J$126,3,FALSE)","v":{"$error":"#N/A"}},{"$f":"VLOOKUP($A23,Orçamento!$A$3:$J$126,4,FALSE)","v":{"$error":"#N/A"}},{"$f":"VLOOKUP($A23,Orçamento!$A$3:$J$126,5,FALSE)","v":{"$error":"#N/A"}},{"$f":"VLOOKUP($A23,Orçamento!$A$3:$J$126,6,FALSE)","v":{"$error":"#N/A"}},null,1,0,0,0,0,0,0,0,0,0,0,0,0,0,0,null,{"$error":"#N/A"}]
["1.2.16",{"$f":"VLOOKUP($A24,Orçamento!$A$3:$J$126,2,FALSE)","v":{"$error":"#N/A"}},{"$f":"VLOOKUP($A24,Orçamento!$A$3:$J$126,3,FALSE)","v":{"$error":"#N/A"}},{"$f":"VLOOKUP($A24,Orçamento!$A$3:$J$126,4,FALSE)","v":{"$error":"#N/A"}},{"$f":"VLOOKUP($A24,Orçamento!$A$3:$J$126,5,FALSE)","v":{"$error":"#N/A"}},{"$f":"VLOOKUP($A24,Orçamento!$A$3:$J$126,6,FALSE)","v":{"$error":"#N/A"}},null,0,1,0,0,0,0,0,0,0,0,0,0,0,0,0,null,{"$error":"#N/A"}]
["1.2.17",{"$f":"VLOOKUP($A25,Orçamento!$A$3:$J$126,2,FALSE)","v":{"$error":"#N/A"}},{"$f":"VLOOKUP($A25,Orçamento!$A$3:$J$126,3,FALSE)","v":{"$error":"#N/A"}},{"$f":"VLOOKUP($A25,Orçamento!$A$3:$J$126,4,FALSE)","v":{"$error":"#N/A"}},{"$f":"VLOOKUP($A25,Orçamento!$A$3:$J$126,5,FALSE)","v":{"$error":"#N/A"}},{"$f":"VLOOKUP($A25,Orçamento!$A$3:$J$126,6,FALSE)","v":{"$error":"#N/A"}},null,0,1,0,0,0,0,0,0,0,0,0,0,0,0,0,null,{"$error":"#N/A"}]
["1.2.18",{"$f":"VLOOKUP($A26,Orçamento!$A$3:$J$126,2,FALSE)","v":{"$error":"#N/A"}},{"$f":"VLOOKUP($A26,Orçamento!$A$3:$J$126,3,FALSE)","v":{"$error":"#N/A"}},{"$f":"VLOOKUP($A26,Orçamento!$A$3:$J$126,4,FALSE)","v":{"$error":"#N/A"}},{"$f":"VLOOKUP($A26,Orçamento!$A$3:$J$126,5,FALSE)","v":{"$error":"#N/A"}},{"$f":"VLOOKUP($A26,Orçamento!$A$3:$J$126,6,FALSE)","v":{"$error":"#N/A"}},null,0,1,1,1,1,1,1,1,1,1,1,1,1,1,1,null,{"$error":"#N/A"}]
["1.2.19",{"$f":"VLOOKUP($A27,Orçamento!$A$3:$J$126,2,FALSE)","v":{"$error":"#N/A"}},{"$f":"VLOOKUP($A27,Orçamento!$A$3:$J$126,3,FALSE)","v":{"$error":"#N/A"}},{"$f":"VLOOKUP($A27,Orçamento!$A$3:$J$126,4,FALSE)","v":{"$error":"#N/A"}},{"$f":"VLOOKUP($A27,Orçamento!$A$3:$J$126,5,FALSE)","v":{"$error":"#N/A"}},{"$f":"VLOOKUP($A27,Orçamento!$A$3:$J$126,6,FALSE)","v":{"$error":"#N/A"}},null,0,0,0,0,0,0,0,0,0,0,0,0,0,0,{"$f":"F27","v":{"$error":"#N/A"}},null,{"$error":"#N/A"}]
["1.2.20",{"$f":"VLOOKUP($A28,Orçamento!$A$3:$J$126,2,FALSE)","v":{"$error":"#N/A"}},{"$f":"VLOOKUP($A28,Orçamento!$A$3:$J$126,3,FALSE)","v":{"$error":"#N/A"}},{"$f":"VLOOKUP($A28,Orçamento!$A$3:$J$126,4,FALSE)","v":{"$error":"#N/A"}},{"$f":"VLOOKUP($A28,Orçamento!$A$3:$J$126,5,FALSE)","v":{"$error":"#N/A"}},{"$f":"VLOOKUP($A28,Orçamento!$A$3:$J$126,6,FALSE)","v":{"$error":"#N/A"}},null,0,0,0,0,0,0,0,0,0,0,0,0,0,0,{"$f":"F28","v":{"$error":"#N/A"}},null,{"$error":"#N/A"}]
["1.2.21",{"$f":"VLOOKUP($A29,Orçamento!$A$3:$J$126,2,FALSE)","v":{"$error":"#N/A"}},{"$f":"VLOOKUP($A29,Orçamento!$A$3:$J$126,3,FALSE)","v":{"$error":"#N/A"}},{"$f":"VLOOKUP($A29,Orçamento!$A$3:$J$126,4,FALSE)","v":{"$error":"#N/A"}},{"$f":"VLOOKUP($A29,Orçamento!$A$3:$J$126,5,FALSE)","v":{"$error":"#N/A"}},{"$f":"VLOOKUP($A29,Orçamento!$A$3:$J$126,6,FALSE)","v":{"$error":"#N/A"}},null,0,0,0.5,0.5,0,0,0,0,0,0,0,0,0,0,0]
["1.2.22",{"$f":"VLOOKUP($A30,Orçamento!$A$3:$J$126,2,FALSE)","v":{"$error":"#N/A"}},{"$f":"VLOOKUP($A30,Orçamento!$A$3:$J$126,3,FALSE)","v":{"$error":"#N/A"}},{"$f":"VLOOKUP($A30,Orçamento!$A$3:$J$126,4,FALSE)","v":{"$error":"#N/A"}},{"$f":"VLOOKUP($A30,Orçamento!$A$3:$J$126,5,FALSE)","v":{"$error":"#N/A"}},{"$f":"VLOOKUP($A30,Orçamento!$A$3:$J$126,6,FALSE)","v":{"$error":"#N/A"}},null,2.88,0,0,0,0,0,0,0,0,0,0,0,0,0,0]
[{"$nulls":5},{"$f":"Orçamento!#REF!","v":{"$error":"#REF!"}},{"$nulls":17},{"$error":"#REF!"}]
["1.3",null,null,"Acessos",null,{"$f":"Orçamento!F10","v":0},null,0,0,0,0,0,0,0,0,0,0,0,0,0,0,0,null,0]
["1.3.1",{"$f":"VLOOKUP($A33,Orçamento!$A$3:$J$126,2,FALSE)","v":"SICRO"},{"$f":"VLOOKUP($A33,Orçamento!$A$3:$J$126,3,FALSE)","v":5502986},{"$f":"VLOOKUP($A33,Orçamento!$A$3:$J$126,4,FALSE)","v":"Expurgo"},{"$f":"VLOOKUP($A33,Orçamento!$A$3:$J$126,5,FALSE)","v":"m³"},{"$f":"VLOOKUP($A33,Orçamento!$A$3:$J$126,6,FALSE)","v":1500},null,0,1500,0,0,0,0,0,0,0,0,0,0,0,0,0,null,0]
["1.3.2",{"$f":"VLOOKUP($A34,Orçamento!$A$3:$J$126,2,FALSE)","v":"SICRO"},{"$f":"VLOOKUP($A34,Orçamento!$A$3:$J$126,3,FALSE)","v":4011209},{"$f":"VLOOKUP($A34,Orçamento!$A$3:$J$126,4,FALSE)","v":"Regularização do Subleito"},{"$f":"VLOOKUP($A34,Orçamento!$A$3:$J$126,5,FALSE)","v":"m²"},{"$f":"VLOOKUP($A34,Orçamento!$A$3:$J$126,6,FALSE)","v":6000},null,0,6000,0,0,0,0,0,0,0,0,0,0,0,0,0,null,0]
["1.3.3",{"$f":"VLOOKUP($A35,Orçamento!$A$3:$J$126,2,FALSE)","v":"SICRO"},{"$f":"VLOOKUP($A35,Orçamento!$A$3:$J$126,3,FALSE)","v":4015612},{"$f":"VLOOKUP($A35,Orçamento!$A$3:$J$126,4,FALSE)","v":"Revestimento Primário de Acesso"},{"$f":"VLOOKUP($A35,Orçamento!$A$3:$J$126,5,FALSE)","v":"m³"},{"$f":"VLOOKUP($A35,Orçamento!$A$3:$J$126,6,FALSE)","v":900},null,0,null,900,0,0,0,0,0,0,0,0,0,0,0,0,null,0]
["1.3.4",{"$f":"VLOOKUP($A36,Orçamento!$A$3:$J$126,2,FALSE)","v":"SICRO"},{"$f":"VLOOKUP($A36,Orçamento!$A$3:$J$126,3,FALSE)","v":4915611},{"$f":"VLOOKUP($A36,Orçamento!$A$3:$J$126,4,FALSE)","v":"Recomposição de revestimento primário"},{"$f":"VLOOKUP($A36,Orçamento!$A$3:$J$126,5,FALSE)","v":"m³"},{"$f":"VLOOKUP($A36,Orçamento!$A$3:$J$126,6,FALSE)","v":180},null,0,0,0,0,0,0,0,180,0,0,0,0,0,0,0,null,0]
[{"$nulls":5},{"$f":"Orçamento!#REF!","v":{"$error":"#REF!"}},{"$nulls":17},{"$error":"#REF!"}]
["1.4",null,null,"Recuperação de Áreas",null,{"$f":"Orçamento!#REF!","v":{"$error":"#REF!"}},null,0,0,0,0,0,0,0,0,0,0,0,0,0,0,null,null,{"$error":"#REF!"}]
["1.4.1",{"$f":"VLOOKUP($A39,Orçamento!$A$3:$J$126,2,FALSE)","v":{"$error":"#N/A"}},{"$f":"VLOOKUP($A39,Orçamento!$A$3:$J$126,3,FALSE)","v":{"$error":"#N/A"}},{"$f":"VLOOKUP($A39,Orçamento!$A$3:$J$126,4,FALSE)","v":{"$error":"#N/A"}},{"$f":"VLOOKUP($A39,Orçamento!$A$3:$J$126,5,FALSE)","v":{"$error":"#N/A"}},{"$f":"VLOOKUP($A39,Orçamento!$A$3:$J$126,6,FALSE)","v":{"$error":"#N/A"}},null,0,0,0,0,0,0,0,0,0,0,0,0,0,0,{"$f":"F39","v":{"$error":"#N/A"}},null,{"$error":"#N/A"}]
["1.4.2",{"$f":"VLOOKUP($A40,Orçamento!$A$3:$J$126,2,FALSE)","v":{"$error":"#N/A"}},{"$f":"VLOOKUP($A40,Orçamento!$A$3:$J$126,3,FALSE)","v":{"$error":"#N/A"}},{"$f":"VLOOKUP($A40,Orçamento!$A$3:$J$126,4,FALSE)","v":{"$error":"#N/A"}},{"$f":"VLOOKUP($A40,Orçamento!$A$3:$J$126,5,FALSE)","v":{"$error":"#N/A"}},{"$f":"VLOOKUP($A40,Orçamento!$A$3:$J$126,6,FALSE)","v":{"$error":"#N/A"}},null,0,0,0,0,0,0,0,0,0,0,0,0,0,0,{"$f":"F40","v":{"$error":"#N/A"}},null,{"$error":"#N/A"}]
["1.4.3",{"$f":"VLOOKUP($A41,Orçamento!$A$3:$J$126,2,FALSE)","v":{"$error":"#N/A"}},{"$f":"VLOOKUP($A41,Orçamento!$A$3:$J$126,3,FALSE)","v":{"$error":"#N/A"}},{"$f":"VLOOKUP($A41,Orçamento!$A$3:$J$126,4,FALSE)","v":{"$error":"#N/A"}},{"$f":"VLOOKUP($A41,Orçamento!$A$3:$J$126,5,FALSE)","v":{"$error":"#N/A"}},{"$f":"VLOOKUP($A41,Orçamento!$A$3:$J$126,6,FALSE)","v":{"$error":"#N/A"}},null,0,0,0,0,0,0,0,0,0,0,0,0,0,0,{"$f":"F41","v":{"$error":"#N/A"}},null,{"$error":"#N/A"}]
[{"$nulls":5},{"$f":"Orçamento!F15","v":0},{"$nulls":17},0]
[2,null,null,"Vertedouro Complementar",null,{"$f":"Orçamento!F16","v":0},null,0,0,0,0,0,0,0,0,0,0,0,0,0,0,0,null,0]
["2.1",null,null,"Canal de Aproximação",null,{"$f":"Orçamento!F17","v":0},null,0,0,0,0,0,0,0,0,0,0,0,0,0,0,0,null,0]
["2.1.1",{"$f":"VLOOKUP($A45,Orçamento!$A$3:$J$126,2,FALSE)","v":"SICRO"},{"$f":"VLOOKUP($A45,Orçamento!$A$3:$J$126,3,FALSE)","v":5502139},{"$f":"VLOOKUP($A45,Orçamento!$A$3:$J$126,4,FALSE)","v":"Escavação Comum"},{"$f":"VLOOKUP($A45,Orçamento!$A$3:$J$126,5,FALSE)","v":"m³"},{"$f":"VLOOKUP($A45,Orçamento!$A$3:$J$126,6,FALSE)","v":27100},null,0,0,0,1150.6285714285714,1150.6285714285714,2525.0285714285715,1837.8285714285714,1150.6285714285714,1150.6285714285714,18134.62857142857,0,0,0,0,0,null,0]
["2.1.2",{"$f":"VLOOKUP($A46,Orçamento!$A$3:$J$126,2,FALSE)","v":"SICRO"},{"$f":"VLOOKUP($A46,Orçamento!$A$3:$J$126,3,FALSE)","v":2003864},{"$f":"VLOOKUP($A46,Orçamento!$A$3:$J$126,4,FALSE)","v":"Esgotamento de água com bomba submersa"},{"$f":"VLOOKUP($A46,Orçamento!$A$3:$J$126,5,FALSE)","v":"h"},{"$f":"VLOOKUP($A46,Orçamento!$A$3:$J$126,6,FALSE)","v":122},null,0,0,0,{"$f":"122/7","v":17.428571428571427},17.428571428571427,17.428571428571427,17.428571428571427,17.428571428571427,17.428571428571427,17.428571428571427,0,0,0,0,0,null,0]
["2.1.3",{"$f":"VLOOKUP($A47,Orçamento!$A$3:$J$126,2,FALSE)","v":"SICRO"},{"$f":"VLOOKUP($A47,Orçamento!$A$3:$J$126,3,FALSE)","v":4413942},{"$f":"VLOOKUP($A47,Orçamento!$A$3:$J$126,4,FALSE)","v":"Espalhamento de solo em bota fora"},{"$f":"VLOOKUP($A47,Orçamento!$A$3:$J$126,5,FALSE)","v":"m³"},{"$f":"VLOOKUP($A47,Orçamento!$A$3:$J$126,6,FALSE)","v":16937.5},{"$nulls":4},{"$f":"F47/7","v":2419.6428571428573},{"$f":"K47","v":2419.6428571428573},2419.6428571428573,2419.6428571428573,2419.6428571428573,2419.6428571428573,2419.6428571428573,{"$nulls":6},0]
[{"$nulls":5},{"$f":"Orçamento!F21","v":0},{"$nulls":17},0]
["2.2",null,null,"Canal de Restituição",null,{"$f":"Orçamento!F22","v":0},null,0,0,0,0,0,0,0,0,0,0,0,0,0,0,0,null,0]
["2.2.1",{"$f":"VLOOKUP($A50,Orçamento!$A$3:$J$126,2,FALSE)","v":"SICRO"},{"$f":"VLOOKUP($A50,Orçamento!$A$3:$J$126,3,FALSE)","v":5502139},{"$f":"VLOOKUP($A50,Orçamento!$A$3:$J$126,4,FALSE)","v":"Escavaçao Comum"},{"$f":"VLOOKUP($A50,Orçamento!$A$3:$J$126,5,FALSE)","v":"m³"},{"$f":"VLOOKUP($A50,Orçamento!$A$3:$J$126,6,FALSE)","v":1898.21},null,0,0,0,0,0,0,0,0,1898.21,0,0,0,0,0,0,null,0]
["2.2.2",{"$f":"VLOOKUP($A51,Orçamento!$A$3:$J$126,2,FALSE)","v":"SICRO"},{"$f":"VLOOKUP($A51,Orçamento!$A$3:$J$126,3,FALSE)","v":2003864},{"$f":"VLOOKUP($A51,Orçamento!$A$3:$J$126,4,FALSE)","v":"Esgotamento de água com bomba submersa"},{"$f":"VLOOKUP($A51,Orçamento!$A$3:$J$126,5,FALSE)","v":"h"},{"$f":"VLOOKUP($A51,Orçamento!$A$3:$J$126,6,FALSE)","v":8.58},null,0,0,0,0,0,0,0,0,{"$f":"F51","v":8.58},0,0,0,0,0,0,null,0]
["2.2.3",{"$f":"VLOOKUP($A52,Orçamento!$A$3:$J$126,2,FALSE)","v":"SICRO"},{"$f":"VLOOKUP($A52,Orçamento!$A$3:$J$126,3,FALSE)","v":4413942},{"$f":"VLOOKUP($A52,Orçamento!$A$3:$J$126,4,FALSE)","v":"Espalhamento de solo em bota fora"},{"$f":"VLOOKUP($A52,Orçamento!$A$3:$J$126,5,FALSE)","v":"m³"},{"$f":"VLOOKUP($A52,Orçamento!$A$3:$J$126,6,FALSE)","v":1186.3812499999999},{"$nulls":9},{"$f":"F52","v":1186.3812499999999},{"$nulls":7},0]
[{"$nulls":5},{"$f":"Orçamento!F26","v":0},{"$nulls":17},0]
["2.3",null,null,"Dique de Proteção",null,{"$f":"Orçamento!F27","v":0},null,0,0,0,0,0,0,0,0,0,0,0,0,0,0,0,null,0]
["2.3.1",{"$f":"VLOOKUP($A55,Orçamento!$A$3:$J$126,2,FALSE)","v":"SICRO"},{"$f":"VLOOKUP($A55,Orçamento!$A$3:$J$126,3,FALSE)","v":5502139},{"$f":"VLOOKUP($A55,Orçamento!$A$3:$J$126,4,FALSE)","v":"Escavação comum"},{"$f":"VLOOKUP($A55,Orçamento!$A$3:$J$126,5,FALSE)","v":"m³"},{"$f":"VLOOKUP($A55,Orçamento!$A$3:$J$126,6,FALSE)","v":11318.65},null,0,0,0,0,0,0,0,0,11318.65,0,0,0,0,0,0,null,0]
["2.3.2",{"$f":"VLOOKUP($A56,Orçamento!$A$3:$J$126,2,FALSE)","v":"SICRO"},{"$f":"VLOOKUP($A56,Orçamento!$A$3:$J$126,3,FALSE)","v":5502978},{"$f":"VLOOKUP($A56,Orçamento!$A$3:$J$126,4,FALSE)","v":"Aterro Compactado"},{"$f":"VLOOKUP($A56,Orçamento!$A$3:$J$126,5,FALSE)","v":"m³"},{"$f":"VLOOKUP($A56,Orçamento!$A$3:$J$126,6,FALSE)","v":6766.82},null,0,0,0,0,0,0,0,0,0,0,6766.82,0,0,0,0,null,0]
["2.3.3",{"$f":"VLOOKUP($A57,Orçamento!$A$3:$J$126,2,FALSE)","v":"SICRO"},{"$f":"VLOOKUP($A57,Orçamento!$A$3:$J$126,3,FALSE)","v":5502986},{"$f":"VLOOKUP($A57,Orçamento!$A$3:$J$126,4,FALSE)","v":"Expurgo"},{"$f":"VLOOKUP($A57,Orçamento!$A$3:$J$126,5,FALSE)","v":"m³"},{"$f":"VLOOKUP($A57,Orçamento!$A$3:$J$126,6,FALSE)","v":372.17510000000004},null,0,0,0,0,0,0,0,0,0,{"$f":"F57","v":372.17510000000004},0,0,0,0,0,null,0]
["2.3.4",{"$f":"VLOOKUP($A58,Orçamento!$A$3:$J$126,2,FALSE)","v":"SICRO"},{"$f":"VLOOKUP($A58,Orçamento!$A$3:$J$126,3,FALSE)","v":4016008},{"$f":"VLOOKUP($A58,Orçamento!$A$3:$J$126,4,FALSE)","v":"Escavação de jazida "},{"$f":"VLOOKUP($A58,Orçamento!$A$3:$J$126,5,FALSE)","v":"m³"},{"$f":"VLOOKUP($A58,Orçamento!$A$3:$J$126,6,FALSE)","v":3721.7510000000002},null,0,0,0,0,0,0,0,0,0,0,{"$f":"F58","v":3721.7510000000002},0,0,0,0,null,0]
["2.3.5",{"$f":"VLOOKUP($A59,Orçamento!$A$3:$J$126,2,FALSE)","v":"SICRO"},{"$f":"VLOOKUP($A59,Orçamento!$A$3:$J$126,3,FALSE)","v":4413942},{"$f":"VLOOKUP($A59,Orçamento!$A$3:$J$126,4,FALSE)","v":"Espalhamento de solo em bota fora"},{"$f":"VLOOKUP($A59,Orçamento!$A$3:$J$126,5,FALSE)","v":"m³"},{"$f":"VLOOKUP($A59,Orçamento!$A$3:$J$126,6,FALSE)","v":7074.15625},{"$nulls":9},{"$f":"F59","v":7074.15625},{"$nulls":7},0]
[{"$nulls":5},{"$f":"Orçamento!F33","v":0},{"$nulls":17},0]
[3,null,null,"Vertedouro Soleira Livre",null,{"$f":"Orçamento!F34","v":0},null,0,0,0,0,0,0,0,0,0,0,0,0,0,0,0,null,0]
["3.1",null,null,"Reparo na calha e sistema de drenagem",null,{"$f":"Orçamento!F35","v":0},null,0,0,0,0,0,0,0,0,0,0,0,0,0,0,0,null,0]
["3.1.1",{"$f":"VLOOKUP($A63,Orçamento!$A$3:$J$126,2,FALSE)","v":"SICRO"},{"$f":"VLOOKUP($A63,Orçamento!$A$3:$J$126,3,FALSE)","v":1600990},{"$f":"VLOOKUP($A63,Orçamento!$A$3:$J$126,4,FALSE)","v":"Demolição de concreto armado"},{"$f":"VLOOKUP($A63,Orçamento!$A$3:$J$126,5,FALSE)","v":"m³"},{"$f":"VLOOKUP($A63,Orçamento!$A$3:$J$126,6,FALSE)","v":23.383749999999999},null,0,0,0,0,0,0,0,7.7945833333333328,7.7945833333333328,7.7945833333333328,0,0,0,0,0,null,0]
["3.1.2",{"$f":"VLOOKUP($A64,Orçamento!$A$3:$J$126,2,FALSE)","v":"SICRO"},{"$f":"VLOOKUP($A64,Orçamento!$A$3:$J$126,3,FALSE)","v":3806402},{"$f":"VLOOKUP($A64,Orçamento!$A$3:$J$126,4,FALSE)","v":"Limpeza em superfície de concreto "},{"$f":"VLOOKUP($A64,Orçamento!$A$3:$J$126,5,FALSE)","v":"m²"},{"$f":"VLOOKUP($A64,Orçamento!$A$3:$J$126,6,FALSE)","v":36.625},null,0,0,0,0,0,0,0,12.208333333333334,12.208333333333334,12.208333333333334,0,0,0,0,0,null,0]
["3.1.3",{"$f":"VLOOKUP($A65,Orçamento!$A$3:$J$126,2,FALSE)","v":"SICRO"},{"$f":"VLOOKUP($A65,Orçamento!$A$3:$J$126,3,FALSE)","v":3108007},{"$f":"VLOOKUP($A65,Orçamento!$A$3:$J$126,4,FALSE)","v":"Forma em Compensado Plastificado e=10mm"},{"$f":"VLOOKUP($A65,Orçamento!$A$3:$J$126,5,FALSE)","v":"m²"},{"$f":"VLOOKUP($A65,Orçamento!$A$3:$J$126,6,FALSE)","v":5.2},null,0,0,0,0,0,0,0,1.7333333333333334,1.7333333333333334,1.7333333333333334,0,0,0,0,0,null,0]
["3.1.4",{"$f":"VLOOKUP($A66,Orçamento!$A$3:$J$126,2,FALSE)","v":"SICRO"},{"$f":"VLOOKUP($A66,Orçamento!$A$3:$J$126,3,FALSE)","v":407819},{"$f":"VLOOKUP($A66,Orçamento!$A$3:$J$126,4,FALSE)","v":"Armação em Aço CA-50"},{"$f":"VLOOKUP($A66,Orçamento!$A$3:$J$126,5,FALSE)","v":"kg"},{"$f":"VLOOKUP($A66,Orçamento!$A$3:$J$126,6,FALSE)","v":477},null,0,0,0,0,0,0,0,159,159,159,0,0,0,0,0,null,0]
["3.1.5",{"$f":"VLOOKUP($A67,Orçamento!$A$3:$J$126,2,FALSE)","v":"SICRO"},{"$f":"VLOOKUP($A67,Orçamento!$A$3:$J$126,3,FALSE)","v":1116263},{"$f":"VLOOKUP($A67,Orçamento!$A$3:$J$126,4,FALSE)","v":"Concreto Fck 25 Mpa"},{"$f":"VLOOKUP($A67,Orçamento!$A$3:$J$126,5,FALSE)","v":"m³"},{"$f":"VLOOKUP($A67,Orçamento!$A$3:$J$126,6,FALSE)","v":23.383749999999999},null,0,0,0,0,0,0,0,7.7945833333333328,7.7945833333333328,7.7945833333333328,0,0,0,0,0,null,0]
["3.1.6",{"$f":"VLOOKUP($A68,Orçamento!$A$3:$J$126,2,FALSE)","v":"SICRO"},{"$f":"VLOOKUP($A68,Orçamento!$A$3:$J$126,3,FALSE)","v":1107860},{"$f":"VLOOKUP($A68,Orçamento!$A$3:$J$126,4,FALSE)","v":"Bombeamento de Concreto"},{"$f":"VLOOKUP($A68,Orçamento!$A$3:$J$126,5,FALSE)","v":"m³"},{"$f":"VLOOKUP($A68,Orçamento!$A$3:$J$126,6,FALSE)","v":23.383749999999999},null,0,0,0,0,0,0,0,7.7945833333333328,7.7945833333333328,7.7945833333333328,0,0,0,0,0,null,0]
["3.1.7",{"$f":"VLOOKUP($A69,Orçamento!$A$3:$J$126,2,FALSE)","v":"SICRO"},{"$f":"VLOOKUP($A69,Orçamento!$A$3:$J$126,3,FALSE)","v":1100657},{"$f":"VLOOKUP($A69,Orçamento!$A$3:$J$126,4,FALSE)","v":"Adensamento de Concreto"},{"$f":"VLOOKUP($A69,Orçamento!$A$3:$J$126,5,FALSE)","v":"m³"},{"$f":"VLOOKUP($A69,Orçamento!$A$3:$J$126,6,FALSE)","v":23.383749999999999},null,0,0,0,0,0,0,0,{"$f":"F69/3","v":7.7945833333333328},{"$f":"O69","v":7.7945833333333328},7.7945833333333328,0,0,0,0,0,null,0]
["3.1.8",{"$f":"VLOOKUP($A70,Orçamento!$A$3:$J$126,2,FALSE)","v":"COMPOS."},{"$f":"VLOOKUP($A70,Orçamento!$A$3:$J$126,3,FALSE)","v":"0.006"},{"$f":"VLOOKUP($A70,Orçamento!$A$3:$J$126,4,FALSE)","v":"Veda Juntas O-22"},{"$f":"VLOOKUP($A70,Orçamento!$A$3:$J$126,5,FALSE)","v":"m"},{"$f":"VLOOKUP($A70,Orçamento!$A$3:$J$126,6,FALSE)","v":16},null,0,0,0,0,0,0,0,{"$f":"F70/3","v":5.333333333333333},5.333333333333333,5.333333333333333,0,0,0,0,0,null,0]
["3.1.9",{"$f":"VLOOKUP($A71,Orçamento!$A$3:$J$126,2,FALSE)","v":"SICRO"},{"$f":"VLOOKUP($A71,Orçamento!$A$3:$J$126,3,FALSE)","v":2003578},{"$f":"VLOOKUP($A71,Orçamento!$A$3:$J$126,4,FALSE)","v":"Drenagem Interna"},{"$f":"VLOOKUP($A71,Orçamento!$A$3:$J$126,5,FALSE)","v":"m"},{"$f":"VLOOKUP($A71,Orçamento!$A$3:$J$126,6,FALSE)","v":73.25},null,0,0,0,0,0,0,0,{"$f":"F71/3","v":24.416666666666668},24.416666666666668,24.416666666666668,0,0,0,0,0]
[{"$nulls":5},{"$f":"Orçamento!F45","v":0},null,0,0,0,0,0,0,0,{"$nulls":9},{"$f":"F72-SUM(H72:V72)","v":0}]
["3.2",null,null,"Proteção Gabião",null,{"$f":"Orçamento!F46","v":0},null,0,0,0,0,0,0,0,0,0,0,0,0,0,0,0,null,0]
["3.2.1",{"$f":"VLOOKUP($A74,Orçamento!$A$3:$J$126,2,FALSE)","v":"SICRO"},{"$f":"VLOOKUP($A74,Orçamento!$A$3:$J$126,3,FALSE)","v":3108007},{"$f":"VLOOKUP($A74,Orçamento!$A$3:$J$126,4,FALSE)","v":"Forma em Compensado Plastificado e=10mm"},{"$f":"VLOOKUP($A74,Orçamento!$A$3:$J$126,5,FALSE)","v":"m²"},{"$f":"VLOOKUP($A74,Orçamento!$A$3:$J$126,6,FALSE)","v":108},null,0,0,0,0,0,0,0,0,0,0,36,36,36,0,0,null,0]
["3.2.2",{"$f":"VLOOKUP($A75,Orçamento!$A$3:$J$126,2,FALSE)","v":"SICRO"},{"$f":"VLOOKUP($A75,Orçamento!$A$3:$J$126,3,FALSE)","v":1106109},{"$f":"VLOOKUP($A75,Orçamento!$A$3:$J$126,4,FALSE)","v":"Concreto fck = 20 Mpa"},{"$f":"VLOOKUP($A75,Orçamento!$A$3:$J$126,5,FALSE)","v":"m³"},{"$f":"VLOOKUP($A75,Orçamento!$A$3:$J$126,6,FALSE)","v":1541},null,0,0,0,0,0,0,0,0,0,0,513.66666666666663,513.66666666666663,513.66666666666663,0,0,null,0]
["3.2.3",{"$f":"VLOOKUP($A76,Orçamento!$A$3:$J$126,2,FALSE)","v":"SICRO"},{"$f":"VLOOKUP($A76,Orçamento!$A$3:$J$126,3,FALSE)","v":1107860},{"$f":"VLOOKUP($A76,Orçamento!$A$3:$J$126,4,FALSE)","v":"Bombeamento"},{"$f":"VLOOKUP($A76,Orçamento!$A$3:$J$126,5,FALSE)","v":"m³"},{"$f":"VLOOKUP($A76,Orçamento!$A$3:$J$126,6,FALSE)","v":1541},null,0,0,0,0,0,0,0,0,0,0,513.66666666666663,513.66666666666663,513.66666666666663,0,0,null,0]
["3.2.4",{"$f":"VLOOKUP($A77,Orçamento!$A$3:$J$126,2,FALSE)","v":"SICRO"},{"$f":"VLOOKUP($A77,Orçamento!$A$3:$J$126,3,FALSE)","v":1100657},{"$f":"VLOOKUP($A77,Orçamento!$A$3:$J$126,4,FALSE)","v":"Adensamento de Concreto"},{"$f":"VLOOKUP($A77,Orçamento!$A$3:$J$126,5,FALSE)","v":"m³"},{"$f":"VLOOKUP($A77,Orçamento!$A$3:$J$126,6,FALSE)","v":1541},null,0,0,0,0,0,0,0,0,0,0,{"$f":"R76","v":513.66666666666663},{"$f":"S76","v":513.66666666666663},{"$f":"T76","v":513.66666666666663},0,0]
[{"$nulls":5},{"$f":"Orçamento!F51","v":0},{"$nulls":17},0]
["3.3",null,null,"Reparos estruturas de concreto",null,{"$f":"Orçamento!F52","v":0},null,0,0,0,0,0,0,0,0,0,0,0,0,0,0,0,null,0]
["3.3.1",{"$f":"VLOOKUP($A80,Orçamento!$A$3:$J$126,2,FALSE)","v":"SICRO"},{"$f":"VLOOKUP($A80,Orçamento!$A$3:$J$126,3,FALSE)","v":3806413},{"$f":"VLOOKUP($A80,Orçamento!$A$3:$J$126,4,FALSE)","v":"Apicoamento"},{"$f":"VLOOKUP($A80,Orçamento!$A$3:$J$126,5,FALSE)","v":"m²"},{"$f":"VLOOKUP($A80,Orçamento!$A$3:$J$126,6,FALSE)","v":50},null,0,0,0,7.1428571428571432,7.1428571428571432,7.1428571428571432,7.1428571428571432,7.1428571428571432,7.1428571428571432,7.1428571428571432,0,0,0,0,0,null,0]
["3.3.2",{"$f":"VLOOKUP($A81,Orçamento!$A$3:$J$126,2,FALSE)","v":"SICRO"},{"$f":"VLOOKUP($A81,Orçamento!$A$3:$J$126,3,FALSE)","v":3806402},{"$f":"VLOOKUP($A81,Orçamento!$A$3:$J$126,4,FALSE)","v":"Limpeza em superfície de concreto "},{"$f":"VLOOKUP($A81,Orçamento!$A$3:$J$126,5,FALSE)","v":"m²"},{"$f":"VLOOKUP($A81,Orçamento!$A$3:$J$126,6,FALSE)","v":50},null,0,0,0,7.1428571428571432,7.1428571428571432,7.1428571428571432,7.1428571428571432,7.1428571428571432,7.1428571428571432,7.1428571428571432,0,0,0,0,0,null,0]
["3.3.3",{"$f":"VLOOKUP($A82,Orçamento!$A$3:$J$126,2,FALSE)","v":"COMPOS."},{"$f":"VLOOKUP($A82,Orçamento!$A$3:$J$126,3,FALSE)","v":"0.006"},{"$f":"VLOOKUP($A82,Orçamento!$A$3:$J$126,4,FALSE)","v":"Veda Juntas O-22"},{"$f":"VLOOKUP($A82,Orçamento!$A$3:$J$126,5,FALSE)","v":"m"},{"$f":"VLOOKUP($A82,Orçamento!$A$3:$J$126,6,FALSE)","v":30},null,0,0,0,4.2857142857142856,4.2857142857142856,4.2857142857142856,4.2857142857142856,4.2857142857142856,4.2857142857142856,4.2857142857142856,0,0,0,0,0,null,0]
["3.3.4",{"$f":"VLOOKUP($A83,Orçamento!$A$3:$J$126,2,FALSE)","v":"SICRO"},{"$f":"VLOOKUP($A83,Orçamento!$A$3:$J$126,3,FALSE)","v":2407972},{"$f":"VLOOKUP($A83,Orçamento!$A$3:$J$126,4,FALSE)","v":"Adesivo estrutural à base de resina epóxi"},{"$f":"VLOOKUP($A83,Orçamento!$A$3:$J$126,5,FALSE)","v":"kg"},{"$f":"VLOOKUP($A83,Orçamento!$A$3:$J$126,6,FALSE)","v":40},null,0,0,0,5.7142857142857144,5.7142857142857144,5.7142857142857144,5.7142857142857144,5.7142857142857144,5.7142857142857144,5.7142857142857144,0,0,0,0,0,null,0]
["3.3.5",{"$f":"VLOOKUP($A84,Orçamento!$A$3:$J$126,2,FALSE)","v":"SICRO"},{"$f":"VLOOKUP($A84,Orçamento!$A$3:$J$126,3,FALSE)","v":1108060},{"$f":"VLOOKUP($A84,Orçamento!$A$3:$J$126,4,FALSE)","v":"Argamassa polimérica com microssílica"},{"$f":"VLOOKUP($A84,Orçamento!$A$3:$J$126,5,FALSE)","v":"m³"},{"$f":"VLOOKUP($A84,Orçamento!$A$3:$J$126,6,FALSE)","v":3},null,0,0,0,0.42857142857142855,0.42857142857142855,0.42857142857142855,0.42857142857142855,0.42857142857142855,0.42857142857142855,0.42857142857142855,0,0,0,0,0,null,0]
["3.3.6",{"$f":"VLOOKUP($A85,Orçamento!$A$3:$J$126,2,FALSE)","v":"SICRO"},{"$f":"VLOOKUP($A85,Orçamento!$A$3:$J$126,3,FALSE)","v":1109667},{"$f":"VLOOKUP($A85,Orçamento!$A$3:$J$126,4,FALSE)","v":"Argamassa Dry Pack"},{"$f":"VLOOKUP($A85,Orçamento!$A$3:$J$126,5,FALSE)","v":"m³"},{"$f":"VLOOKUP($A85,Orçamento!$A$3:$J$126,6,FALSE)","v":3},null,0,0,0,0.42857142857142855,0.42857142857142855,0.42857142857142855,0.42857142857142855,0.42857142857142855,0.42857142857142855,0.42857142857142855,0,0,0,0,0,null,0]
["3.3.7",{"$f":"VLOOKUP($A86,Orçamento!$A$3:$J$126,2,FALSE)","v":"SICRO"},{"$f":"VLOOKUP($A86,Orçamento!$A$3:$J$126,3,FALSE)","v":1108056},{"$f":"VLOOKUP($A86,Orçamento!$A$3:$J$126,4,FALSE)","v":"Microconcreto autoadensável "},{"$f":"VLOOKUP($A86,Orçamento!$A$3:$J$126,5,FALSE)","v":"m³"},{"$f":"VLOOKUP($A86,Orçamento!$A$3:$J$126,6,FALSE)","v":9},null,0,0,0,1.2857142857142858,1.2857142857142858,1.2857142857142858,1.2857142857142858,1.2857142857142858,1.2857142857142858,1.2857142857142858,0,0,0,0,0,null,0]
["3.3.8",{"$f":"VLOOKUP($A87,Orçamento!$A$3:$J$126,2,FALSE)","v":"SICRO"},{"$f":"VLOOKUP($A87,Orçamento!$A$3:$J$126,3,FALSE)","v":3806415},{"$f":"VLOOKUP($A87,Orçamento!$A$3:$J$126,4,FALSE)","v":"Demolição controlada "},{"$f":"VLOOKUP($A87,Orçamento!$A$3:$J$126,5,FALSE)","v":"m³"},{"$f":"VLOOKUP($A87,Orçamento!$A$3:$J$126,6,FALSE)","v":3},null,0,0,0,0.42857142857142855,0.42857142857142855,0.42857142857142855,0.42857142857142855,0.42857142857142855,0.42857142857142855,0.42857142857142855,0,0,0,0,0,null,0]
[{"$nulls":5},{"$f":"Orçamento!F61","v":0},{"$nulls":17},0]
[4,null,null,"Barragem de Terra",null,{"$f":"Orçamento!F62","v":0},null,0,0,0,0,0,0,0,0,0,0,0,0,0,0,0,null,0]
["4.1",null,null,"Instrumentação",null,{"$f":"Orçamento!#REF!","v":{"$error":"#REF!"}},null,0,0,0,0,0,0,0,0,0,0,0,0,0,0,0,null,{"$error":"#REF!"}]
["4.1.1",{"$f":"VLOOKUP($A91,Orçamento!$A$3:$J$126,2,FALSE)","v":{"$error":"#N/A"}},{"$f":"VLOOKUP($A91,Orçamento!$A$3:$J$126,3,FALSE)","v":{"$error":"#N/A"}},{"$f":"VLOOKUP($A91,Orçamento!$A$3:$J$126,4,FALSE)","v":{"$error":"#N/A"}},{"$f":"VLOOKUP($A91,Orçamento!$A$3:$J$126,5,FALSE)","v":{"$error":"#N/A"}},{"$f":"VLOOKUP($A91,Orçamento!$A$3:$J$126,6,FALSE)","v":{"$error":"#N/A"}},null,0,0,0,0,0,0,0,0,0,0,3,3,0,0,0,null,{"$error":"#N/A"}]
["4.1.2",{"$f":"VLOOKUP($A92,Orçamento!$A$3:$J$126,2,FALSE)","v":{"$error":"#N/A"}},{"$f":"VLOOKUP($A92,Orçamento!$A$3:$J$126,3,FALSE)","v":{"$error":"#N/A"}},{"$f":"VLOOKUP($A92,Orçamento!$A$3:$J$126,4,FALSE)","v":{"$error":"#N/A"}},{"$f":"VLOOKUP($A92,Orçamento!$A$3:$J$126,5,FALSE)","v":{"$error":"#N/A"}},{"$f":"VLOOKUP($A92,Orçamento!$A$3:$J$126,6,FALSE)","v":{"$error":"#N/A"}},null,0,0,0,0,0,0,0,0,0,0,0,5,5,5,5,null,{"$error":"#N/A"}]
["4.1.3",{"$f":"VLOOKUP($A93,Orçamento!$A$3:$J$126,2,FALSE)","v":{"$error":"#N/A"}},{"$f":"VLOOKUP($A93,Orçamento!$A$3:$J$126,3,FALSE)","v":{"$error":"#N/A"}},{"$f":"VLOOKUP($A93,Orçamento!$A$3:$J$126,4,FALSE)","v":{"$error":"#N/A"}},{"$f":"VLOOKUP($A93,Orçamento!$A$3:$J$126,5,FALSE)","v":{"$error":"#N/A"}},{"$f":"VLOOKUP($A93,Orçamento!$A$3:$J$126,6,FALSE)","v":{"$error":"#N/A"}},null,0,0,0,0,0,0,0,2,1,1,1,1,1,2,0,null,{"$error":"#N/A"}]
["4.1.4",{"$f":"VLOOKUP($A94,Orçamento!$A$3:$J$126,2,FALSE)","v":{"$error":"#N/A"}},{"$f":"VLOOKUP($A94,Orçamento!$A$3:$J$126,3,FALSE)","v":{"$error":"#N/A"}},{"$f":"VLOOKUP($A94,Orçamento!$A$3:$J$126,4,FALSE)","v":{"$error":"#N/A"}},{"$f":"VLOOKUP($A94,Orçamento!$A$3:$J$126,5,FALSE)","v":{"$error":"#N/A"}},{"$f":"VLOOKUP($A94,Orçamento!$A$3:$J$126,6,FALSE)","v":{"$error":"#N/A"}},null,0,0,0,0,0,0,1,1,1,1,1,0,0,0,0,null,{"$error":"#N/A"}]
[{"$nulls":5},{"$f":"Orçamento!#REF!","v":{"$error":"#REF!"}},{"$nulls":17},{"$error":"#REF!"}]
["4.2",null,null,"Montante",null,{"$f":"Orçamento!F63","v":0},null,0,0,0,0,0,0,0,0,0,0,0,0,0,0,0,null,0]
["4.2.1",{"$f":"VLOOKUP($A97,Orçamento!$A$3:$J$126,2,FALSE)","v":"SICRO"},{"$f":"VLOOKUP($A97,Orçamento!$A$3:$J$126,3,FALSE)","v":5502985},{"$f":"VLOOKUP($A97,Orçamento!$A$3:$J$126,4,FALSE)","v":"Limpeza da camada vegetal"},{"$f":"VLOOKUP($A97,Orçamento!$A$3:$J$126,5,FALSE)","v":"m²"},{"$f":"VLOOKUP($A97,Orçamento!$A$3:$J$126,6,FALSE)","v":16840},null,0,0,0,11226.666666666666,5613.333333333333,0,0,0,0,0,0,0,0,0,0,null,0]
["4.2.2",{"$f":"VLOOKUP($A98,Orçamento!$A$3:$J$126,2,FALSE)","v":"SINAPI"},{"$f":"VLOOKUP($A98,Orçamento!$A$3:$J$126,3,FALSE)","v":98527},{"$f":"VLOOKUP($A98,Orçamento!$A$3:$J$126,4,FALSE)","v":"Remoção de raízes e cupinzeiros"},{"$f":"VLOOKUP($A98,Orçamento!$A$3:$J$126,5,FALSE)","v":"und"},{"$f":"VLOOKUP($A98,Orçamento!$A$3:$J$126,6,FALSE)","v":34},null,0,0,0,0,34,0,0,0,0,0,0,0,0,0,0,null,0]
["4.2.3",{"$f":"VLOOKUP($A99,Orçamento!$A$3:$J$126,2,FALSE)","v":"SICRO"},{"$f":"VLOOKUP($A99,Orçamento!$A$3:$J$126,3,FALSE)","v":4915625},{"$f":"VLOOKUP($A99,Orçamento!$A$3:$J$126,4,FALSE)","v":"Recomposição em Solo Cimento"},{"$f":"VLOOKUP($A99,Orçamento!$A$3:$J$126,5,FALSE)","v":"m³"},{"$f":"VLOOKUP($A99,Orçamento!$A$3:$J$126,6,FALSE)","v":1718},null,0,0,0,0,0,1145.3333333333333,572.66666666666663,0,0,0,0,0,0,0,0,null,0]
["4.2.4",{"$f":"VLOOKUP($A100,Orçamento!$A$3:$J$126,2,FALSE)","v":{"$error":"#N/A"}},{"$f":"VLOOKUP($A100,Orçamento!$A$3:$J$126,3,FALSE)","v":{"$error":"#N/A"}},{"$f":"VLOOKUP($A100,Orçamento!$A$3:$J$126,4,FALSE)","v":{"$error":"#N/A"}},{"$f":"VLOOKUP($A100,Orçamento!$A$3:$J$126,5,FALSE)","v":{"$error":"#N/A"}},{"$f":"VLOOKUP($A100,Orçamento!$A$3:$J$126,6,FALSE)","v":{"$error":"#N/A"}},null,0,0,0,0,0,{"$f":"F100*0.67","v":{"$error":"#N/A"}},{"$f":"F100-M100","v":{"$error":"#N/A"}},0,0,0,0,0,0,0,0,null,{"$error":"#N/A"}]
["4.2.5",{"$f":"VLOOKUP($A101,Orçamento!$A$3:$J$126,2,FALSE)","v":"SICRO"},{"$f":"VLOOKUP($A101,Orçamento!$A$3:$J$126,3,FALSE)","v":4805754},{"$f":"VLOOKUP($A101,Orçamento!$A$3:$J$126,4,FALSE)","v":"Compactação Manual"},{"$f":"VLOOKUP($A101,Orçamento!$A$3:$J$126,5,FALSE)","v":"m³"},{"$f":"VLOOKUP($A101,Orçamento!$A$3:$J$126,6,FALSE)","v":1718},null,0,0,0,0,0,1145.3333333333333,572.66666666666663,0,0,0,0,0,0,0,0,null,0]
["4.2.6",{"$f":"VLOOKUP($A102,Orçamento!$A$3:$J$126,2,FALSE)","v":"SICRO"},{"$f":"VLOOKUP($A102,Orçamento!$A$3:$J$126,3,FALSE)","v":4805757},{"$f":"VLOOKUP($A102,Orçamento!$A$3:$J$126,4,FALSE)","v":"Escavação mecânica de vala"},{"$f":"VLOOKUP($A102,Orçamento!$A$3:$J$126,5,FALSE)","v":"m³"},{"$f":"VLOOKUP($A102,Orçamento!$A$3:$J$126,6,FALSE)","v":2058},null,0,0,0,0,0,1372,686,0,0,0,0,0,0,0,0,null,0]
["4.2.7",{"$f":"VLOOKUP($A103,Orçamento!$A$3:$J$126,2,FALSE)","v":"SICRO"},{"$f":"VLOOKUP($A103,Orçamento!$A$3:$J$126,3,FALSE)","v":2004505},{"$f":"VLOOKUP($A103,Orçamento!$A$3:$J$126,4,FALSE)","v":"Reaterro e compactação em vala"},{"$f":"VLOOKUP($A103,Orçamento!$A$3:$J$126,5,FALSE)","v":"m³"},{"$f":"VLOOKUP($A103,Orçamento!$A$3:$J$126,6,FALSE)","v":704},null,0,0,0,0,0,0,0,176,176,176,176,0,0,0,0,null,0]
["4.2.8",{"$f":"VLOOKUP($A104,Orçamento!$A$3:$J$126,2,FALSE)","v":"SICRO"},{"$f":"VLOOKUP($A104,Orçamento!$A$3:$J$126,3,FALSE)","v":2003867},{"$f":"VLOOKUP($A104,Orçamento!$A$3:$J$126,4,FALSE)","v":"Aplicação de geotextil"},{"$f":"VLOOKUP($A104,Orçamento!$A$3:$J$126,5,FALSE)","v":"m²"},{"$f":"VLOOKUP($A104,Orçamento!$A$3:$J$126,6,FALSE)","v":14765},null,0,0,0,0,0,3691.25,3691.25,3691.25,3691.25,0,0,0,0,0,0,null,0]
["4.2.9",{"$f":"VLOOKUP($A105,Orçamento!$A$3:$J$126,2,FALSE)","v":"SICRO"},{"$f":"VLOOKUP($A105,Orçamento!$A$3:$J$126,3,FALSE)","v":407820},{"$f":"VLOOKUP($A105,Orçamento!$A$3:$J$126,4,FALSE)","v":"Armação em aço CA-60 "},{"$f":"VLOOKUP($A105,Orçamento!$A$3:$J$126,5,FALSE)","v":"kg"},{"$f":"VLOOKUP($A105,Orçamento!$A$3:$J$126,6,FALSE)","v":2655.4852500000002},null,0,0,0,0,0,663.87131250000004,663.87131250000004,663.87131250000004,663.87131250000004,0,0,0,0,0,0,null,0]
["4.2.10",{"$f":"VLOOKUP($A106,Orçamento!$A$3:$J$126,2,FALSE)","v":"SICRO"},{"$f":"VLOOKUP($A106,Orçamento!$A$3:$J$126,3,FALSE)","v":1516303},{"$f":"VLOOKUP($A106,Orçamento!$A$3:$J$126,4,FALSE)","v":"Geocélula de PEAD"},{"$f":"VLOOKUP($A106,Orçamento!$A$3:$J$126,5,FALSE)","v":"m²"},{"$f":"VLOOKUP($A106,Orçamento!$A$3:$J$126,6,FALSE)","v":14765},null,0,0,0,0,0,0,3691.25,3691.25,3691.25,3691.25,0,0,0,0,0,null,0]
["4.2.11",{"$f":"VLOOKUP($A107,Orçamento!$A$3:$J$126,2,FALSE)","v":"SICRO"},{"$f":"VLOOKUP($A107,Orçamento!$A$3:$J$126,3,FALSE)","v":2008091},{"$f":"VLOOKUP($A107,Orçamento!$A$3:$J$126,4,FALSE)","v":"Tubo PVC de ancoragem "},{"$f":"VLOOKUP($A107,Orçamento!$A$3:$J$126,5,FALSE)","v":"m"},{"$f":"VLOOKUP($A107,Orçamento!$A$3:$J$126,6,FALSE)","v":1759},null,0,0,0,0,0,0,439.75,439.75,439.75,439.75,0,0,0,0,0,null,0]
["4.2.12",{"$f":"VLOOKUP($A108,Orçamento!$A$3:$J$126,2,FALSE)","v":"SICRO"},{"$f":"VLOOKUP($A108,Orçamento!$A$3:$J$126,3,FALSE)","v":1106109},{"$f":"VLOOKUP($A108,Orçamento!$A$3:$J$126,4,FALSE)","v":"Concreto fck = 20 Mpa"},{"$f":"VLOOKUP($A108,Orçamento!$A$3:$J$126,5,FALSE)","v":"m³"},{"$f":"VLOOKUP($A108,Orçamento!$A$3:$J$126,6,FALSE)","v":2492.7590958118626},null,0,0,0,0,0,0,623.18977395296565,623.18977395296565,623.18977395296565,623.18977395296565,0,0,0,0,0,null,0]
["4.2.13",{"$f":"VLOOKUP($A109,Orçamento!$A$3:$J$126,2,FALSE)","v":"SICRO"},{"$f":"VLOOKUP($A109,Orçamento!$A$3:$J$126,3,FALSE)","v":1107860},{"$f":"VLOOKUP($A109,Orçamento!$A$3:$J$126,4,FALSE)","v":"Bombeamento"},{"$f":"VLOOKUP($A109,Orçamento!$A$3:$J$126,5,FALSE)","v":"m³"},{"$f":"VLOOKUP($A109,Orçamento!$A$3:$J$126,6,FALSE)","v":2492.7590958118626},null,0,0,0,0,0,0,623.18977395296565,623.18977395296565,623.18977395296565,623.18977395296565,0,0,0,0,0,null,0]
["4.2.14",{"$f":"VLOOKUP($A110,Orçamento!$A$3:$J$126,2,FALSE)","v":"SICRO"},{"$f":"VLOOKUP($A110,Orçamento!$A$3:$J$126,3,FALSE)","v":1100657},{"$f":"VLOOKUP($A110,Orçamento!$A$3:$J$126,4,FALSE)","v":"Adensamento de Concreto"},{"$f":"VLOOKUP($A110,Orçamento!$A$3:$J$126,5,FALSE)","v":"m³"},{"$f":"VLOOKUP($A110,Orçamento!$A$3:$J$126,6,FALSE)","v":2492.7590958118626},null,0,0,0,0,0,0,623.18977395296565,623.18977395296565,623.18977395296565,623.18977395296565,0,0,0,0,0,null,0]
["4.2.15",{"$f":"VLOOKUP($A111,Orçamento!$A$3:$J$126,2,FALSE)","v":"SICRO"},{"$f":"VLOOKUP($A111,Orçamento!$A$3:$J$126,3,FALSE)","v":1505877},{"$f":"VLOOKUP($A111,Orçamento!$A$3:$J$126,4,FALSE)","v":"Enrocamento de Proteção"},{"$f":"VLOOKUP($A111,Orçamento!$A$3:$J$126,5,FALSE)","v":"m³"},{"$f":"VLOOKUP($A111,Orçamento!$A$3:$J$126,6,FALSE)","v":1029},{"$nulls":7},{"$f":"F111/4","v":257.25},{"$f":"N111","v":257.25},{"$f":"O111","v":257.25},{"$f":"P111","v":257.25}]
[{"$nulls":5},{"$f":"Orçamento!F78","v":0},{"$nulls":17},0]
["4.3",null,null,"Crista",null,{"$f":"Orçamento!F79","v":0},null,0,0,0,0,0,0,0,0,0,0,0,0,0,0,0,null,0]
["4.3.1",{"$f":"VLOOKUP($A114,Orçamento!$A$3:$J$126,2,FALSE)","v":"SICRO"},{"$f":"VLOOKUP($A114,Orçamento!$A$3:$J$126,3,FALSE)","v":5502985},{"$f":"VLOOKUP($A114,Orçamento!$A$3:$J$126,4,FALSE)","v":"Limpeza da camada vegetal"},{"$f":"VLOOKUP($A114,Orçamento!$A$3:$J$126,5,FALSE)","v":"m²"},{"$f":"VLOOKUP($A114,Orçamento!$A$3:$J$126,6,FALSE)","v":7032},null,0,0,7032,0,0,0,0,0,0,0,0,0,0,0,0,null,0]
["4.3.2",{"$f":"VLOOKUP($A115,Orçamento!$A$3:$J$126,2,FALSE)","v":"SINAPI"},{"$f":"VLOOKUP($A115,Orçamento!$A$3:$J$126,3,FALSE)","v":98527},{"$f":"VLOOKUP($A115,Orçamento!$A$3:$J$126,4,FALSE)","v":"Remoção de raízes e cupinzeiros"},{"$f":"VLOOKUP($A115,Orçamento!$A$3:$J$126,5,FALSE)","v":"und"},{"$f":"VLOOKUP($A115,Orçamento!$A$3:$J$126,6,FALSE)","v":15},null,0,0,15,0,0,0,0,0,0,0,0,0,0,0,0,null,0]
["4.3.3",{"$f":"VLOOKUP($A116,Orçamento!$A$3:$J$126,2,FALSE)","v":"SICRO"},{"$f":"VLOOKUP($A116,Orçamento!$A$3:$J$126,3,FALSE)","v":4915625},{"$f":"VLOOKUP($A116,Orçamento!$A$3:$J$126,4,FALSE)","v":"Recomposição em Solo Cimento"},{"$f":"VLOOKUP($A116,Orçamento!$A$3:$J$126,5,FALSE)","v":"m³"},{"$f":"VLOOKUP($A116,Orçamento!$A$3:$J$126,6,FALSE)","v":15},null,0,0,15,0,0,0,0,0,0,0,0,0,0,0,0,null,0]
["4.3.4",{"$f":"VLOOKUP($A117,Orçamento!$A$3:$J$126,2,FALSE)","v":{"$error":"#N/A"}},{"$f":"VLOOKUP($A117,Orçamento!$A$3:$J$126,3,FALSE)","v":{"$error":"#N/A"}},{"$f":"VLOOKUP($A117,Orçamento!$A$3:$J$126,4,FALSE)","v":{"$error":"#N/A"}},{"$f":"VLOOKUP($A117,Orçamento!$A$3:$J$126,5,FALSE)","v":{"$error":"#N/A"}},{"$f":"VLOOKUP($A117,Orçamento!$A$3:$J$126,6,FALSE)","v":{"$error":"#N/A"}},null,0,0,{"$f":"F117","v":{"$error":"#N/A"}},0,0,0,0,0,0,0,0,0,0,0,0,null,{"$error":"#N/A"}]
["4.3.5",{"$f":"VLOOKUP($A118,Orçamento!$A$3:$J$126,2,FALSE)","v":"SICRO"},{"$f":"VLOOKUP($A118,Orçamento!$A$3:$J$126,3,FALSE)","v":4805754},{"$f":"VLOOKUP($A118,Orçamento!$A$3:$J$126,4,FALSE)","v":"Compactação Manual"},{"$f":"VLOOKUP($A118,Orçamento!$A$3:$J$126,5,FALSE)","v":"m³"},{"$f":"VLOOKUP($A118,Orçamento!$A$3:$J$126,6,FALSE)","v":15},null,0,0,15,0,0,0,0,0,0,0,0,0,0,0,0,null,0]
["4.3.6",{"$f":"VLOOKUP($A119,Orçamento!$A$3:$J$126,2,FALSE)","v":"SICRO"},{"$f":"VLOOKUP($A119,Orçamento!$A$3:$J$126,3,FALSE)","v":903845},{"$f":"VLOOKUP($A119,Orçamento!$A$3:$J$126,4,FALSE)","v":"Bica Corrida"},{"$f":"VLOOKUP($A119,Orçamento!$A$3:$J$126,5,FALSE)","v":"m³"},{"$f":"VLOOKUP($A119,Orçamento!$A$3:$J$126,6,FALSE)","v":1029},null,0,0,0,0,0,0,128.625,128.625,128.625,128.625,128.625,128.625,128.625,128.625,0,null,0]
["4.3.7",{"$f":"VLOOKUP($A120,Orçamento!$A$3:$J$126,2,FALSE)","v":"SICRO"},{"$f":"VLOOKUP($A120,Orçamento!$A$3:$J$126,3,FALSE)","v":2003939},{"$f":"VLOOKUP($A120,Orçamento!$A$3:$J$126,4,FALSE)","v":"Meio fio de concreto"},{"$f":"VLOOKUP($A120,Orçamento!$A$3:$J$126,5,FALSE)","v":"m"},{"$f":"VLOOKUP($A120,Orçamento!$A$3:$J$126,6,FALSE)","v":1759},null,0,0,0,0,0,0,219.875,219.875,219.875,219.875,219.875,219.875,219.875,219.875,0,null,0]
["4.3.8",{"$f":"VLOOKUP($A121,Orçamento!$A$3:$J$126,2,FALSE)","v":"SICRO"},{"$f":"VLOOKUP($A121,Orçamento!$A$3:$J$126,3,FALSE)","v":3713826},{"$f":"VLOOKUP($A121,Orçamento!$A$3:$J$126,4,FALSE)","v":"Barreira simples tipo New Jersey"},{"$f":"VLOOKUP($A121,Orçamento!$A$3:$J$126,5,FALSE)","v":"m"},{"$f":"VLOOKUP($A121,Orçamento!$A$3:$J$126,6,FALSE)","v":1759},null,0,0,0,0,0,0,219.875,219.875,219.875,219.875,219.875,219.875,219.875,219.875,0,null,0]
["4.3.9",{"$f":"VLOOKUP($A122,Orçamento!$A$3:$J$126,2,FALSE)","v":"SICRO"},{"$f":"VLOOKUP($A122,Orçamento!$A$3:$J$126,3,FALSE)","v":1106109},{"$f":"VLOOKUP($A122,Orçamento!$A$3:$J$126,4,FALSE)","v":"Concreto fck = 20 Mpa"},{"$f":"VLOOKUP($A122,Orçamento!$A$3:$J$126,5,FALSE)","v":"m³"},{"$f":"VLOOKUP($A122,Orçamento!$A$3:$J$126,6,FALSE)","v":337.20030000000003},null,0,0,0,0,0,0,42.150037500000003,42.150037500000003,42.150037500000003,42.150037500000003,42.150037500000003,42.150037500000003,42.150037500000003,42.150037500000003,0,null,0]
["4.3.10",{"$f":"VLOOKUP($A123,Orçamento!$A$3:$J$126,2,FALSE)","v":"SICRO"},{"$f":"VLOOKUP($A123,Orçamento!$A$3:$J$126,3,FALSE)","v":1106051},{"$f":"VLOOKUP($A123,Orçamento!$A$3:$J$126,4,FALSE)","v":"Lançamento livre de concreto"},{"$f":"VLOOKUP($A123,Orçamento!$A$3:$J$126,5,FALSE)","v":"m³"},{"$f":"VLOOKUP($A123,Orçamento!$A$3:$J$126,6,FALSE)","v":337.20030000000003},null,0,0,0,0,0,0,42.150037500000003,42.150037500000003,42.150037500000003,42.150037500000003,42.150037500000003,42.150037500000003,42.150037500000003,42.150037500000003,0,null,0]
["4.3.11",{"$f":"VLOOKUP($A124,Orçamento!$A$3:$J$126,2,FALSE)","v":"SICRO"},{"$f":"VLOOKUP($A124,Orçamento!$A$3:$J$126,3,FALSE)","v":1100657},{"$f":"VLOOKUP($A124,Orçamento!$A$3:$J$126,4,FALSE)","v":"Adensamento de Concreto"},{"$f":"VLOOKUP($A124,Orçamento!$A$3:$J$126,5,FALSE)","v":"m³"},{"$f":"VLOOKUP($A124,Orçamento!$A$3:$J$126,6,FALSE)","v":337.20030000000003},null,0,0,0,0,0,0,{"$f":"N123","v":42.150037500000003},{"$f":"O123","v":42.150037500000003},42.150037500000003,42.150037500000003,42.150037500000003,42.150037500000003,42.150037500000003,42.150037500000003,0]
[{"$nulls":5},{"$f":"Orçamento!F90","v":0},{"$nulls":17},0]
["4.4",null,null,"Jusante",null,{"$f":"Orçamento!F91","v":0},null,0,0,0,0,0,0,0,0,0,0,0,0,0,0,0,null,0]
["4.4.1",{"$f":"VLOOKUP($A127,Orçamento!$A$3:$J$126,2,FALSE)","v":"SICRO"},{"$f":"VLOOKUP($A127,Orçamento!$A$3:$J$126,3,FALSE)","v":5502985},{"$f":"VLOOKUP($A127,Orçamento!$A$3:$J$126,4,FALSE)","v":"Limpeza da camada vegetal"},{"$f":"VLOOKUP($A127,Orçamento!$A$3:$J$126,5,FALSE)","v":"m²"},{"$f":"VLOOKUP($A127,Orçamento!$A$3:$J$126,6,FALSE)","v":65800},null,0,0,9400,9400,9400,9400,9400,9400,9400,0,0,0,0,0,0,null,0]
["4.4.2",{"$f":"VLOOKUP($A128,Orçamento!$A$3:$J$126,2,FALSE)","v":"SINAPI"},{"$f":"VLOOKUP($A128,Orçamento!$A$3:$J$126,3,FALSE)","v":98527},{"$f":"VLOOKUP($A128,Orçamento!$A$3:$J$126,4,FALSE)","v":"Remoção de raízes e cupinzeiros"},{"$f":"VLOOKUP($A128,Orçamento!$A$3:$J$126,5,FALSE)","v":"und"},{"$f":"VLOOKUP($A128,Orçamento!$A$3:$J$126,6,FALSE)","v":132},null,0,0,19,19,19,19,19,19,18,0,0,0,0,0,0,null,0]
["4.4.3",{"$f":"VLOOKUP($A129,Orçamento!$A$3:$J$126,2,FALSE)","v":"SICRO"},{"$f":"VLOOKUP($A129,Orçamento!$A$3:$J$126,3,FALSE)","v":4915774},{"$f":"VLOOKUP($A129,Orçamento!$A$3:$J$126,4,FALSE)","v":"Recomposição de erosão "},{"$f":"VLOOKUP($A129,Orçamento!$A$3:$J$126,5,FALSE)","v":"m³"},{"$f":"VLOOKUP($A129,Orçamento!$A$3:$J$126,6,FALSE)","v":6712},null,0,0,0,958.85714285714289,958.85714285714289,958.85714285714289,958.85714285714289,958.85714285714289,958.85714285714289,958.85714285714289,0,0,0,0,0,null,0]
["4.4.4",{"$f":"VLOOKUP($A130,Orçamento!$A$3:$J$126,2,FALSE)","v":"SICRO"},{"$f":"VLOOKUP($A130,Orçamento!$A$3:$J$126,3,FALSE)","v":4805757},{"$f":"VLOOKUP($A130,Orçamento!$A$3:$J$126,4,FALSE)","v":"Escavação mecânica de vala "},{"$f":"VLOOKUP($A130,Orçamento!$A$3:$J$126,5,FALSE)","v":"m³"},{"$f":"VLOOKUP($A130,Orçamento!$A$3:$J$126,6,FALSE)","v":976},null,0,0,139.42857142857142,139.42857142857142,139.42857142857142,139.42857142857142,139.42857142857142,139.42857142857142,139.42857142857142,0,0,0,0,0,0,null,0]
["4.4.5",{"$f":"VLOOKUP($A131,Orçamento!$A$3:$J$126,2,FALSE)","v":"SICRO"},{"$f":"VLOOKUP($A131,Orçamento!$A$3:$J$126,3,FALSE)","v":1106109},{"$f":"VLOOKUP($A131,Orçamento!$A$3:$J$126,4,FALSE)","v":"Concreto fck = 20 Mpa"},{"$f":"VLOOKUP($A131,Orçamento!$A$3:$J$126,5,FALSE)","v":"m³"},{"$f":"VLOOKUP($A131,Orçamento!$A$3:$J$126,6,FALSE)","v":431.92500000000001},null,0,0,0,4333.6000000000004,4333.6000000000004,4333.6000000000004,4333.6000000000004,4333.6000000000004,4333.6000000000004,4333.6000000000004,4333.6000000000004,4333.6000000000004,4333.6000000000004,0,0,null,-42904.07499999999]
["4.4.6",{"$f":"VLOOKUP($A132,Orçamento!$A$3:$J$126,2,FALSE)","v":"SICRO"},{"$f":"VLOOKUP($A132,Orçamento!$A$3:$J$126,3,FALSE)","v":1107860},{"$f":"VLOOKUP($A132,Orçamento!$A$3:$J$126,4,FALSE)","v":"Bombeamento"},{"$f":"VLOOKUP($A132,Orçamento!$A$3:$J$126,5,FALSE)","v":"m³"},{"$f":"VLOOKUP($A132,Orçamento!$A$3:$J$126,6,FALSE)","v":431.92500000000001},null,0,0,0,779.39796000000001,779.39796000000001,779.39796000000001,779.39796000000001,779.39796000000001,779.39796000000001,779.39796000000001,779.39796000000001,779.39796000000001,779.39796000000001,0,0,null,-7362.0546000000013]
["4.4.7",{"$f":"VLOOKUP($A133,Orçamento!$A$3:$J$126,2,FALSE)","v":"SICRO"},{"$f":"VLOOKUP($A133,Orçamento!$A$3:$J$126,3,FALSE)","v":1100657},{"$f":"VLOOKUP($A133,Orçamento!$A$3:$J$126,4,FALSE)","v":"Adensamento de Concreto"},{"$f":"VLOOKUP($A133,Orçamento!$A$3:$J$126,5,FALSE)","v":"m³"},{"$f":"VLOOKUP($A133,Orçamento!$A$3:$J$126,6,FALSE)","v":431.92500000000001},null,0,0,0,0,4333.6000000000004,4333.6000000000004,4333.6000000000004,4333.6000000000004,4333.6000000000004,4333.6000000000004,4333.6000000000004,4333.6000000000004,4333.6000000000004,4333.6000000000004,0,null,-42904.07499999999]
["4.4.8",{"$f":"VLOOKUP($A134,Orçamento!$A$3:$J$126,2,FALSE)","v":"SICRO"},{"$f":"VLOOKUP($A134,Orçamento!$A$3:$J$126,3,FALSE)","v":4915625},{"$f":"VLOOKUP($A134,Orçamento!$A$3:$J$126,4,FALSE)","v":"Recomposição em Solo Cimento"},{"$f":"VLOOKUP($A134,Orçamento!$A$3:$J$126,5,FALSE)","v":"m³"},{"$f":"VLOOKUP($A134,Orçamento!$A$3:$J$126,6,FALSE)","v":2686.35},null,0,0,0,0,43.192500000000003,43.192500000000003,43.192500000000003,43.192500000000003,43.192500000000003,43.192500000000003,43.192500000000003,43.192500000000003,43.192500000000003,43.192500000000003,0,null,2254.4249999999997]
["4.4.9",{"$f":"VLOOKUP($A135,Orçamento!$A$3:$J$126,2,FALSE)","v":{"$error":"#N/A"}},{"$f":"VLOOKUP($A135,Orçamento!$A$3:$J$126,3,FALSE)","v":{"$error":"#N/A"}},{"$f":"VLOOKUP($A135,Orçamento!$A$3:$J$126,4,FALSE)","v":{"$error":"#N/A"}},{"$f":"VLOOKUP($A135,Orçamento!$A$3:$J$126,5,FALSE)","v":{"$error":"#N/A"}},{"$f":"VLOOKUP($A135,Orçamento!$A$3:$J$126,6,FALSE)","v":{"$error":"#N/A"}},null,0,0,0,0,43.192500000000003,43.192500000000003,43.192500000000003,43.192500000000003,43.192500000000003,43.192500000000003,43.192500000000003,43.192500000000003,43.192500000000003,43.192500000000003,0,null,{"$error":"#N/A"}]
["4.4.10",{"$f":"VLOOKUP($A136,Orçamento!$A$3:$J$126,2,FALSE)","v":"SICRO"},{"$f":"VLOOKUP($A136,Orçamento!$A$3:$J$126,3,FALSE)","v":4805754},{"$f":"VLOOKUP($A136,Orçamento!$A$3:$J$126,4,FALSE)","v":"Compactação Manual"},{"$f":"VLOOKUP($A136,Orçamento!$A$3:$J$126,5,FALSE)","v":"m³"},{"$f":"VLOOKUP($A136,Orçamento!$A$3:$J$126,6,FALSE)","v":2686.35},null,0,0,0,0,{"$f":"F136/10","v":268.63499999999999},{"$f":"L136","v":268.63499999999999},268.63499999999999,268.63499999999999,268.63499999999999,268.63499999999999,268.63499999999999,268.63499999999999,268.63499999999999,268.63499999999999,0,null,0]
["4.4.11",{"$f":"VLOOKUP($A137,Orçamento!$A$3:$J$126,2,FALSE)","v":"SICRO"},{"$f":"VLOOKUP($A137,Orçamento!$A$3:$J$126,3,FALSE)","v":2003850},{"$f":"VLOOKUP($A137,Orçamento!$A$3:$J$126,4,FALSE)","v":"Lastro de Brita"},{"$f":"VLOOKUP($A137,Orçamento!$A$3:$J$126,5,FALSE)","v":"m³"},{"$f":"VLOOKUP($A137,Orçamento!$A$3:$J$126,6,FALSE)","v":131.92499999999998},null,0,0,0,0,13.192499999999999,{"$f":"L137","v":13.192499999999999},13.192499999999999,13.192499999999999,13.192499999999999,13.192499999999999,13.192499999999999,13.192499999999999,13.192499999999999,13.192499999999999,0,null,0]
["4.4.12",{"$f":"VLOOKUP($A138,Orçamento!$A$3:$J$126,2,FALSE)","v":"SICRO"},{"$f":"VLOOKUP($A138,Orçamento!$A$3:$J$126,3,FALSE)","v":2003947},{"$f":"VLOOKUP($A138,Orçamento!$A$3:$J$126,4,FALSE)","v":"Meio fio de concreto"},{"$f":"VLOOKUP($A138,Orçamento!$A$3:$J$126,5,FALSE)","v":"m"},{"$f":"VLOOKUP($A138,Orçamento!$A$3:$J$126,6,FALSE)","v":1759},null,0,0,0,0,175.9,{"$f":"L138","v":175.9},175.9,175.9,175.9,175.9,175.9,175.9,175.9,175.9,0,null,0]
["4.4.13",{"$f":"VLOOKUP($A139,Orçamento!$A$3:$J$126,2,FALSE)","v":"SICRO"},{"$f":"VLOOKUP($A139,Orçamento!$A$3:$J$126,3,FALSE)","v":4915673},{"$f":"VLOOKUP($A139,Orçamento!$A$3:$J$126,4,FALSE)","v":"Revestimento vegetal com grama em mudas (superficies inclinadas)"},{"$f":"VLOOKUP($A139,Orçamento!$A$3:$J$126,5,FALSE)","v":"m²"},{"$f":"VLOOKUP($A139,Orçamento!$A$3:$J$126,6,FALSE)","v":43336},null,0,0,0,0,4333.6000000000004,{"$f":"L139","v":4333.6000000000004},4333.6000000000004,4333.6000000000004,4333.6000000000004,4333.6000000000004,4333.6000000000004,4333.6000000000004,4333.6000000000004,4333.6000000000004,0,null,{"$f":"F139-SUM(H139:V139)","v":0}]
["4.4.14",{"$f":"VLOOKUP($A140,Orçamento!$A$3:$J$126,2,FALSE)","v":{"$error":"#N/A"}},{"$f":"VLOOKUP($A140,Orçamento!$A$3:$J$126,3,FALSE)","v":{"$error":"#N/A"}},{"$f":"VLOOKUP($A140,Orçamento!$A$3:$J$126,4,FALSE)","v":{"$error":"#N/A"}},{"$f":"VLOOKUP($A140,Orçamento!$A$3:$J$126,5,FALSE)","v":{"$error":"#N/A"}},{"$f":"VLOOKUP($A140,Orçamento!$A$3:$J$126,6,FALSE)","v":{"$error":"#N/A"}},null,0,0,0,0,{"$error":"#N/A"},{"$f":"L140","v":{"$error":"#N/A"}},{"$error":"#N/A"},{"$error":"#N/A"},{"$error":"#N/A"},{"$error":"#N/A"},{"$error":"#N/A"},{"$error":"#N/A"},{"$error":"#N/A"},{"$error":"#N/A"},0,null,{"$error":"#N/A"}]
["4.4.15",{"$f":"VLOOKUP($A141,Orçamento!$A$3:$J$126,2,FALSE)","v":{"$error":"#N/A"}},{"$f":"VLOOKUP($A141,Orçamento!$A$3:$J$126,3,FALSE)","v":{"$error":"#N/A"}},{"$f":"VLOOKUP($A141,Orçamento!$A$3:$J$126,4,FALSE)","v":{"$error":"#N/A"}},{"$f":"VLOOKUP($A141,Orçamento!$A$3:$J$126,5,FALSE)","v":{"$error":"#N/A"}},{"$f":"VLOOKUP($A141,Orçamento!$A$3:$J$126,6,FALSE)","v":{"$error":"#N/A"}},{"$nulls":5},{"$error":"#N/A"},{"$f":"L141","v":{"$error":"#N/A"}},{"$error":"#N/A"},{"$error":"#N/A"},{"$error":"#N/A"},{"$error":"#N/A"},{"$error":"#N/A"},{"$error":"#N/A"},{"$error":"#N/A"},{"$error":"#N/A"},null,null,{"$error":"#N/A"}]
[{"$nulls":5},{"$f":"Orçamento!F104","v":0},{"$nulls":17},0]
["4.5",null,null,"Drenagem Superficial",null,{"$f":"Orçamento!F105","v":0},null,0,0,0,0,0,0,0,0,0,0,0,0,0,0,0,null,0]
["4.5.1",{"$f":"VLOOKUP($A144,Orçamento!$A$3:$J$126,2,FALSE)","v":"SICRO"},{"$f":"VLOOKUP($A144,Orçamento!$A$3:$J$126,3,FALSE)","v":4915711},{"$f":"VLOOKUP($A144,Orçamento!$A$3:$J$126,4,FALSE)","v":"Limpeza de Descida d'água"},{"$f":"VLOOKUP($A144,Orçamento!$A$3:$J$126,5,FALSE)","v":"m"},{"$f":"VLOOKUP($A144,Orçamento!$A$3:$J$126,6,FALSE)","v":482},null,0,0,0,0,0,0,0,60.25,60.25,60.25,60.25,60.25,60.25,60.25,60.25,null,0]
["4.5.2",{"$f":"VLOOKUP($A145,Orçamento!$A$3:$J$126,2,FALSE)","v":"SICRO"},{"$f":"VLOOKUP($A145,Orçamento!$A$3:$J$126,3,FALSE)","v":2003353},{"$f":"VLOOKUP($A145,Orçamento!$A$3:$J$126,4,FALSE)","v":"Valeta trapezoidal de concreto "},{"$f":"VLOOKUP($A145,Orçamento!$A$3:$J$126,5,FALSE)","v":"m"},{"$f":"VLOOKUP($A145,Orçamento!$A$3:$J$126,6,FALSE)","v":1848},null,0,0,0,0,0,0,0,231,231,231,231,231,231,231,231,null,0]
["4.5.3",{"$f":"VLOOKUP($A146,Orçamento!$A$3:$J$126,2,FALSE)","v":"SICRO"},{"$f":"VLOOKUP($A146,Orçamento!$A$3:$J$126,3,FALSE)","v":2003477},{"$f":"VLOOKUP($A146,Orçamento!$A$3:$J$126,4,FALSE)","v":"Caixa Coletora "},{"$f":"VLOOKUP($A146,Orçamento!$A$3:$J$126,5,FALSE)","v":"und"},{"$f":"VLOOKUP($A146,Orçamento!$A$3:$J$126,6,FALSE)","v":18},null,0,0,0,0,0,0,0,0,0,3,3,3,3,3,3,null,0]
["4.5.4",{"$f":"VLOOKUP($A147,Orçamento!$A$3:$J$126,2,FALSE)","v":"SICRO"},{"$f":"VLOOKUP($A147,Orçamento!$A$3:$J$126,3,FALSE)","v":804021},{"$f":"VLOOKUP($A147,Orçamento!$A$3:$J$126,4,FALSE)","v":"BSTC 600mm"},{"$f":"VLOOKUP($A147,Orçamento!$A$3:$J$126,5,FALSE)","v":"m"},{"$f":"VLOOKUP($A147,Orçamento!$A$3:$J$126,6,FALSE)","v":24},null,0,0,0,0,0,0,0,0,0,4,4,4,4,4,4,null,0]
["4.5.5",{"$f":"VLOOKUP($A148,Orçamento!$A$3:$J$126,2,FALSE)","v":"SICRO"},{"$f":"VLOOKUP($A148,Orçamento!$A$3:$J$126,3,FALSE)","v":804037},{"$f":"VLOOKUP($A148,Orçamento!$A$3:$J$126,4,FALSE)","v":"Corpo BSTC 1000mm"},{"$f":"VLOOKUP($A148,Orçamento!$A$3:$J$126,5,FALSE)","v":"m"},{"$f":"VLOOKUP($A148,Orçamento!$A$3:$J$126,6,FALSE)","v":20},{"$nulls":11},5,5,5,5,null,null,0]
["4.5.6",{"$f":"VLOOKUP($A149,Orçamento!$A$3:$J$126,2,FALSE)","v":"SICRO"},{"$f":"VLOOKUP($A149,Orçamento!$A$3:$J$126,3,FALSE)","v":804393},{"$f":"VLOOKUP($A149,Orçamento!$A$3:$J$126,4,FALSE)","v":"Boca BSTC 1000mm"},{"$f":"VLOOKUP($A149,Orçamento!$A$3:$J$126,5,FALSE)","v":"und"},{"$f":"VLOOKUP($A149,Orçamento!$A$3:$J$126,6,FALSE)","v":2},{"$nulls":11},1,null,null,1,null,null,0]
["4.5.7",{"$f":"VLOOKUP($A150,Orçamento!$A$3:$J$126,2,FALSE)","v":"SICRO"},{"$f":"VLOOKUP($A150,Orçamento!$A$3:$J$126,3,FALSE)","v":804189},{"$f":"VLOOKUP($A150,Orçamento!$A$3:$J$126,4,FALSE)","v":"Corpo BDTC 1000mm"},{"$f":"VLOOKUP($A150,Orçamento!$A$3:$J$126,5,FALSE)","v":"m"},{"$f":"VLOOKUP($A150,Orçamento!$A$3:$J$126,6,FALSE)","v":20},{"$nulls":11},5,5,5,5,null,null,0]
["4.5.8",{"$f":"VLOOKUP($A151,Orçamento!$A$3:$J$126,2,FALSE)","v":"SICRO"},{"$f":"VLOOKUP($A151,Orçamento!$A$3:$J$126,3,FALSE)","v":804417},{"$f":"VLOOKUP($A151,Orçamento!$A$3:$J$126,4,FALSE)","v":"Boca BDTC 1000mm"},{"$f":"VLOOKUP($A151,Orçamento!$A$3:$J$126,5,FALSE)","v":"und"},{"$f":"VLOOKUP($A151,Orçamento!$A$3:$J$126,6,FALSE)","v":2},{"$nulls":11},1,null,null,1,null,null,0]
["4.5.9",{"$f":"VLOOKUP($A152,Orçamento!$A$3:$J$126,2,FALSE)","v":"SICRO"},{"$f":"VLOOKUP($A152,Orçamento!$A$3:$J$126,3,FALSE)","v":2003453},{"$f":"VLOOKUP($A152,Orçamento!$A$3:$J$126,4,FALSE)","v":"Dissipador de Energia"},{"$f":"VLOOKUP($A152,Orçamento!$A$3:$J$126,5,FALSE)","v":"und"},{"$f":"VLOOKUP($A152,Orçamento!$A$3:$J$126,6,FALSE)","v":18},null,0,0,0,0,0,0,0,0,0,0,0,0,6,6,6,null,0]
[{"$nulls":5},{"$f":"Orçamento!F115","v":0},{"$nulls":17},0]
[5,null,null,"Descarregador de Fundo",null,{"$f":"Orçamento!#REF!","v":{"$error":"#REF!"}},null,0,0,0,0,0,0,0,0,0,0,0,0,0,0,0,null,{"$error":"#REF!"}]
["5.1",null,null,"Bloco de Ancoragem das Válvulas",null,{"$f":"Orçamento!#REF!","v":{"$error":"#REF!"}},null,0,0,0,0,0,0,0,0,0,0,0,0,0,0,0,null,{"$error":"#REF!"}]
["5.1.1",{"$f":"VLOOKUP($A156,Orçamento!$A$3:$J$126,2,FALSE)","v":{"$error":"#N/A"}},{"$f":"VLOOKUP($A156,Orçamento!$A$3:$J$126,3,FALSE)","v":{"$error":"#N/A"}},{"$f":"VLOOKUP($A156,Orçamento!$A$3:$J$126,4,FALSE)","v":{"$error":"#N/A"}},{"$f":"VLOOKUP($A156,Orçamento!$A$3:$J$126,5,FALSE)","v":{"$error":"#N/A"}},{"$f":"VLOOKUP($A156,Orçamento!$A$3:$J$126,6,FALSE)","v":{"$error":"#N/A"}},null,0,0,0,0,45,45,0,0,0,0,0,0,0,0,0,null,{"$error":"#N/A"}]
["5.1.2",{"$f":"VLOOKUP($A157,Orçamento!$A$3:$J$126,2,FALSE)","v":{"$error":"#N/A"}},{"$f":"VLOOKUP($A157,Orçamento!$A$3:$J$126,3,FALSE)","v":{"$error":"#N/A"}},{"$f":"VLOOKUP($A157,Orçamento!$A$3:$J$126,4,FALSE)","v":{"$error":"#N/A"}},{"$f":"VLOOKUP($A157,Orçamento!$A$3:$J$126,5,FALSE)","v":{"$error":"#N/A"}},{"$f":"VLOOKUP($A157,Orçamento!$A$3:$J$126,6,FALSE)","v":{"$error":"#N/A"}},null,0,0,0,0,4.5,4.5,0,0,0,0,0,0,0,0,0,null,{"$error":"#N/A"}]
["5.1.3",{"$f":"VLOOKUP($A158,Orçamento!$A$3:$J$126,2,FALSE)","v":{"$error":"#N/A"}},{"$f":"VLOOKUP($A158,Orçamento!$A$3:$J$126,3,FALSE)","v":{"$error":"#N/A"}},{"$f":"VLOOKUP($A158,Orçamento!$A$3:$J$126,4,FALSE)","v":{"$error":"#N/A"}},{"$f":"VLOOKUP($A158,Orçamento!$A$3:$J$126,5,FALSE)","v":{"$error":"#N/A"}},{"$f":"VLOOKUP($A158,Orçamento!$A$3:$J$126,6,FALSE)","v":{"$error":"#N/A"}},null,0,0,0,0,0,6,0,0,0,0,0,0,0,0,0,null,{"$error":"#N/A"}]
["5.1.4",{"$f":"VLOOKUP($A159,Orçamento!$A$3:$J$126,2,FALSE)","v":{"$error":"#N/A"}},{"$f":"VLOOKUP($A159,Orçamento!$A$3:$J$126,3,FALSE)","v":{"$error":"#N/A"}},{"$f":"VLOOKUP($A159,Orçamento!$A$3:$J$126,4,FALSE)","v":{"$error":"#N/A"}},{"$f":"VLOOKUP($A159,Orçamento!$A$3:$J$126,5,FALSE)","v":{"$error":"#N/A"}},{"$f":"VLOOKUP($A159,Orçamento!$A$3:$J$126,6,FALSE)","v":{"$error":"#N/A"}},null,0,0,0,0,0,1,0,0,0,0,0,0,0,0,0,null,{"$error":"#N/A"}]
["5.1.5",{"$f":"VLOOKUP($A160,Orçamento!$A$3:$J$126,2,FALSE)","v":{"$error":"#N/A"}},{"$f":"VLOOKUP($A160,Orçamento!$A$3:$J$126,3,FALSE)","v":{"$error":"#N/A"}},{"$f":"VLOOKUP($A160,Orçamento!$A$3:$J$126,4,FALSE)","v":{"$error":"#N/A"}},{"$f":"VLOOKUP($A160,Orçamento!$A$3:$J$126,5,FALSE)","v":{"$error":"#N/A"}},{"$f":"VLOOKUP($A160,Orçamento!$A$3:$J$126,6,FALSE)","v":{"$error":"#N/A"}},null,0,0,0,0,0,0,{"$f":"F160","v":{"$error":"#N/A"}},0,0,0,0,0,0,0,0,null,{"$error":"#N/A"}]
["5.1.6",{"$f":"VLOOKUP($A161,Orçamento!$A$3:$J$126,2,FALSE)","v":{"$error":"#N/A"}},{"$f":"VLOOKUP($A161,Orçamento!$A$3:$J$126,3,FALSE)","v":{"$error":"#N/A"}},{"$f":"VLOOKUP($A161,Orçamento!$A$3:$J$126,4,FALSE)","v":{"$error":"#N/A"}},{"$f":"VLOOKUP($A161,Orçamento!$A$3:$J$126,5,FALSE)","v":{"$error":"#N/A"}},{"$f":"VLOOKUP($A161,Orçamento!$A$3:$J$126,6,FALSE)","v":{"$error":"#N/A"}},null,0,0,0,0,0,0,{"$f":"F161","v":{"$error":"#N/A"}},0,0,0,0,0,0,0,0,null,{"$error":"#N/A"}]
["5.1.7",{"$f":"VLOOKUP($A162,Orçamento!$A$3:$J$126,2,FALSE)","v":{"$error":"#N/A"}},{"$f":"VLOOKUP($A162,Orçamento!$A$3:$J$126,3,FALSE)","v":{"$error":"#N/A"}},{"$f":"VLOOKUP($A162,Orçamento!$A$3:$J$126,4,FALSE)","v":{"$error":"#N/A"}},{"$f":"VLOOKUP($A162,Orçamento!$A$3:$J$126,5,FALSE)","v":{"$error":"#N/A"}},{"$f":"VLOOKUP($A162,Orçamento!$A$3:$J$126,6,FALSE)","v":{"$error":"#N/A"}},null,0,0,0,0,0,0,23.2,0,0,0,0,0,0,0,0,null,{"$error":"#N/A"}]
["5.1.8",{"$f":"VLOOKUP($A163,Orçamento!$A$3:$J$126,2,FALSE)","v":{"$error":"#N/A"}},{"$f":"VLOOKUP($A163,Orçamento!$A$3:$J$126,3,FALSE)","v":{"$error":"#N/A"}},{"$f":"VLOOKUP($A163,Orçamento!$A$3:$J$126,4,FALSE)","v":{"$error":"#N/A"}},{"$f":"VLOOKUP($A163,Orçamento!$A$3:$J$126,5,FALSE)","v":{"$error":"#N/A"}},{"$f":"VLOOKUP($A163,Orçamento!$A$3:$J$126,6,FALSE)","v":{"$error":"#N/A"}},null,0,0,0,0,0,0,24.2,0,0,0,0,0,0,0,0,null,{"$error":"#N/A"}]
["5.1.9",{"$f":"VLOOKUP($A164,Orçamento!$A$3:$J$126,2,FALSE)","v":{"$error":"#N/A"}},{"$f":"VLOOKUP($A164,Orçamento!$A$3:$J$126,3,FALSE)","v":{"$error":"#N/A"}},{"$f":"VLOOKUP($A164,Orçamento!$A$3:$J$126,4,FALSE)","v":{"$error":"#N/A"}},{"$f":"VLOOKUP($A164,Orçamento!$A$3:$J$126,5,FALSE)","v":{"$error":"#N/A"}},{"$f":"VLOOKUP($A164,Orçamento!$A$3:$J$126,6,FALSE)","v":{"$error":"#N/A"}},null,0,0,0,0,0,0,0,{"$f":"F164","v":{"$error":"#N/A"}},0,0,0,0,0,0,0,null,{"$error":"#N/A"}]
["5.1.10",{"$f":"VLOOKUP($A165,Orçamento!$A$3:$J$126,2,FALSE)","v":{"$error":"#N/A"}},{"$f":"VLOOKUP($A165,Orçamento!$A$3:$J$126,3,FALSE)","v":{"$error":"#N/A"}},{"$f":"VLOOKUP($A165,Orçamento!$A$3:$J$126,4,FALSE)","v":{"$error":"#N/A"}},{"$f":"VLOOKUP($A165,Orçamento!$A$3:$J$126,5,FALSE)","v":{"$error":"#N/A"}},{"$f":"VLOOKUP($A165,Orçamento!$A$3:$J$126,6,FALSE)","v":{"$error":"#N/A"}},null,0,0,0,0,0,0,0,{"$f":"F165","v":{"$error":"#N/A"}},0,0,0,0,0,0,0,null,{"$error":"#N/A"}]
["5.1.11",{"$f":"VLOOKUP($A166,Orçamento!$A$3:$J$126,2,FALSE)","v":{"$error":"#N/A"}},{"$f":"VLOOKUP($A166,Orçamento!$A$3:$J$126,3,FALSE)","v":{"$error":"#N/A"}},{"$f":"VLOOKUP($A166,Orçamento!$A$3:$J$126,4,FALSE)","v":{"$error":"#N/A"}},{"$f":"VLOOKUP($A166,Orçamento!$A$3:$J$126,5,FALSE)","v":{"$error":"#N/A"}},{"$f":"VLOOKUP($A166,Orçamento!$A$3:$J$126,6,FALSE)","v":{"$error":"#N/A"}},{"$nulls":8},{"$f":"F166","v":{"$error":"#N/A"}}]
[]
["5.2",null,null,{"$f":"Orçamento!#REF!","v":{"$error":"#REF!"}},null,{"$f":"Orçamento!#REF!","v":{"$error":"#REF!"}},null,0,0,0,0,0,0,0,0,0,0,0,0,0,0,0,null,{"$f":"F168-SUM(H168:V168)","v":{"$error":"#REF!"}}]
["5.2.1",{"$f":"VLOOKUP($A169,Orçamento!$A$3:$J$126,2,FALSE)","v":{"$error":"#N/A"}},{"$f":"VLOOKUP($A169,Orçamento!$A$3:$J$126,3,FALSE)","v":{"$error":"#N/A"}},{"$f":"VLOOKUP($A169,Orçamento!$A$3:$J$126,4,FALSE)","v":{"$error":"#N/A"}},{"$f":"VLOOKUP($A169,Orçamento!$A$3:$J$126,5,FALSE)","v":{"$error":"#N/A"}},{"$f":"VLOOKUP($A169,Orçamento!$A$3:$J$126,6,FALSE)","v":{"$error":"#N/A"}},null,0,0,0,0,0,0,0,0,0,0,0,1,0,0,0]
["5.2.2",{"$f":"VLOOKUP($A170,Orçamento!$A$3:$J$126,2,FALSE)","v":{"$error":"#N/A"}},{"$f":"VLOOKUP($A170,Orçamento!$A$3:$J$126,3,FALSE)","v":{"$error":"#N/A"}},{"$f":"VLOOKUP($A170,Orçamento!$A$3:$J$126,4,FALSE)","v":{"$error":"#N/A"}},{"$f":"VLOOKUP($A170,Orçamento!$A$3:$J$126,5,FALSE)","v":{"$error":"#N/A"}},{"$f":"VLOOKUP($A170,Orçamento!$A$3:$J$126,6,FALSE)","v":{"$error":"#N/A"}},null,0,0,0,0,0,0,0,0,0,0,0,2,0,0,0]
["5.2.3",{"$f":"VLOOKUP($A171,Orçamento!$A$3:$J$126,2,FALSE)","v":{"$error":"#N/A"}},{"$f":"VLOOKUP($A171,Orçamento!$A$3:$J$126,3,FALSE)","v":{"$error":"#N/A"}},{"$f":"VLOOKUP($A171,Orçamento!$A$3:$J$126,4,FALSE)","v":{"$error":"#N/A"}},{"$f":"VLOOKUP($A171,Orçamento!$A$3:$J$126,5,FALSE)","v":{"$error":"#N/A"}},{"$f":"VLOOKUP($A171,Orçamento!$A$3:$J$126,6,FALSE)","v":{"$error":"#N/A"}},null,0,0,0,0,0,0,0,0,0,0,0,2,0,0,0]
["5.2.4",{"$f":"VLOOKUP($A172,Orçamento!$A$3:$J$126,2,FALSE)","v":{"$error":"#N/A"}},{"$f":"VLOOKUP($A172,Orçamento!$A$3:$J$126,3,FALSE)","v":{"$error":"#N/A"}},{"$f":"VLOOKUP($A172,Orçamento!$A$3:$J$126,4,FALSE)","v":{"$error":"#N/A"}},{"$f":"VLOOKUP($A172,Orçamento!$A$3:$J$126,5,FALSE)","v":{"$error":"#N/A"}},{"$f":"VLOOKUP($A172,Orçamento!$A$3:$J$126,6,FALSE)","v":{"$error":"#N/A"}},null,0,0,0,0,0,0,0,0,0,0,0,2,0,0,0]
["5.2.5",{"$f":"VLOOKUP($A173,Orçamento!$A$3:$J$126,2,FALSE)","v":{"$error":"#N/A"}},{"$f":"VLOOKUP($A173,Orçamento!$A$3:$J$126,3,FALSE)","v":{"$error":"#N/A"}},{"$f":"VLOOKUP($A173,Orçamento!$A$3:$J$126,4,FALSE)","v":{"$error":"#N/A"}},{"$f":"VLOOKUP($A173,Orçamento!$A$3:$J$126,5,FALSE)","v":{"$error":"#N/A"}},{"$f":"VLOOKUP($A173,Orçamento!$A$3:$J$126,6,FALSE)","v":{"$error":"#N/A"}},null,0,0,0,0,0,0,0,0,0,0,0,2,0,0,0]
["5.2.6",{"$f":"VLOOKUP($A174,Orçamento!$A$3:$J$126,2,FALSE)","v":{"$error":"#N/A"}},{"$f":"VLOOKUP($A174,Orçamento!$A$3:$J$126,3,FALSE)","v":{"$error":"#N/A"}},{"$f":"VLOOKUP($A174,Orçamento!$A$3:$J$126,4,FALSE)","v":{"$error":"#N/A"}},{"$f":"VLOOKUP($A174,Orçamento!$A$3:$J$126,5,FALSE)","v":{"$error":"#N/A"}},{"$f":"VLOOKUP($A174,Orçamento!$A$3:$J$126,6,FALSE)","v":{"$error":"#N/A"}},null,0,0,0,0,0,0,0,0,0,0,0,0,0,1,0]
["5.2.7",{"$f":"VLOOKUP($A175,Orçamento!$A$3:$J$126,2,FALSE)","v":{"$error":"#N/A"}},{"$f":"VLOOKUP($A175,Orçamento!$A$3:$J$126,3,FALSE)","v":{"$error":"#N/A"}},{"$f":"VLOOKUP($A175,Orçamento!$A$3:$J$126,4,FALSE)","v":{"$error":"#N/A"}},{"$f":"VLOOKUP($A175,Orçamento!$A$3:$J$126,5,FALSE)","v":{"$error":"#N/A"}},{"$f":"VLOOKUP($A175,Orçamento!$A$3:$J$126,6,FALSE)","v":{"$error":"#N/A"}},null,0,0,0,0,0,0,0,0,0,0,0,0,1,0,0]
["5.2.8",{"$f":"VLOOKUP($A176,Orçamento!$A$3:$J$126,2,FALSE)","v":{"$error":"#N/A"}},{"$f":"VLOOKUP($A176,Orçamento!$A$3:$J$126,3,FALSE)","v":{"$error":"#N/A"}},{"$f":"VLOOKUP($A176,Orçamento!$A$3:$J$126,4,FALSE)","v":{"$error":"#N/A"}},{"$f":"VLOOKUP($A176,Orçamento!$A$3:$J$126,5,FALSE)","v":{"$error":"#N/A"}},{"$f":"VLOOKUP($A176,Orçamento!$A$3:$J$126,6,FALSE)","v":{"$error":"#N/A"}},null,0,0,0,0,0,0,0,0,0,0,0,0,1,0,0]
["5.2.9",{"$f":"VLOOKUP($A177,Orçamento!$A$3:$J$126,2,FALSE)","v":{"$error":"#N/A"}},{"$f":"VLOOKUP($A177,Orçamento!$A$3:$J$126,3,FALSE)","v":{"$error":"#N/A"}},{"$f":"VLOOKUP($A177,Orçamento!$A$3:$J$126,4,FALSE)","v":{"$error":"#N/A"}},{"$f":"VLOOKUP($A177,Orçamento!$A$3:$J$126,5,FALSE)","v":{"$error":"#N/A"}},{"$f":"VLOOKUP($A177,Orçamento!$A$3:$J$126,6,FALSE)","v":{"$error":"#N/A"}},null,0,0,0,0,0,0,0,0,0,0,0,0,0,1,0]
["5.2.10",{"$f":"VLOOKUP($A178,Orçamento!$A$3:$J$126,2,FALSE)","v":{"$error":"#N/A"}},{"$f":"VLOOKUP($A178,Orçamento!$A$3:$J$126,3,FALSE)","v":{"$error":"#N/A"}},{"$f":"VLOOKUP($A178,Orçamento!$A$3:$J$126,4,FALSE)","v":{"$error":"#N/A"}},{"$f":"VLOOKUP($A178,Orçamento!$A$3:$J$126,5,FALSE)","v":{"$error":"#N/A"}},{"$f":"VLOOKUP($A178,Orçamento!$A$3:$J$126,6,FALSE)","v":{"$error":"#N/A"}},null,0,0,0,0,0,0,0,0,0,0,0,0,1,0,0]
["5.2.11",{"$f":"VLOOKUP($A179,Orçamento!$A$3:$J$126,2,FALSE)","v":{"$error":"#N/A"}},{"$f":"VLOOKUP($A179,Orçamento!$A$3:$J$126,3,FALSE)","v":{"$error":"#N/A"}},{"$f":"VLOOKUP($A179,Orçamento!$A$3:$J$126,4,FALSE)","v":{"$error":"#N/A"}},{"$f":"VLOOKUP($A179,Orçamento!$A$3:$J$126,5,FALSE)","v":{"$error":"#N/A"}},{"$f":"VLOOKUP($A179,Orçamento!$A$3:$J$126,6,FALSE)","v":{"$error":"#N/A"}},null,0,0,0,0,0,0,0,0,0,0,0,0,2,0,0]
["5.2.12",{"$f":"VLOOKUP($A180,Orçamento!$A$3:$J$126,2,FALSE)","v":{"$error":"#N/A"}},{"$f":"VLOOKUP($A180,Orçamento!$A$3:$J$126,3,FALSE)","v":{"$error":"#N/A"}},{"$f":"VLOOKUP($A180,Orçamento!$A$3:$J$126,4,FALSE)","v":{"$error":"#N/A"}},{"$f":"VLOOKUP($A180,Orçamento!$A$3:$J$126,5,FALSE)","v":{"$error":"#N/A"}},{"$f":"VLOOKUP($A180,Orçamento!$A$3:$J$126,6,FALSE)","v":{"$error":"#N/A"}},null,0,0,0,0,0,0,0,0,0,0,0,0,1,0,0]
["5.2.13",{"$f":"VLOOKUP($A181,Orçamento!$A$3:$J$126,2,FALSE)","v":{"$error":"#N/A"}},{"$f":"VLOOKUP($A181,Orçamento!$A$3:$J$126,3,FALSE)","v":{"$error":"#N/A"}},{"$f":"VLOOKUP($A181,Orçamento!$A$3:$J$126,4,FALSE)","v":{"$error":"#N/A"}},{"$f":"VLOOKUP($A181,Orçamento!$A$3:$J$126,5,FALSE)","v":{"$error":"#N/A"}},{"$f":"VLOOKUP($A181,Orçamento!$A$3:$J$126,6,FALSE)","v":{"$error":"#N/A"}},null,0,0,0,0,0,0,0,0,0,0,0,0,2,0,0]
["5.2.14",{"$f":"VLOOKUP($A182,Orçamento!$A$3:$J$126,2,FALSE)","v":{"$error":"#N/A"}},{"$f":"VLOOKUP($A182,Orçamento!$A$3:$J$126,3,FALSE)","v":{"$error":"#N/A"}},{"$f":"VLOOKUP($A182,Orçamento!$A$3:$J$126,4,FALSE)","v":{"$error":"#N/A"}},{"$f":"VLOOKUP($A182,Orçamento!$A$3:$J$126,5,FALSE)","v":{"$error":"#N/A"}},{"$f":"VLOOKUP($A182,Orçamento!$A$3:$J$126,6,FALSE)","v":{"$error":"#N/A"}},null,0,0,0,0,0,0,0,0,0,0,0,0,0,1,0]
["5.2.15",{"$f":"VLOOKUP($A183,Orçamento!$A$3:$J$126,2,FALSE)","v":{"$error":"#N/A"}},{"$f":"VLOOKUP($A183,Orçamento!$A$3:$J$126,3,FALSE)","v":{"$error":"#N/A"}},{"$f":"VLOOKUP($A183,Orçamento!$A$3:$J$126,4,FALSE)","v":{"$error":"#N/A"}},{"$f":"VLOOKUP($A183,Orçamento!$A$3:$J$126,5,FALSE)","v":{"$error":"#N/A"}},{"$f":"VLOOKUP($A183,Orçamento!$A$3:$J$126,6,FALSE)","v":{"$error":"#N/A"}},null,0,0,0,0,0,0,0,0,0,0,0,0,2,0,0]
[{"$nulls":5},{"$f":"Orçamento!#REF!","v":{"$error":"#REF!"}},{"$nulls":17},{"$error":"#REF!"}]
[6,null,null,"Momento de Transporte",null,{"$f":"Orçamento!F116","v":0},null,0,0,0,0,0,0,0,0,0,0,0,0,0,0,0,null,0]
["6.1",{"$f":"VLOOKUP($A186,Orçamento!$A$3:$J$126,2,FALSE)","v":{"$error":"#N/A"}},{"$f":"VLOOKUP($A186,Orçamento!$A$3:$J$126,3,FALSE)","v":{"$error":"#N/A"}},{"$f":"VLOOKUP($A186,Orçamento!$A$3:$J$126,4,FALSE)","v":{"$error":"#N/A"}},{"$f":"VLOOKUP($A186,Orçamento!$A$3:$J$126,5,FALSE)","v":{"$error":"#N/A"}},{"$f":"VLOOKUP($A186,Orçamento!$A$3:$J$126,6,FALSE)","v":{"$error":"#N/A"}},null,0,0,0,0,0,0,0,{"$f":"F186","v":{"$error":"#N/A"}},0,0,0,0,0,0,0,null,{"$error":"#N/A"}]
["6.2",{"$f":"VLOOKUP($A187,Orçamento!$A$3:$J$126,2,FALSE)","v":{"$error":"#N/A"}},{"$f":"VLOOKUP($A187,Orçamento!$A$3:$J$126,3,FALSE)","v":{"$error":"#N/A"}},{"$f":"VLOOKUP($A187,Orçamento!$A$3:$J$126,4,FALSE)","v":{"$error":"#N/A"}},{"$f":"VLOOKUP($A187,Orçamento!$A$3:$J$126,5,FALSE)","v":{"$error":"#N/A"}},{"$f":"VLOOKUP($A187,Orçamento!$A$3:$J$126,6,FALSE)","v":{"$error":"#N/A"}},null,0,0,0,0,2642.53108821975,2703.7114109197501,45009.51213694935,43906.380264675106,43906.380264675106,43906.380264675106,36647.576411186856,36647.576411186856,36647.576411186856,5221.01504709855,0,null,{"$error":"#N/A"}]
["6.3",{"$f":"VLOOKUP($A188,Orçamento!$A$3:$J$126,2,FALSE)","v":{"$error":"#N/A"}},{"$f":"VLOOKUP($A188,Orçamento!$A$3:$J$126,3,FALSE)","v":{"$error":"#N/A"}},{"$f":"VLOOKUP($A188,Orçamento!$A$3:$J$126,4,FALSE)","v":{"$error":"#N/A"}},{"$f":"VLOOKUP($A188,Orçamento!$A$3:$J$126,5,FALSE)","v":{"$error":"#N/A"}},{"$f":"VLOOKUP($A188,Orçamento!$A$3:$J$126,6,FALSE)","v":{"$error":"#N/A"}},null,9015.68,0,928.13,2334.41,2519.375,4853.7849999999999,333081.49375000002,377312.59374999994,377312.59374999994,377312.59374999994,75348.491250000006,26117.391250000001,26117.391250000001,{"$f":"26117.4232748001+143.802999999606","v":26261.226274799708},0,null,{"$error":"#N/A"}]
["6.4",{"$f":"VLOOKUP($A189,Orçamento!$A$3:$J$126,2,FALSE)","v":{"$error":"#N/A"}},{"$f":"VLOOKUP($A189,Orçamento!$A$3:$J$126,3,FALSE)","v":{"$error":"#N/A"}},{"$f":"VLOOKUP($A189,Orçamento!$A$3:$J$126,4,FALSE)","v":{"$error":"#N/A"}},{"$f":"VLOOKUP($A189,Orçamento!$A$3:$J$126,5,FALSE)","v":{"$error":"#N/A"}},{"$f":"VLOOKUP($A189,Orçamento!$A$3:$J$126,6,FALSE)","v":{"$error":"#N/A"}},null,0,0,0,0,0,0,0,0,0,0,0,0,0,0,136.23933959999999,null,{"$error":"#N/A"}]
["6.5",{"$f":"VLOOKUP($A190,Orçamento!$A$3:$J$126,2,FALSE)","v":{"$error":"#N/A"}},{"$f":"VLOOKUP($A190,Orçamento!$A$3:$J$126,3,FALSE)","v":{"$error":"#N/A"}},{"$f":"VLOOKUP($A190,Orçamento!$A$3:$J$126,4,FALSE)","v":{"$error":"#N/A"}},{"$f":"VLOOKUP($A190,Orçamento!$A$3:$J$126,5,FALSE)","v":{"$error":"#N/A"}},{"$f":"ROUND(VLOOKUP($A190,Orçamento!$A$3:$J$126,6,FALSE),2)","v":{"$error":"#N/A"}},null,0,0,0,0,1648.28,1648.28,3052.25,3052.25,3052.25,3052.25,1648.28,1648.28,1648.28,1792.06,0,null,{"$error":"#N/A"}]
["6.6",{"$f":"VLOOKUP($A191,Orçamento!$A$3:$J$126,2,FALSE)","v":{"$error":"#N/A"}},{"$f":"VLOOKUP($A191,Orçamento!$A$3:$J$126,3,FALSE)","v":{"$error":"#N/A"}},{"$f":"VLOOKUP($A191,Orçamento!$A$3:$J$126,4,FALSE)","v":{"$error":"#N/A"}},{"$f":"VLOOKUP($A191,Orçamento!$A$3:$J$126,5,FALSE)","v":{"$error":"#N/A"}},{"$f":"VLOOKUP($A191,Orçamento!$A$3:$J$126,6,FALSE)","v":{"$error":"#N/A"}},null,0,0,406.161,0,7273.9373489999998,38286.586148999995,22780.261748999998,7273.9373489999998,7273.9373489999998,7273.9373489999998,7273.9373489999998,7273.9373489999998,7273.9373489999998,7273.9373489999998,29.46352500002191,null,{"$error":"#N/A"}]
["6.7",{"$f":"VLOOKUP($A192,Orçamento!$A$3:$J$126,2,FALSE)","v":{"$error":"#N/A"}},{"$f":"VLOOKUP($A192,Orçamento!$A$3:$J$126,3,FALSE)","v":{"$error":"#N/A"}},{"$f":"VLOOKUP($A192,Orçamento!$A$3:$J$126,4,FALSE)","v":{"$error":"#N/A"}},{"$f":"VLOOKUP($A192,Orçamento!$A$3:$J$126,5,FALSE)","v":{"$error":"#N/A"}},{"$f":"VLOOKUP($A192,Orçamento!$A$3:$J$126,6,FALSE)","v":{"$error":"#N/A"}},null,0,0,0,0,207.32400000000001,212.124,3512.3150949742353,3438.3690949742354,3438.3690949742354,3438.3690949742354,2875.2441800000001,2875.2441800000001,2875.2441800000001,409.60508010305489,0,null,{"$error":"#N/A"}]
["6.8",{"$f":"VLOOKUP($A193,Orçamento!$A$3:$J$126,2,FALSE)","v":{"$error":"#N/A"}},{"$f":"VLOOKUP($A193,Orçamento!$A$3:$J$126,3,FALSE)","v":{"$error":"#N/A"}},{"$f":"VLOOKUP($A193,Orçamento!$A$3:$J$126,4,FALSE)","v":{"$error":"#N/A"}},{"$f":"VLOOKUP($A193,Orçamento!$A$3:$J$126,5,FALSE)","v":{"$error":"#N/A"}},{"$f":"VLOOKUP($A193,Orçamento!$A$3:$J$126,6,FALSE)","v":{"$error":"#N/A"}},{"$nulls":11},{"$f":"F193/4","v":{"$error":"#N/A"}},{"$f":"R193","v":{"$error":"#N/A"}},{"$f":"S193","v":{"$error":"#N/A"}},{"$f":"T193","v":{"$error":"#N/A"}},null,null,{"$error":"#N/A"}]
[{"$nulls":5},{"$f":"Orçamento!F124","v":0},{"$nulls":17},0]
[7,null,null,"Administração Local",null,{"$f":"Orçamento!#REF!","v":{"$error":"#REF!"}},null,{"$f":"SUBTOTAL(9,H196:H198)","v":0},{"$f":"SUBTOTAL(9,I196:I198)","v":0},0,0,0,0,0,0,0,0,0,0,0,0,0]
["7.1",null,null,"Administração Local","vb",{"$f":"Orçamento!#REF!","v":{"$error":"#REF!"}},null,{"$f":"SUBTOTAL(9,'Desembolso-cronograma'!L$3:L$125)/SUBTOTAL(9,'Desembolso-cronograma'!$J$3:$J$125)","v":2.8657406014358754E-2},{"$f":"SUBTOTAL(9,'Desembolso-cronograma'!M$3:M$125)/SUBTOTAL(9,'Desembolso-cronograma'!$J$3:$J$125)","v":2.1524768722798175E-2},{"$f":"SUBTOTAL(9,'Desembolso-cronograma'!N$3:N$125)/SUBTOTAL(9,'Desembolso-cronograma'!$J$3:$J$125)","v":1.7577559050300767E-2},{"$f":"SUBTOTAL(9,'Desembolso-cronograma'!O$3:O$125)/SUBTOTAL(9,'Desembolso-cronograma'!$J$3:$J$125)","v":3.1587500293448152E-2},{"$f":"SUBTOTAL(9,'Desembolso-cronograma'!P$3:P$125)/SUBTOTAL(9,'Desembolso-cronograma'!$J$3:$J$125)","v":5.0562200856857219E-2},{"$f":"SUBTOTAL(9,'Desembolso-cronograma'!Q$3:Q$125)/SUBTOTAL(9,'Desembolso-cronograma'!$J$3:$J$125)","v":0.1252910560646569},{"$f":"SUBTOTAL(9,'Desembolso-cronograma'!R$3:R$125)/SUBTOTAL(9,'Desembolso-cronograma'!$J$3:$J$125)","v":0.16544559961909042},{"$f":"SUBTOTAL(9,'Desembolso-cronograma'!S$3:S$125)/SUBTOTAL(9,'Desembolso-cronograma'!$J$3:$J$125)","v":0.20309532961964771},{"$f":"SUBTOTAL(9,'Desembolso-cronograma'!T$3:T$125)/SUBTOTAL(9,'Desembolso-cronograma'!$J$3:$J$125)","v":0.18396452590348056},{"$f":"SUBTOTAL(9,'Desembolso-cronograma'!U$3:U$125)/SUBTOTAL(9,'Desembolso-cronograma'!$J$3:$J$125)","v":0.1276721195553237},{"$f":"SUBTOTAL(9,'Desembolso-cronograma'!V$3:V$125)/SUBTOTAL(9,'Desembolso-cronograma'!$J$3:$J$125)","v":2.7892648701026382E-2},{"$f":"SUBTOTAL(9,'Desembolso-cronograma'!W$3:W$125)/SUBTOTAL(9,'Desembolso-cronograma'!$J$3:$J$125)","v":1.6729286728137553E-2},{"$f":"SUBTOTAL(9,'Desembolso-cronograma'!X$3:X$125)/SUBTOTAL(9,'Desembolso-cronograma'!$J$3:$J$125)","v":0},{"$f":"SUBTOTAL(9,'Desembolso-cronograma'!Y$3:Y$125)/SUBTOTAL(9,'Desembolso-cronograma'!$J$3:$J$125)","v":0},{"$f":"SUBTOTAL(9,'Desembolso-cronograma'!Z$3:Z$125)/SUBTOTAL(9,'Desembolso-cronograma'!$J$3:$J$125)","v":0},null,{"$f":"F196-SUM(H196:V196)","v":{"$error":"#REF!"}}]
[{"$nulls":5},{"$f":"Orçamento!F125","v":0}]
[]
[null,null,null,"TOTAL"]
[null,null,null,"TOTAL ACUMULADO"]

{"sheet":"Composições","index":2,"n_rows":177,"n_cols":12,"rows_kept":177,"cut":false,"hidden":false,"merged":[[160,1,160,4],[108,1,108,4]]}
["COMPOSIÇÃO ANALÍTICA DE CUSTOS"]
["CÓDIGO:","0.001",null,null,null,"DATA BASE: "]
[" DESCRIÇÃO:   ","Mobilização",null,null,null,"UNIDADE:","und"]
["CÓDIGO",null,"DESCRIÇÃO","UN.","INCIDÊNCIA","CUSTO UNITÁRIO","SUB TOTAL"]
[null,null,"A - EQUIPAMENTOS",null,null,"TOTAL",{"$f":"SUM(G13:G13)","v":0}]
[]
["Sicro","E9134","Minônibus - 111kW","h",34,126.66,{"$f":"E7*F7","v":4306.4399999999996}]
["Sicro","E9571","Caminhão tanque com capacidade 10.000 l - 188kw","h",4.2,189.89,{"$f":"E8*F8","v":797.53800000000001}]
["Sicro","E9600","Caminhão betoneira com capacidade - 8m³ - 188kW","h",12.6,165.1,2080.2599999999998]
["Sicro","E9508","Caminhão carroceria com capacidade - 9t - 136kW","h",8.4,105.91,889.64400000000001]
["Sicro","E9667","Caminhão basculante com capacidade - 14m³ - 188kW","h",33.6,156.38,5254.3680000000004]
["Sicro",5914640,"Transporte com cavalo mecânico de 30t","Txkm",107100,0.3,32130]
[]
[null,null,"B - MATERIAIS",null,null,"TOTAL",{"$f":"SUM(G7:G12)","v":45458.25}]
[]
[]
[null,null,"C-MÃO DE OBRA",null,null,"TOTAL",0]
[]
[]
[null,null,"D-CUSTOS AUXILIARES",null,null,"TOTAL",0]
[]
[{"$nulls":5},"TOTAL DO CUSTO ",{"$f":"G5+G14+G17+G20","v":45458.25}]
[{"$nulls":5},"BDI",0]
[{"$nulls":5},"PREÇO TOTAL",0]
[]
["COMPOSIÇÃO ANALÍTICA DE CUSTOS"]
["CÓDIGO:","0.002",null,null,null,"DATA BASE: "]
[" DESCRIÇÃO:   ","Mobilização",null,null,null,"UNIDADE:","und"]
["CÓDIGO",null,"DESCRIÇÃO","UN.","INCIDÊNCIA","CUSTO UNITÁRIO","SUB TOTAL"]
[null,null,"A - EQUIPAMENTOS",null,null,"TOTAL",{"$f":"SUM(G38:G38)","v":0}]
[]
["Sicro","E9134","Minônibus - 111kW","h",34,126.66,{"$f":"E32*F32","v":4306.4399999999996}]
["Sicro","E9571","Caminhão tanque com capacidade 10.000 l - 188kw","h",4.2,189.89,{"$f":"E33*F33","v":797.53800000000001}]
["Sicro","E9600","Caminhão betoneira com capacidade - 8m³ - 188kW","h",12.6,165.1,2080.2599999999998]
["Sicro","E9508","Caminhão carroceria com capacidade - 9t - 136kW","h",8.4,105.91,889.64400000000001]
["Sicro","E9667","Caminhão basculante com capacidade - 14m³ - 188kW","h",33.6,156.38,5254.3680000000004]
["Sicro",5914640,"Transporte com cavalo mecânico de 30t","Txkm",107100,0.3,32130]
[]
[null,null,"B - MATERIAIS",null,null,"TOTAL",{"$f":"SUM(G32:G37)","v":45458.25}]
[]
[]
[null,null,"C-MÃO DE OBRA",null,null,"TOTAL",0]
[]
[]
[null,null,"D-CUSTOS AUXILIARES",null,null,"TOTAL",0]
[]
[{"$nulls":5},"TOTAL DO CUSTO ",{"$f":"G30+G39+G42+G45","v":45458.25}]
[{"$nulls":5},"BDI",0]
[{"$nulls":5},"PREÇO TOTAL",0]
[]
["COMPOSIÇÃO ANALÍTICA DE CUSTOS"]
["CÓDIGO:","0.003",null,null,null,"DATA BASE: "]
[" DESCRIÇÃO:   ","Placa de obras",null,null,null,"UNIDADE:","und"]
["CÓDIGO",null,"DESCRIÇÃO","UN.","INCIDÊNCIA","CUSTO UNITÁRIO","SUB TOTAL"]
[null,null,"A - EQUIPAMENTOS",null,null,"TOTAL"]
[]
[]
[null,null,"B - MATERIAIS",null,null,"TOTAL",{"$f":"SUM(G60:G64)","v":274.2758}]
[]
["SINAPI",4417,"Sarrafo de madeira não aparelhada","m",1,4.3099999999999996,{"$f":"E60*F60","v":4.3099999999999996}]
["SINAPI",4491,"Pontalete de madeira nativa não aparelhada","m",4,3.93,{"$f":"E61*F61","v":15.72}]
["SINAPI",5075,"prego","kg",0.11,11.7,{"$f":"E62*F62","v":1.2869999999999999}]
["SINAPI",94962,"concreto magro para lastro","m³",0.01,295.88,{"$f":"E63*F63","v":2.9588000000000001},{"$nulls":4},295.88]
["SINAPI",4813,"placa de obra","m²",1,250,{"$f":"E64*F64","v":250}]
[]
[]
[null,null,"C-MÃO DE OBRA",null,null,"TOTAL",{"$f":"SUM(G69:G70)","v":50.16}]
[]
["SINAPI",88262,"capinteiro de formas com engarcos complementares",null,1,20.66,{"$f":"E69*F69","v":20.66}]
["SINAPI",88316,"servente com encargos complementares",null,2,14.75,{"$f":"E70*F70","v":29.5}]
[]
[null,null,"D-CUSTOS AUXILIARES",null,null,"TOTAL",0]
[]
[]
[{"$nulls":6},{"$f":"F75*E75","v":0}]
[{"$nulls":5},"TOTAL DO CUSTO ",{"$f":"G55+G58+G67+G72","v":324.43579999999997}]
[{"$nulls":5},"BDI",0]
[{"$nulls":5},"PREÇO TOTAL",0]
[]
["COMPOSIÇÃO ANALÍTICA DE CUSTOS"]
["CÓDIGO:","0.004",null,null,null,"DATA BASE: "]
[" DESCRIÇÃO:   ","Administração Local e manutenção",null,null,null,"UNIDADE:","und"]
["CÓDIGO",null,"DESCRIÇÃO","UN.","INCIDÊNCIA","CUSTO UNITÁRIO","SUB TOTAL"]
[null,null,"A - EQUIPAMENTOS",null,null,"TOTAL",{"$f":"SUM(G86:G87)","v":17646.25}]
[]
["Codevasf (Sede)",null,"Caminhonete ","mês",1,5885.33,{"$f":"F86*E86","v":5885.33}]
["Codevasf (Sede)",null,"Van Standard T.B. 2.2 Dies.","mês",1,11760.92,{"$f":"F87*E87","v":11760.92}]
[]
[null,null,"B - MATERIAIS",null,null,"TOTAL"]
[]
[]
[null,null,"C-MÃO DE OBRA",null,null,"TOTAL",{"$f":"SUM(G94:G97)","v":27979.808000000001}]
[]
["SINAPI",93567,"Gerência Técnica (engenheiro civil pleno com engargos complementares)","mês",1,17915.14,{"$f":"E94*F94","v":17915.14}]
["SINAPI",94296,"Topografia (Topógrafo com encargos complementares)","mês",0.6,3334.98,{"$f":"E95*F95","v":2000.9879999999998}]
["SINAPI",100321,"Técnico em Segurança do Trabalho ","mês",1,4849.63,4849.63]
["SINAPI",100534,"Controle Tecnológico e Manutenção","mês",1,3214.05,3214.05]
[]
[null,null,"D-CUSTOS AUXILIARES",null,null,"TOTAL",0]
[]
[]
[{"$nulls":6},{"$f":"F102*E102","v":0}]
[{"$nulls":5},"TOTAL DO CUSTO ",{"$f":"G84+G89+G92+G99","v":45626.058000000005}]
[{"$nulls":5},"BDI",0]
[{"$nulls":5},"PREÇO TOTAL",0]
[]
["COMPOSIÇÃO ANALÍTICA DE CUSTOS"]
["CÓDIGO:","0.005",null,null,null,"DATA BASE: "]
[" DESCRIÇÃO:   ","Instalação do Canteiro de Obras",null,null,null,"UNIDADE:","und"]
["CÓDIGO",null,"DESCRIÇÃO","UN.","INCIDÊNCIA","CUSTO UNITÁRIO","SUB TOTAL"]
[null,null,"A - EQUIPAMENTOS",null,null,"TOTAL"]
[]
[null,null,"B - MATERIAIS",null,null,"TOTAL",{"$f":"SUM(G114:G116)","v":0}]
[]
[]
[]
[null,null,"C-MÃO DE OBRA",null,null,"TOTAL",{"$f":"SUM(G118:G118)","v":0}]
[{"$nulls":6},{"$f":"E118*F118","v":0}]
[null,null,"D-CUSTOS AUXILIARES",null,null,"TOTAL",{"$f":"SUM(G121:G129)","v":120401.05}]
[]
["SINAPI",10776,"Escritório (locação de container)","und",28,407.81,{"$f":"E121*F121","v":11418.68},522]
["SINAPI",93208,"Almoxarifado","m²",20,578.1,11562]
["SINAPI",93210,"Refeitório","m²",30,399.6,11988]
["SINAPI",93212,"Banheiros e Vestiários","m²",15,674.14,10112.1]
["SINAPI",93585,"Guarita","m²",4,790.83,3163.32]
["SINAPI",93214,"Reservatório Elevado","und",1,3967.23,3967.23]
["SINAPI",98054,"Tanque Séptico","und",1,2457.04,2457.04]
["SINAPI",98090,"Filtro Anaeróbio ","und",1,6339.72,6339.72]
["COMPOS.","0.007","Grupo Gerador 40KVA","mês",11,{"$f":"G175","v":5399.36},59392.959999999999]
[]
[]
[{"$nulls":6},{"$f":"F132*E132","v":0}]
[{"$nulls":5},"TOTAL DO CUSTO ",{"$f":"G111+G113+G119","v":120401.05}]
[{"$nulls":5},"BDI",0]
[{"$nulls":5},"PREÇO TOTAL",0]
[]
["COMPOSIÇÃO ANALÍTICA DE CUSTOS"]
["CÓDIGO:","0.006",null,null,null,"DATA BASE: "]
[" DESCRIÇÃO:   ","Junta de dilatação",null,null,null,"UNIDADE:","und"]
["CÓDIGO",null,"DESCRIÇÃO","UN.","INCIDÊNCIA","CUSTO UNITÁRIO","SUB TOTAL"]
[null,null,"A - EQUIPAMENTOS",null,null,"TOTAL",{"$f":"SUM(G143:G143)","v":0}]
[]
[]
[null,null,"B - MATERIAIS",null,null,"TOTAL",{"$f":"SUM(G145:G147)","v":87.85}]
[]
[null,null,"Junta de dilatação elástica O-22","m",1,87.85,{"$f":"F146*E146","v":87.85}]
[]
[null,null,"C-MÃO DE OBRA",null,null,"TOTAL",{"$f":"SUM(G149)","v":2.2124999999999999}]
[null,null,"Servente com encargos complementares","h",0.15,14.75,{"$f":"F149*E149","v":2.2124999999999999}]
[]
[null,null,"D-CUSTOS AUXILIARES",null,null,"TOTAL",{"$f":"SUM(G153:G154)","v":0}]
[]
[]
[{"$nulls":6},{"$f":"F154*E154","v":0}]
[{"$nulls":5},"TOTAL DO CUSTO ",{"$f":"G146+G149","v":90.0625}]
[{"$nulls":5},"BDI",0]
[{"$nulls":5},"PREÇO TOTAL",0]
[]
["COMPOSIÇÃO ANALÍTICA DE CUSTOS"]
["CÓDIGO:","0.007",null,null,null,"DATA BASE: "]
[" DESCRIÇÃO:   ","Grupo Gerador 145/160KVA",null,null,null,"UNIDADE:","mês"]
["CÓDIGO",null,"DESCRIÇÃO","UN.","INCIDÊNCIA","CUSTO UNITÁRIO","SUB TOTAL"]
[null,null,"A - EQUIPAMENTOS",null,null,"TOTAL",{"$f":"SUM(G164:G167)","v":5399.36}]
["SICRO","E9763","Grupo gerador - 40 kVA - Produtivo","h",{"$f":"22*8","v":176},22.24,{"$f":"E164*F164","v":3914.24}]
["SICRO","E9763","Grupo gerador - 40 kVA - Improdutivo","h",{"$f":"22*16+8*24","v":544},2.73,{"$f":"E165*F165","v":1485.12}]
[]
[]
[null,null,"B - MATERIAIS",null,null,"TOTAL",{"$f":"SUM(G169:G170)","v":0}]
[]
[]
[null,null,"C-MÃO DE OBRA",null,null,"TOTAL",{"$f":"SUM(G172:G172)","v":0}]
[{"$nulls":6},{"$f":"E172*F172","v":0}]
[null,null,"D-CUSTOS AUXILIARES",null,null,"TOTAL",{"$f":"SUM(G174:G174)","v":0}]
[{"$nulls":4}," "]
[{"$nulls":5},"TOTAL DO CUSTO ",{"$f":"G163+G168+G171+G173","v":5399.36}]
[{"$nulls":5},"BDI",0]
[{"$nulls":5},"PREÇO TOTAL",0]

{"sheet":"BDI","index":3,"n_rows":17,"n_cols":4,"rows_kept":17,"cut":false,"hidden":false,"merged":[[1,1,1,2]]}
[]
[null,"Detalhamento do BDI"]
[null,"Itens Relativos à Administração da Obra",{"$f":"SUM(C4:C8)","v":6.0999999999999999E-2}]
["B","Administração Central",3.7999999999999999E-2]
["C","Despesa Financeira",9.4000000000000004E-3]
["D","Riscos",0.01]
["E","Seguros e Garantias Contratuais",3.5999999999999999E-3]
[]
[null,"Lucro",{"$f":"SUM(C10:C11)","v":6.9000000000000006E-2}]
["F","Margem Bruta",6.9000000000000006E-2]
[]
[null,"Tributos",{"$f":"SUM(C13:C16)","v":6.6500000000000004E-2}]
["G","PIS",6.4999999999999997E-3]
["H","COFINS",0.03]
["I","ISS",0.03,"Informado pela Secretaria de Finanças de Formosa-GO (ligação telefônica - 09h40 - 04/11/2020)."]
[null,"CPRB",0]
[null,"BDI com Tributos",{"$f":"1/(1-C3-C9-C12)-1","v":0.24455507156191647}]

{"sheet":"Desembolso-cronograma","index":4,"n_rows":127,"n_cols":28,"rows_kept":127,"cut":false,"hidden":false,"merged":[]}
["ORÇAMENTO PROJETO DE RECUPERAÇÃO - BARRAGEM PARANÃ",{"$nulls":9},"BDI"]
["ítem","Base","Código","Descrição","Und","Qtd","Custo Unitário (R$)","Custo Total (R$)","Preço Unitário (R$)","Preço Total (R$)",null,"M1","M2","M3","M4","M5","M6","M7","M8","M9","M10","M11","M12","M13","M14","M15"]
[1,null,null,"Serviços Preliminares",null,null,null,{"$f":"SUBTOTAL(9,H4:H16)","v":772771.08180000004},null,{"$f":"SUBTOTAL(9,J4:J16)","v":961743.6},null,{"$f":"SUBTOTAL(9,L4:L16)","v":188686.09},140017.00999999998,64416.139999999992,56784.139999999992,56784.139999999992,56784.139999999992,56784.139999999992,57775.939999999995,56784.139999999992,56784.139999999992,56784.139999999992,113359.44,0,0,0]
["1.1",null,null,"Mobilizações e Desmobilizações",null,null,null,{"$f":"SUBTOTAL(9,H5:H10)","v":759154.68180000002},null,{"$f":"SUBTOTAL(9,J5:J10)","v":944809.79999999993},null,{"$f":"SUBTOTAL(9,L5:L10)","v":188686.09},131707.00999999998,56784.139999999992,56784.139999999992,56784.139999999992,56784.139999999992,56784.139999999992,56784.139999999992,56784.139999999992,56784.139999999992,56784.139999999992,113359.44,0,0,0]
["1.1.1",{"$f":"VLOOKUP($A5,Orçamento!$A$3:$J$125,2,FALSE)","v":"COMPOS."},null,{"$f":"VLOOKUP($A5,Orçamento!$A$3:$J$125,4,FALSE)","v":"Mobilizaçãos de Equipamentos e Pessoal"},{"$f":"VLOOKUP($A5,Orçamento!$A$3:$J$125,5,FALSE)","v":"un."},{"$f":"VLOOKUP($A5,Orçamento!$A$3:$J$125,6,FALSE)","v":1},{"$f":"VLOOKUP($A5,Orçamento!$A$3:$J$125,7,FALSE)","v":45458.25},{"$f":"VLOOKUP($A5,Orçamento!$A$3:$J$125,8,FALSE)","v":45458.25},{"$f":"VLOOKUP($A5,Orçamento!$A$3:$J$125,9,FALSE)","v":56575.3},{"$f":"VLOOKUP($A5,Orçamento!$A$3:$J$125,10,FALSE)","v":56575.3},null,{"$f":"Eventograma!H5*'Desembolso-cronograma'!$I5","v":56575.3},{"$f":"Eventograma!I5*'Desembolso-cronograma'!$I5","v":0},{"$f":"Eventograma!J5*'Desembolso-cronograma'!$I5","v":0},{"$f":"Eventograma!K5*'Desembolso-cronograma'!$I5","v":0},{"$f":"Eventograma!L5*'Desembolso-cronograma'!$I5","v":0},{"$f":"Eventograma!M5*'Desembolso-cronograma'!$I5","v":0},{"$f":"Eventograma!N5*'Desembolso-cronograma'!$I5","v":0},{"$f":"Eventograma!O5*'Desembolso-cronograma'!$I5","v":0},{"$f":"Eventograma!P5*'Desembolso-cronograma'!$I5","v":0},{"$f":"Eventograma!Q5*'Desembolso-cronograma'!$I5","v":0},{"$f":"Eventograma!R5*'Desembolso-cronograma'!$I5","v":0},{"$f":"Eventograma!S5*'Desembolso-cronograma'!$I5","v":0},{"$f":"Eventograma!T5*'Desembolso-cronograma'!$I5","v":0},{"$f":"Eventograma!U5*'Desembolso-cronograma'!$I5","v":0},{"$f":"Eventograma!V5*'Desembolso-cronograma'!$I5","v":0}]
["1.1.2",{"$f":"VLOOKUP($A6,Orçamento!$A$3:$J$125,2,FALSE)","v":"COMPOS."},null,{"$f":"VLOOKUP($A6,Orçamento!$A$3:$J$125,4,FALSE)","v":"Desmobilização de Equipamentos e Pessoal"},{"$f":"VLOOKUP($A6,Orçamento!$A$3:$J$125,5,FALSE)","v":"un."},{"$f":"VLOOKUP($A6,Orçamento!$A$3:$J$125,6,FALSE)","v":1},{"$f":"VLOOKUP($A6,Orçamento!$A$3:$J$125,7,FALSE)","v":45458.25},{"$f":"VLOOKUP($A6,Orçamento!$A$3:$J$125,8,FALSE)","v":45458.25},{"$f":"VLOOKUP($A6,Orçamento!$A$3:$J$125,9,FALSE)","v":56575.3},{"$f":"VLOOKUP($A6,Orçamento!$A$3:$J$125,10,FALSE)","v":56575.3},null,{"$f":"Eventograma!H6*'Desembolso-cronograma'!$I6","v":0},{"$f":"Eventograma!I6*'Desembolso-cronograma'!$I6","v":0},{"$f":"Eventograma!J6*'Desembolso-cronograma'!$I6","v":0},{"$f":"Eventograma!K6*'Desembolso-cronograma'!$I6","v":0},{"$f":"Eventograma!L6*'Desembolso-cronograma'!$I6","v":0},{"$f":"Eventograma!M6*'Desembolso-cronograma'!$I6","v":0},{"$f":"Eventograma!N6*'Desembolso-cronograma'!$I6","v":0},{"$f":"Eventograma!O6*'Desembolso-cronograma'!$I6","v":0},{"$f":"Eventograma!P6*'Desembolso-cronograma'!$I6","v":0},{"$f":"Eventograma!Q6*'Desembolso-cronograma'!$I6","v":0},{"$f":"Eventograma!R6*'Desembolso-cronograma'!$I6","v":0},{"$f":"Eventograma!V6*'Desembolso-cronograma'!$I6","v":56575.3},{"$f":"Eventograma!T6*'Desembolso-cronograma'!$I6","v":0},{"$f":"Eventograma!U6*'Desembolso-cronograma'!$I6","v":0}]
["1.1.3",{"$f":"VLOOKUP($A7,Orçamento!$A$3:$J$125,2,FALSE)","v":"COMPOS."},null,"Placa de obra","un.",1,{"$f":"VLOOKUP($A7,Orçamento!$A$3:$J$125,7,FALSE)","v":324.43579999999997},{"$f":"VLOOKUP($A7,Orçamento!$A$3:$J$125,8,FALSE)","v":324.43579999999997},{"$f":"VLOOKUP($A7,Orçamento!$A$3:$J$125,9,FALSE)","v":403.78},{"$f":"VLOOKUP($A7,Orçamento!$A$3:$J$125,10,FALSE)","v":403.78},null,{"$f":"J7","v":403.78}]
["1.1.4",{"$f":"VLOOKUP($A8,Orçamento!$A$3:$J$125,2,FALSE)","v":"COMPOS."},null,"Administração Local e manutenção","mês",12,{"$f":"VLOOKUP($A8,Orçamento!$A$3:$J$125,7,FALSE)","v":45626.058000000005},{"$f":"VLOOKUP($A8,Orçamento!$A$3:$J$125,8,FALSE)","v":547512.696},{"$f":"VLOOKUP($A8,Orçamento!$A$3:$J$125,9,FALSE)","v":56784.14},{"$f":"VLOOKUP($A8,Orçamento!$A$3:$J$125,10,FALSE)","v":681409.67999999993},null,{"$f":"$J$8/12","v":56784.139999999992},{"$f":"$J$8/12","v":56784.139999999992},56784.139999999992,56784.139999999992,56784.139999999992,56784.139999999992,56784.139999999992,56784.139999999992,56784.139999999992,56784.139999999992,56784.139999999992,56784.139999999992]
["1.1.5",{"$f":"VLOOKUP($A9,Orçamento!$A$3:$J$125,2,FALSE)","v":"COMPOS."},null,"Instalação de Canteiro de Obra","un.",1,{"$f":"VLOOKUP($A9,Orçamento!$A$3:$J$125,7,FALSE)","v":120401.05},{"$f":"VLOOKUP($A9,Orçamento!$A$3:$J$125,8,FALSE)","v":120401.05},{"$f":"VLOOKUP($A9,Orçamento!$A$3:$J$125,9,FALSE)","v":149845.74},{"$f":"VLOOKUP($A9,Orçamento!$A$3:$J$125,10,FALSE)","v":149845.74},null,{"$f":"$J$9/2","v":74922.87},{"$f":"$J$9/2","v":74922.87}]
[]
["1.3",null,null,"Acessos",null,{"$f":"Orçamento!F10","v":0},{"$f":"Orçamento!G10","v":0},{"$f":"SUBTOTAL(9,H12:H15)","v":13616.4},null,{"$f":"SUBTOTAL(9,J12:J15)","v":16933.8},null,{"$f":"SUBTOTAL(9,L12:L16)","v":0},8310,7632,0,0,0,0,991.8,0,0,0,0,0,0,0]
["1.3.1",{"$f":"VLOOKUP($A12,Orçamento!$A$3:$J$125,2,FALSE)","v":"SICRO"},{"$f":"VLOOKUP($A12,Orçamento!$A$3:$J$125,3,FALSE)","v":5502986},{"$f":"VLOOKUP($A12,Orçamento!$A$3:$J$125,4,FALSE)","v":"Expurgo"},{"$f":"VLOOKUP($A12,Orçamento!$A$3:$J$125,5,FALSE)","v":"m³"},{"$f":"VLOOKUP($A12,Orçamento!$A$3:$J$125,6,FALSE)","v":1500},{"$f":"VLOOKUP($A12,Orçamento!$A$3:$J$125,7,FALSE)","v":1.78},{"$f":"VLOOKUP($A12,Orçamento!$A$3:$J$125,8,FALSE)","v":2670},{"$f":"VLOOKUP($A12,Orçamento!$A$3:$J$125,9,FALSE)","v":2.2200000000000002},{"$f":"VLOOKUP($A12,Orçamento!$A$3:$J$125,10,FALSE)","v":3330.0000000000005},null,{"$f":"Eventograma!H33*'Desembolso-cronograma'!$I12","v":0},{"$f":"Eventograma!I33*'Desembolso-cronograma'!$I12","v":3330.0000000000005},{"$f":"Eventograma!J33*'Desembolso-cronograma'!$I12","v":0},{"$f":"Eventograma!K33*'Desembolso-cronograma'!$I12","v":0},{"$f":"Eventograma!L33*'Desembolso-cronograma'!$I12","v":0},{"$f":"Eventograma!M33*'Desembolso-cronograma'!$I12","v":0},{"$f":"Eventograma!N33*'Desembolso-cronograma'!$I12","v":0},{"$f":"Eventograma!O33*'Desembolso-cronograma'!$I12","v":0},{"$f":"Eventograma!P33*'Desembolso-cronograma'!$I12","v":0},{"$f":"Eventograma!Q33*'Desembolso-cronograma'!$I12","v":0},{"$f":"Eventograma!R33*'Desembolso-cronograma'!$I12","v":0},{"$f":"Eventograma!S33*'Desembolso-cronograma'!$I12","v":0},{"$f":"Eventograma!T33*'Desembolso-cronograma'!$I12","v":0},{"$f":"Eventograma!U33*'Desembolso-cronograma'!$I12","v":0},{"$f":"Eventograma!V33*'Desembolso-cronograma'!$I12","v":0}]
["1.3.2",{"$f":"VLOOKUP($A13,Orçamento!$A$3:$J$125,2,FALSE)","v":"SICRO"},{"$f":"VLOOKUP($A13,Orçamento!$A$3:$J$125,3,FALSE)","v":4011209},{"$f":"VLOOKUP($A13,Orçamento!$A$3:$J$125,4,FALSE)","v":"Regularização do Subleito"},{"$f":"VLOOKUP($A13,Orçamento!$A$3:$J$125,5,FALSE)","v":"m²"},{"$f":"VLOOKUP($A13,Orçamento!$A$3:$J$125,6,FALSE)","v":6000},{"$f":"VLOOKUP($A13,Orçamento!$A$3:$J$125,7,FALSE)","v":0.67},{"$f":"VLOOKUP($A13,Orçamento!$A$3:$J$125,8,FALSE)","v":4020.0000000000005},{"$f":"VLOOKUP($A13,Orçamento!$A$3:$J$125,9,FALSE)","v":0.83},{"$f":"VLOOKUP($A13,Orçamento!$A$3:$J$125,10,FALSE)","v":4980},null,{"$f":"Eventograma!H34*'Desembolso-cronograma'!$I13","v":0},{"$f":"Eventograma!I34*'Desembolso-cronograma'!$I13","v":4980},{"$f":"Eventograma!J34*'Desembolso-cronograma'!$I13","v":0},{"$f":"Eventograma!K34*'Desembolso-cronograma'!$I13","v":0},{"$f":"Eventograma!L34*'Desembolso-cronograma'!$I13","v":0},{"$f":"Eventograma!M34*'Desembolso-cronograma'!$I13","v":0},{"$f":"Eventograma!N34*'Desembolso-cronograma'!$I13","v":0},{"$f":"Eventograma!O34*'Desembolso-cronograma'!$I13","v":0},{"$f":"Eventograma!P34*'Desembolso-cronograma'!$I13","v":0},{"$f":"Eventograma!Q34*'Desembolso-cronograma'!$I13","v":0},{"$f":"Eventograma!R34*'Desembolso-cronograma'!$I13","v":0},{"$f":"Eventograma!S34*'Desembolso-cronograma'!$I13","v":0},{"$f":"Eventograma!T34*'Desembolso-cronograma'!$I13","v":0},{"$f":"Eventograma!U34*'Desembolso-cronograma'!$I13","v":0},{"$f":"Eventograma!V34*'Desembolso-cronograma'!$I13","v":0}]
["1.3.3",{"$f":"VLOOKUP($A14,Orçamento!$A$3:$J$125,2,FALSE)","v":"SICRO"},{"$f":"VLOOKUP($A14,Orçamento!$A$3:$J$125,3,FALSE)","v":4015612},{"$f":"VLOOKUP($A14,Orçamento!$A$3:$J$125,4,FALSE)","v":"Revestimento Primário de Acesso"},{"$f":"VLOOKUP($A14,Orçamento!$A$3:$J$125,5,FALSE)","v":"m³"},{"$f":"VLOOKUP($A14,Orçamento!$A$3:$J$125,6,FALSE)","v":900},{"$f":"VLOOKUP($A14,Orçamento!$A$3:$J$125,7,FALSE)","v":6.81},{"$f":"VLOOKUP($A14,Orçamento!$A$3:$J$125,8,FALSE)","v":6129},{"$f":"VLOOKUP($A14,Orçamento!$A$3:$J$125,9,FALSE)","v":8.48},{"$f":"VLOOKUP($A14,Orçamento!$A$3:$J$125,10,FALSE)","v":7632},null,{"$f":"Eventograma!H35*'Desembolso-cronograma'!$I14","v":0},{"$f":"Eventograma!I35*'Desembolso-cronograma'!$I14","v":0},{"$f":"Eventograma!J35*'Desembolso-cronograma'!$I14","v":7632},{"$f":"Eventograma!K35*'Desembolso-cronograma'!$I14","v":0},{"$f":"Eventograma!L35*'Desembolso-cronograma'!$I14","v":0},{"$f":"Eventograma!M35*'Desembolso-cronograma'!$I14","v":0},{"$f":"Eventograma!N35*'Desembolso-cronograma'!$I14","v":0},{"$f":"Eventograma!O35*'Desembolso-cronograma'!$I14","v":0},{"$f":"Eventograma!P35*'Desembolso-cronograma'!$I14","v":0},{"$f":"Eventograma!Q35*'Desembolso-cronograma'!$I14","v":0},{"$f":"Eventograma!R35*'Desembolso-cronograma'!$I14","v":0},{"$f":"Eventograma!S35*'Desembolso-cronograma'!$I14","v":0},{"$f":"Eventograma!T35*'Desembolso-cronograma'!$I14","v":0},{"$f":"Eventograma!U35*'Desembolso-cronograma'!$I14","v":0},{"$f":"Eventograma!V35*'Desembolso-cronograma'!$I14","v":0}]
["1.3.4",{"$f":"VLOOKUP($A15,Orçamento!$A$3:$J$125,2,FALSE)","v":"SICRO"},{"$f":"VLOOKUP($A15,Orçamento!$A$3:$J$125,3,FALSE)","v":4915611},{"$f":"VLOOKUP($A15,Orçamento!$A$3:$J$125,4,FALSE)","v":"Recomposição de revestimento primário"},{"$f":"VLOOKUP($A15,Orçamento!$A$3:$J$125,5,FALSE)","v":"m³"},{"$f":"VLOOKUP($A15,Orçamento!$A$3:$J$125,6,FALSE)","v":180},{"$f":"VLOOKUP($A15,Orçamento!$A$3:$J$125,7,FALSE)","v":4.43},{"$f":"VLOOKUP($A15,Orçamento!$A$3:$J$125,8,FALSE)","v":797.4},{"$f":"VLOOKUP($A15,Orçamento!$A$3:$J$125,9,FALSE)","v":5.51},{"$f":"VLOOKUP($A15,Orçamento!$A$3:$J$125,10,FALSE)","v":991.8},null,{"$f":"Eventograma!H36*'Desembolso-cronograma'!$I15","v":0},{"$f":"Eventograma!I36*'Desembolso-cronograma'!$I15","v":0},{"$f":"Eventograma!J36*'Desembolso-cronograma'!$I15","v":0},{"$f":"Eventograma!K36*'Desembolso-cronograma'!$I15","v":0},{"$f":"Eventograma!L36*'Desembolso-cronograma'!$I15","v":0},{"$f":"Eventograma!M36*'Desembolso-cronograma'!$I15","v":0},{"$f":"Eventograma!N36*'Desembolso-cronograma'!$I15","v":0},{"$f":"Eventograma!O36*'Desembolso-cronograma'!$I15","v":991.8},{"$f":"Eventograma!P36*'Desembolso-cronograma'!$I15","v":0},{"$f":"Eventograma!Q36*'Desembolso-cronograma'!$I15","v":0},{"$f":"Eventograma!R36*'Desembolso-cronograma'!$I15","v":0},{"$f":"Eventograma!S36*'Desembolso-cronograma'!$I15","v":0},{"$f":"Eventograma!T36*'Desembolso-cronograma'!$I15","v":0},{"$f":"Eventograma!U36*'Desembolso-cronograma'!$I15","v":0},{"$f":"Eventograma!V36*'Desembolso-cronograma'!$I15","v":0}]
[]
[2,null,null,"Vertedouro Complementar",null,{"$f":"Orçamento!F16","v":0},{"$f":"Orçamento!G16","v":0},{"$f":"SUBTOTAL(9,H18:H33)","v":207985.61208799999},null,{"$f":"SUBTOTAL(9,J18:J34)","v":258984.82088699998},null,{"$f":"SUBTOTAL(9,L18:L34)","v":0},{"$f":"SUBTOTAL(9,M18:M34)","v":0},0,9361.867571428571,9361.867571428571,77278.989508928571,13225.52029342857,55963.560798928571,9361.867571428571,84431.147571428548,0,0,0,0,0]
["2.1",null,null,"Canal de Aproximação",null,{"$f":"Orçamento!F17","v":0},{"$f":"Orçamento!G17","v":0},{"$f":"SUBTOTAL(9,H19:H21)","v":120224.95},null,{"$f":"SUBTOTAL(9,J19:J21)","v":149714.625},null,{"$f":"SUBTOTAL(9,L19:L22)","v":0},{"$f":"SUBTOTAL(9,M19:M22)","v":0},0,9361.867571428571,9361.867571428571,15436.715571428573,12399.29157142857,9361.867571428571,9361.867571428571,84431.147571428548,0,0,0,0,0]
["2.1.1",{"$f":"VLOOKUP($A19,Orçamento!$A$3:$J$125,2,FALSE)","v":"SICRO"},{"$f":"VLOOKUP($A19,Orçamento!$A$3:$J$125,3,FALSE)","v":5502139},{"$f":"VLOOKUP($A19,Orçamento!$A$3:$J$125,4,FALSE)","v":"Escavação Comum"},{"$f":"VLOOKUP($A19,Orçamento!$A$3:$J$125,5,FALSE)","v":"m³"},{"$f":"VLOOKUP($A19,Orçamento!$A$3:$J$125,6,FALSE)","v":27100},{"$f":"VLOOKUP($A19,Orçamento!$A$3:$J$125,7,FALSE)","v":3.55},{"$f":"VLOOKUP($A19,Orçamento!$A$3:$J$125,8,FALSE)","v":96205},{"$f":"VLOOKUP($A19,Orçamento!$A$3:$J$125,9,FALSE)","v":4.42},{"$f":"VLOOKUP($A19,Orçamento!$A$3:$J$125,10,FALSE)","v":119782},null,{"$f":"Eventograma!H45*'Desembolso-cronograma'!$I19","v":0},{"$f":"Eventograma!I45*'Desembolso-cronograma'!$I19","v":0},{"$f":"Eventograma!J45*'Desembolso-cronograma'!$I19","v":0},{"$f":"Eventograma!K45*'Desembolso-cronograma'!$I19","v":5085.7782857142856},{"$f":"Eventograma!L45*'Desembolso-cronograma'!$I19","v":5085.7782857142856},{"$f":"Eventograma!M45*'Desembolso-cronograma'!$I19","v":11160.626285714286},{"$f":"Eventograma!N45*'Desembolso-cronograma'!$I19","v":8123.2022857142856},{"$f":"Eventograma!O45*'Desembolso-cronograma'!$I19","v":5085.7782857142856},{"$f":"Eventograma!P45*'Desembolso-cronograma'!$I19","v":5085.7782857142856},{"$f":"Eventograma!Q45*'Desembolso-cronograma'!$I19","v":80155.058285714273},{"$f":"Eventograma!R45*'Desembolso-cronograma'!$I19","v":0},{"$f":"Eventograma!S45*'Desembolso-cronograma'!$I19","v":0},{"$f":"Eventograma!T45*'Desembolso-cronograma'!$I19","v":0},{"$f":"Eventograma!U45*'Desembolso-cronograma'!$I19","v":0},{"$f":"Eventograma!V45*'Desembolso-cronograma'!$I19","v":0}]
["2.1.2",{"$f":"VLOOKUP($A20,Orçamento!$A$3:$J$125,2,FALSE)","v":"SICRO"},{"$f":"VLOOKUP($A20,Orçamento!$A$3:$J$125,3,FALSE)","v":2003864},{"$f":"VLOOKUP($A20,Orçamento!$A$3:$J$125,4,FALSE)","v":"Esgotamento de água com bomba submersa"},{"$f":"VLOOKUP($A20,Orçamento!$A$3:$J$125,5,FALSE)","v":"h"},{"$f":"VLOOKUP($A20,Orçamento!$A$3:$J$125,6,FALSE)","v":122},{"$f":"VLOOKUP($A20,Orçamento!$A$3:$J$125,7,FALSE)","v":10.85},{"$f":"VLOOKUP($A20,Orçamento!$A$3:$J$125,8,FALSE)","v":1323.7},{"$f":"VLOOKUP($A20,Orçamento!$A$3:$J$125,9,FALSE)","v":13.5},{"$f":"VLOOKUP($A20,Orçamento!$A$3:$J$125,10,FALSE)","v":1647},null,{"$f":"Eventograma!H46*'Desembolso-cronograma'!$I20","v":0},{"$f":"Eventograma!I46*'Desembolso-cronograma'!$I20","v":0},{"$f":"Eventograma!J46*'Desembolso-cronograma'!$I20","v":0},{"$f":"Eventograma!K46*'Desembolso-cronograma'!$I20","v":235.28571428571428},{"$f":"Eventograma!L46*'Desembolso-cronograma'!$I20","v":235.28571428571428},{"$f":"Eventograma!M46*'Desembolso-cronograma'!$I20","v":235.28571428571428},{"$f":"Eventograma!N46*'Desembolso-cronograma'!$I20","v":235.28571428571428},{"$f":"Eventograma!O46*'Desembolso-cronograma'!$I20","v":235.28571428571428},{"$f":"Eventograma!P46*'Desembolso-cronograma'!$I20","v":235.28571428571428},{"$f":"Eventograma!Q46*'Desembolso-cronograma'!$I20","v":235.28571428571428},{"$f":"Eventograma!R46*'Desembolso-cronograma'!$I20","v":0},{"$f":"Eventograma!S46*'Desembolso-cronograma'!$I20","v":0},{"$f":"Eventograma!T46*'Desembolso-cronograma'!$I20","v":0},{"$f":"Eventograma!U46*'Desembolso-cronograma'!$I20","v":0},{"$f":"Eventograma!V46*'Desembolso-cronograma'!$I20","v":0}]
["2.1.3",{"$f":"VLOOKUP($A21,Orçamento!$A$3:$J$125,2,FALSE)","v":"SICRO"},{"$f":"VLOOKUP($A21,Orçamento!$A$3:$J$125,3,FALSE)","v":4413942},{"$f":"VLOOKUP($A21,Orçamento!$A$3:$J$125,4,FALSE)","v":"Espalhamento de solo em bota fora"},{"$f":"VLOOKUP($A21,Orçamento!$A$3:$J$125,5,FALSE)","v":"m³"},{"$f":"VLOOKUP($A21,Orçamento!$A$3:$J$125,6,FALSE)","v":16937.5},{"$f":"VLOOKUP($A21,Orçamento!$A$3:$J$125,7,FALSE)","v":1.34},{"$f":"VLOOKUP($A21,Orçamento!$A$3:$J$125,8,FALSE)","v":22696.25},{"$f":"VLOOKUP($A21,Orçamento!$A$3:$J$125,9,FALSE)","v":1.67},{"$f":"VLOOKUP($A21,Orçamento!$A$3:$J$125,10,FALSE)","v":28285.625},null,{"$f":"Eventograma!H47*'Desembolso-cronograma'!$I21","v":0},{"$f":"Eventograma!I47*'Desembolso-cronograma'!$I21","v":0},{"$f":"Eventograma!J47*'Desembolso-cronograma'!$I21","v":0},{"$f":"Eventograma!K47*'Desembolso-cronograma'!$I21","v":4040.8035714285716},{"$f":"Eventograma!L47*'Desembolso-cronograma'!$I21","v":4040.8035714285716},{"$f":"Eventograma!M47*'Desembolso-cronograma'!$I21","v":4040.8035714285716},{"$f":"Eventograma!N47*'Desembolso-cronograma'!$I21","v":4040.8035714285716},{"$f":"Eventograma!O47*'Desembolso-cronograma'!$I21","v":4040.8035714285716},{"$f":"Eventograma!P47*'Desembolso-cronograma'!$I21","v":4040.8035714285716},{"$f":"Eventograma!Q47*'Desembolso-cronograma'!$I21","v":4040.8035714285716},{"$f":"Eventograma!R47*'Desembolso-cronograma'!$I21","v":0},{"$f":"Eventograma!S47*'Desembolso-cronograma'!$I21","v":0},{"$f":"Eventograma!T47*'Desembolso-cronograma'!$I21","v":0},{"$f":"Eventograma!U47*'Desembolso-cronograma'!$I21","v":0},{"$f":"Eventograma!V47*'Desembolso-cronograma'!$I21","v":0}]
[{"$nulls":5},{"$f":"Orçamento!F21","v":0},{"$f":"Orçamento!G21","v":0}]
["2.2",null,null,"Canal de Restituição",null,{"$f":"Orçamento!F22","v":0},{"$f":"Orçamento!G22","v":0},{"$f":"SUBTOTAL(9,H24:H26)","v":8421.4893749999992},null,{"$f":"SUBTOTAL(9,J24:J26)","v":10487.174887499999},null,{"$f":"SUBTOTAL(9,L24:L27)","v":0},{"$f":"SUBTOTAL(9,M24:M27)","v":0},0,0,0,0,0,{"$f":"SUBTOTAL(9,S24:S27)","v":10487.174887499999},null,0,0,0,0,0,0]
["2.2.1",{"$f":"VLOOKUP($A24,Orçamento!$A$3:$J$125,2,FALSE)","v":"SICRO"},{"$f":"VLOOKUP($A24,Orçamento!$A$3:$J$125,3,FALSE)","v":5502139},{"$f":"VLOOKUP($A24,Orçamento!$A$3:$J$125,4,FALSE)","v":"Escavaçao Comum"},{"$f":"VLOOKUP($A24,Orçamento!$A$3:$J$125,5,FALSE)","v":"m³"},{"$f":"VLOOKUP($A24,Orçamento!$A$3:$J$125,6,FALSE)","v":1898.21},{"$f":"VLOOKUP($A24,Orçamento!$A$3:$J$125,7,FALSE)","v":3.55},{"$f":"VLOOKUP($A24,Orçamento!$A$3:$J$125,8,FALSE)","v":6738.6454999999996},{"$f":"VLOOKUP($A24,Orçamento!$A$3:$J$125,9,FALSE)","v":4.42},{"$f":"VLOOKUP($A24,Orçamento!$A$3:$J$125,10,FALSE)","v":8390.0882000000001},null,{"$f":"Eventograma!H50*'Desembolso-cronograma'!$I24","v":0},{"$f":"Eventograma!I50*'Desembolso-cronograma'!$I24","v":0},{"$f":"Eventograma!J50*'Desembolso-cronograma'!$I24","v":0},{"$f":"Eventograma!K50*'Desembolso-cronograma'!$I24","v":0},{"$f":"Eventograma!L50*'Desembolso-cronograma'!$I24","v":0},{"$f":"Eventograma!M50*'Desembolso-cronograma'!$I24","v":0},{"$f":"Eventograma!N50*'Desembolso-cronograma'!$I24","v":0},{"$f":"Eventograma!P50*'Desembolso-cronograma'!$I24","v":8390.0882000000001},null,{"$f":"Eventograma!Q50*'Desembolso-cronograma'!$I24","v":0},{"$f":"Eventograma!R50*'Desembolso-cronograma'!$I24","v":0},{"$f":"Eventograma!S50*'Desembolso-cronograma'!$I24","v":0},{"$f":"Eventograma!T50*'Desembolso-cronograma'!$I24","v":0},{"$f":"Eventograma!U50*'Desembolso-cronograma'!$I24","v":0},{"$f":"Eventograma!V50*'Desembolso-cronograma'!$I24","v":0}]
["2.2.2",{"$f":"VLOOKUP($A25,Orçamento!$A$3:$J$125,2,FALSE)","v":"SICRO"},{"$f":"VLOOKUP($A25,Orçamento!$A$3:$J$125,3,FALSE)","v":2003864},{"$f":"VLOOKUP($A25,Orçamento!$A$3:$J$125,4,FALSE)","v":"Esgotamento de água com bomba submersa"},{"$f":"VLOOKUP($A25,Orçamento!$A$3:$J$125,5,FALSE)","v":"h"},{"$f":"VLOOKUP($A25,Orçamento!$A$3:$J$125,6,FALSE)","v":8.58},{"$f":"VLOOKUP($A25,Orçamento!$A$3:$J$125,7,FALSE)","v":10.85},{"$f":"VLOOKUP($A25,Orçamento!$A$3:$J$125,8,FALSE)","v":93.093000000000004},{"$f":"VLOOKUP($A25,Orçamento!$A$3:$J$125,9,FALSE)","v":13.5},{"$f":"VLOOKUP($A25,Orçamento!$A$3:$J$125,10,FALSE)","v":115.83},null,{"$f":"Eventograma!H51*'Desembolso-cronograma'!$I25","v":0},{"$f":"Eventograma!I51*'Desembolso-cronograma'!$I25","v":0},{"$f":"Eventograma!J51*'Desembolso-cronograma'!$I25","v":0},{"$f":"Eventograma!K51*'Desembolso-cronograma'!$I25","v":0},{"$f":"Eventograma!L51*'Desembolso-cronograma'!$I25","v":0},{"$f":"Eventograma!M51*'Desembolso-cronograma'!$I25","v":0},{"$f":"Eventograma!N51*'Desembolso-cronograma'!$I25","v":0},{"$f":"Eventograma!P51*'Desembolso-cronograma'!$I25","v":115.83},null,{"$f":"Eventograma!Q51*'Desembolso-cronograma'!$I25","v":0},{"$f":"Eventograma!R51*'Desembolso-cronograma'!$I25","v":0},{"$f":"Eventograma!S51*'Desembolso-cronograma'!$I25","v":0},{"$f":"Eventograma!T51*'Desembolso-cronograma'!$I25","v":0},{"$f":"Eventograma!U51*'Desembolso-cronograma'!$I25","v":0},{"$f":"Eventograma!V51*'Desembolso-cronograma'!$I25","v":0}]
["2.2.3",{"$f":"VLOOKUP($A26,Orçamento!$A$3:$J$125,2,FALSE)","v":"SICRO"},{"$f":"VLOOKUP($A26,Orçamento!$A$3:$J$125,3,FALSE)","v":4413942},{"$f":"VLOOKUP($A26,Orçamento!$A$3:$J$125,4,FALSE)","v":"Espalhamento de solo em bota fora"},{"$f":"VLOOKUP($A26,Orçamento!$A$3:$J$125,5,FALSE)","v":"m³"},{"$f":"VLOOKUP($A26,Orçamento!$A$3:$J$125,6,FALSE)","v":1186.3812499999999},{"$f":"VLOOKUP($A26,Orçamento!$A$3:$J$125,7,FALSE)","v":1.34},{"$f":"VLOOKUP($A26,Orçamento!$A$3:$J$125,8,FALSE)","v":1589.750875},{"$f":"VLOOKUP($A26,Orçamento!$A$3:$J$125,9,FALSE)","v":1.67},{"$f":"VLOOKUP($A26,Orçamento!$A$3:$J$125,10,FALSE)","v":1981.2566874999998},null,{"$f":"Eventograma!H52*'Desembolso-cronograma'!$I26","v":0},{"$f":"Eventograma!I52*'Desembolso-cronograma'!$I26","v":0},{"$f":"Eventograma!J52*'Desembolso-cronograma'!$I26","v":0},{"$f":"Eventograma!K52*'Desembolso-cronograma'!$I26","v":0},{"$f":"Eventograma!L52*'Desembolso-cronograma'!$I26","v":0},{"$f":"Eventograma!M52*'Desembolso-cronograma'!$I26","v":0},{"$f":"Eventograma!N52*'Desembolso-cronograma'!$I26","v":0},{"$f":"Eventograma!P52*'Desembolso-cronograma'!$I26","v":1981.2566874999998},null,{"$f":"Eventograma!Q52*'Desembolso-cronograma'!$I26","v":0},{"$f":"Eventograma!R52*'Desembolso-cronograma'!$I26","v":0},{"$f":"Eventograma!S52*'Desembolso-cronograma'!$I26","v":0},{"$f":"Eventograma!T52*'Desembolso-cronograma'!$I26","v":0},{"$f":"Eventograma!U52*'Desembolso-cronograma'!$I26","v":0},{"$f":"Eventograma!V52*'Desembolso-cronograma'!$I26","v":0}]
[{"$nulls":5},{"$f":"Orçamento!F26","v":0},{"$f":"Orçamento!G26","v":0}]
["2.3",null,null,"Dique de Proteção",null,{"$f":"Orçamento!F27","v":0},{"$f":"Orçamento!G27","v":0},{"$f":"SUBTOTAL(9,H29:H33)","v":79339.172712999993},null,{"$f":"SUBTOTAL(9,J29:J33)","v":98783.020999500004},null,{"$f":"SUBTOTAL(9,L29:L34)","v":0},{"$f":"SUBTOTAL(9,M29:M34)","v":0},0,0,0,{"$f":"SUBTOTAL(9,Q29:Q34)","v":61842.273937499995},{"$f":"SUBTOTAL(9,R29:R34)","v":826.22872200000018},{"$f":"SUBTOTAL(9,S29:S34)","v":36114.518340000002},null,null,null,0,0,0,0]
["2.3.1",{"$f":"VLOOKUP($A29,Orçamento!$A$3:$J$125,2,FALSE)","v":"SICRO"},{"$f":"VLOOKUP($A29,Orçamento!$A$3:$J$125,3,FALSE)","v":5502139},{"$f":"VLOOKUP($A29,Orçamento!$A$3:$J$125,4,FALSE)","v":"Escavação comum"},{"$f":"VLOOKUP($A29,Orçamento!$A$3:$J$125,5,FALSE)","v":"m³"},{"$f":"VLOOKUP($A29,Orçamento!$A$3:$J$125,6,FALSE)","v":11318.65},{"$f":"VLOOKUP($A29,Orçamento!$A$3:$J$125,7,FALSE)","v":3.55},{"$f":"VLOOKUP($A29,Orçamento!$A$3:$J$125,8,FALSE)","v":40181.207499999997},{"$f":"VLOOKUP($A29,Orçamento!$A$3:$J$125,9,FALSE)","v":4.42},{"$f":"VLOOKUP($A29,Orçamento!$A$3:$J$125,10,FALSE)","v":50028.432999999997},null,{"$f":"Eventograma!H55*'Desembolso-cronograma'!$I29","v":0},{"$f":"Eventograma!I55*'Desembolso-cronograma'!$I29","v":0},{"$f":"Eventograma!J55*'Desembolso-cronograma'!$I29","v":0},{"$f":"Eventograma!K55*'Desembolso-cronograma'!$I29","v":0},{"$f":"Eventograma!L55*'Desembolso-cronograma'!$I29","v":0},{"$f":"Eventograma!P55*'Desembolso-cronograma'!$I29","v":50028.432999999997},{"$f":"Eventograma!Q55*'Desembolso-cronograma'!$I29","v":0},{"$f":"Eventograma!R55*'Desembolso-cronograma'!$I29","v":0},null,null,null,{"$f":"Eventograma!S55*'Desembolso-cronograma'!$I29","v":0},{"$f":"Eventograma!T55*'Desembolso-cronograma'!$I29","v":0},{"$f":"Eventograma!U55*'Desembolso-cronograma'!$I29","v":0},{"$f":"Eventograma!V55*'Desembolso-cronograma'!$I29","v":0}]
["2.3.2",{"$f":"VLOOKUP($A30,Orçamento!$A$3:$J$125,2,FALSE)","v":"SICRO"},{"$f":"VLOOKUP($A30,Orçamento!$A$3:$J$125,3,FALSE)","v":5502978},{"$f":"VLOOKUP($A30,Orçamento!$A$3:$J$125,4,FALSE)","v":"Aterro Compactado"},{"$f":"VLOOKUP($A30,Orçamento!$A$3:$J$125,5,FALSE)","v":"m³"},{"$f":"VLOOKUP($A30,Orçamento!$A$3:$J$125,6,FALSE)","v":6766.82},{"$f":"VLOOKUP($A30,Orçamento!$A$3:$J$125,7,FALSE)","v":2.99},{"$f":"VLOOKUP($A30,Orçamento!$A$3:$J$125,8,FALSE)","v":20232.791799999999},{"$f":"VLOOKUP($A30,Orçamento!$A$3:$J$125,9,FALSE)","v":3.72},{"$f":"VLOOKUP($A30,Orçamento!$A$3:$J$125,10,FALSE)","v":25172.570400000001},null,{"$f":"Eventograma!H56*'Desembolso-cronograma'!$I30","v":0},{"$f":"Eventograma!I56*'Desembolso-cronograma'!$I30","v":0},{"$f":"Eventograma!J56*'Desembolso-cronograma'!$I30","v":0},{"$f":"Eventograma!K56*'Desembolso-cronograma'!$I30","v":0},{"$f":"Eventograma!L56*'Desembolso-cronograma'!$I30","v":0},{"$f":"Eventograma!P56*'Desembolso-cronograma'!$I30","v":0},{"$f":"Eventograma!Q56*'Desembolso-cronograma'!$I30","v":0},{"$f":"Eventograma!R56*'Desembolso-cronograma'!$I30","v":25172.570400000001},null,null,null,{"$f":"Eventograma!S56*'Desembolso-cronograma'!$I30","v":0},{"$f":"Eventograma!T56*'Desembolso-cronograma'!$I30","v":0},{"$f":"Eventograma!U56*'Desembolso-cronograma'!$I30","v":0},{"$f":"Eventograma!V56*'Desembolso-cronograma'!$I30","v":0}]
["2.3.3",{"$f":"VLOOKUP($A31,Orçamento!$A$3:$J$125,2,FALSE)","v":"SICRO"},{"$f":"VLOOKUP($A31,Orçamento!$A$3:$J$125,3,FALSE)","v":5502986},{"$f":"VLOOKUP($A31,Orçamento!$A$3:$J$125,4,FALSE)","v":"Expurgo"},{"$f":"VLOOKUP($A31,Orçamento!$A$3:$J$125,5,FALSE)","v":"m³"},{"$f":"VLOOKUP($A31,Orçamento!$A$3:$J$125,6,FALSE)","v":372.17510000000004},{"$f":"VLOOKUP($A31,Orçamento!$A$3:$J$125,7,FALSE)","v":1.78},{"$f":"VLOOKUP($A31,Orçamento!$A$3:$J$125,8,FALSE)","v":662.47167800000011},{"$f":"VLOOKUP($A31,Orçamento!$A$3:$J$125,9,FALSE)","v":2.2200000000000002},{"$f":"VLOOKUP($A31,Orçamento!$A$3:$J$125,10,FALSE)","v":826.22872200000018},null,{"$f":"Eventograma!H57*'Desembolso-cronograma'!$I31","v":0},{"$f":"Eventograma!I57*'Desembolso-cronograma'!$I31","v":0},{"$f":"Eventograma!J57*'Desembolso-cronograma'!$I31","v":0},{"$f":"Eventograma!K57*'Desembolso-cronograma'!$I31","v":0},{"$f":"Eventograma!L57*'Desembolso-cronograma'!$I31","v":0},{"$f":"Eventograma!P57*'Desembolso-cronograma'!$I31","v":0},{"$f":"Eventograma!Q57*'Desembolso-cronograma'!$I31","v":826.22872200000018},{"$f":"Eventograma!R57*'Desembolso-cronograma'!$I31","v":0},null,null,null,{"$f":"Eventograma!S57*'Desembolso-cronograma'!$I31","v":0},{"$f":"Eventograma!T57*'Desembolso-cronograma'!$I31","v":0},{"$f":"Eventograma!U57*'Desembolso-cronograma'!$I31","v":0},{"$f":"Eventograma!V57*'Desembolso-cronograma'!$I31","v":0}]
["2.3.4",{"$f":"VLOOKUP($A32,Orçamento!$A$3:$J$125,2,FALSE)","v":"SICRO"},{"$f":"VLOOKUP($A32,Orçamento!$A$3:$J$125,3,FALSE)","v":4016008},{"$f":"VLOOKUP($A32,Orçamento!$A$3:$J$125,4,FALSE)","v":"Escavação de jazida "},{"$f":"VLOOKUP($A32,Orçamento!$A$3:$J$125,5,FALSE)","v":"m³"},{"$f":"VLOOKUP($A32,Orçamento!$A$3:$J$125,6,FALSE)","v":3721.7510000000002},{"$f":"VLOOKUP($A32,Orçamento!$A$3:$J$125,7,FALSE)","v":2.36},{"$f":"VLOOKUP($A32,Orçamento!$A$3:$J$125,8,FALSE)","v":8783.3323600000003},{"$f":"VLOOKUP($A32,Orçamento!$A$3:$J$125,9,FALSE)","v":2.94},{"$f":"VLOOKUP($A32,Orçamento!$A$3:$J$125,10,FALSE)","v":10941.94794},null,{"$f":"Eventograma!H58*'Desembolso-cronograma'!$I32","v":0},{"$f":"Eventograma!I58*'Desembolso-cronograma'!$I32","v":0},{"$f":"Eventograma!J58*'Desembolso-cronograma'!$I32","v":0},{"$f":"Eventograma!K58*'Desembolso-cronograma'!$I32","v":0},{"$f":"Eventograma!L58*'Desembolso-cronograma'!$I32","v":0},{"$f":"Eventograma!P58*'Desembolso-cronograma'!$I32","v":0},{"$f":"Eventograma!Q58*'Desembolso-cronograma'!$I32","v":0},{"$f":"Eventograma!R58*'Desembolso-cronograma'!$I32","v":10941.94794},null,null,null,{"$f":"Eventograma!S58*'Desembolso-cronograma'!$I32","v":0},{"$f":"Eventograma!T58*'Desembolso-cronograma'!$I32","v":0},{"$f":"Eventograma!U58*'Desembolso-cronograma'!$I32","v":0},{"$f":"Eventograma!V58*'Desembolso-cronograma'!$I32","v":0}]
["2.3.5",{"$f":"VLOOKUP($A33,Orçamento!$A$3:$J$125,2,FALSE)","v":"SICRO"},{"$f":"VLOOKUP($A33,Orçamento!$A$3:$J$125,3,FALSE)","v":4413942},{"$f":"VLOOKUP($A33,Orçamento!$A$3:$J$125,4,FALSE)","v":"Espalhamento de solo em bota fora"},{"$f":"VLOOKUP($A33,Orçamento!$A$3:$J$125,5,FALSE)","v":"m³"},{"$f":"VLOOKUP($A33,Orçamento!$A$3:$J$125,6,FALSE)","v":7074.15625},{"$f":"VLOOKUP($A33,Orçamento!$A$3:$J$125,7,FALSE)","v":1.34},{"$f":"VLOOKUP($A33,Orçamento!$A$3:$J$125,8,FALSE)","v":9479.3693750000002},{"$f":"VLOOKUP($A33,Orçamento!$A$3:$J$125,9,FALSE)","v":1.67},{"$f":"VLOOKUP($A33,Orçamento!$A$3:$J$125,10,FALSE)","v":11813.840937499999},null,{"$f":"Eventograma!H59*'Desembolso-cronograma'!$I33","v":0},{"$f":"Eventograma!I59*'Desembolso-cronograma'!$I33","v":0},{"$f":"Eventograma!J59*'Desembolso-cronograma'!$I33","v":0},{"$f":"Eventograma!K59*'Desembolso-cronograma'!$I33","v":0},{"$f":"Eventograma!L59*'Desembolso-cronograma'!$I33","v":0},{"$f":"Eventograma!P59*'Desembolso-cronograma'!$I33","v":11813.840937499999},{"$f":"Eventograma!Q59*'Desembolso-cronograma'!$I33","v":0},{"$f":"Eventograma!R59*'Desembolso-cronograma'!$I33","v":0},null,null,null,{"$f":"Eventograma!S59*'Desembolso-cronograma'!$I33","v":0},{"$f":"Eventograma!T59*'Desembolso-cronograma'!$I33","v":0},{"$f":"Eventograma!U59*'Desembolso-cronograma'!$I33","v":0},{"$f":"Eventograma!V59*'Desembolso-cronograma'!$I33","v":0}]
[{"$nulls":5},{"$f":"Orçamento!F33","v":0},{"$f":"Orçamento!G33","v":0}]
[3,null,null,"Vertedouro Soleira Livre",null,{"$f":"Orçamento!F34","v":0},{"$f":"Orçamento!G34","v":0},{"$f":"SUBTOTAL(9,H36:H61)","v":453392.28663749999},null,{"$f":"SUBTOTAL(9,J36:J61)","v":564258.939075},null,{"$f":"SUBTOTAL(9,L36:L62)","v":0},{"$f":"SUBTOTAL(9,M36:M62)","v":0},0,4648.0471428571427,4648.0471428571427,4648.0471428571427,4648.0471428571427,181888.91683452378,181888.91683452378,181888.91683452378,0,0,0,0,0]
["3.1",null,null,"Reparo na calha e sistema de drenagem",null,{"$f":"Orçamento!F35","v":0},{"$f":"Orçamento!G35","v":0},{"$f":"SUBTOTAL(9,H37:H45)","v":28831.231637499997},null,{"$f":"SUBTOTAL(9,J37:J46)","v":35880.729074999996},null,{"$f":"SUBTOTAL(9,L37:L46)","v":0},{"$f":"SUBTOTAL(9,M37:M46)","v":0},0,0,0,0,0,11960.243025,11960.243025,11960.243025,0,0,0,0,0]
["3.1.1",{"$f":"VLOOKUP($A37,Orçamento!$A$3:$J$125,2,FALSE)","v":"SICRO"},{"$f":"VLOOKUP($A37,Orçamento!$A$3:$J$125,3,FALSE)","v":1600990},{"$f":"VLOOKUP($A37,Orçamento!$A$3:$J$125,4,FALSE)","v":"Demolição de concreto armado"},{"$f":"VLOOKUP($A37,Orçamento!$A$3:$J$125,5,FALSE)","v":"m³"},{"$f":"VLOOKUP($A37,Orçamento!$A$3:$J$125,6,FALSE)","v":23.383749999999999},{"$f":"VLOOKUP($A37,Orçamento!$A$3:$J$125,7,FALSE)","v":392.17},{"$f":"VLOOKUP($A37,Orçamento!$A$3:$J$125,8,FALSE)","v":9170.4052374999992},{"$f":"VLOOKUP($A37,Orçamento!$A$3:$J$125,9,FALSE)","v":488.08},{"$f":"VLOOKUP($A37,Orçamento!$A$3:$J$125,10,FALSE)","v":11413.1407},null,{"$f":"Eventograma!H63*'Desembolso-cronograma'!$I37","v":0},{"$f":"Eventograma!I63*'Desembolso-cronograma'!$I37","v":0},{"$f":"Eventograma!J63*'Desembolso-cronograma'!$I37","v":0},{"$f":"Eventograma!K63*'Desembolso-cronograma'!$I37","v":0},{"$f":"Eventograma!L63*'Desembolso-cronograma'!$I37","v":0},{"$f":"Eventograma!M63*'Desembolso-cronograma'!$I37","v":0},{"$f":"Eventograma!N63*'Desembolso-cronograma'!$I37","v":0},{"$f":"Eventograma!O63*'Desembolso-cronograma'!$I37","v":3804.3802333333329},{"$f":"Eventograma!P63*'Desembolso-cronograma'!$I37","v":3804.3802333333329},{"$f":"Eventograma!Q63*'Desembolso-cronograma'!$I37","v":3804.3802333333329},{"$f":"Eventograma!R63*'Desembolso-cronograma'!$I37","v":0},{"$f":"Eventograma!S63*'Desembolso-cronograma'!$I37","v":0},{"$f":"Eventograma!T63*'Desembolso-cronograma'!$I37","v":0},{"$f":"Eventograma!U63*'Desembolso-cronograma'!$I37","v":0},{"$f":"Eventograma!V63*'Desembolso-cronograma'!$I37","v":0}]
["3.1.2",{"$f":"VLOOKUP($A38,Orçamento!$A$3:$J$125,2,FALSE)","v":"SICRO"},{"$f":"VLOOKUP($A38,Orçamento!$A$3:$J$125,3,FALSE)","v":3806402},{"$f":"VLOOKUP($A38,Orçamento!$A$3:$J$125,4,FALSE)","v":"Limpeza em superfície de concreto "},{"$f":"VLOOKUP($A38,Orçamento!$A$3:$J$125,5,FALSE)","v":"m²"},{"$f":"VLOOKUP($A38,Orçamento!$A$3:$J$125,6,FALSE)","v":36.625},{"$f":"VLOOKUP($A38,Orçamento!$A$3:$J$125,7,FALSE)","v":2.66},{"$f":"VLOOKUP($A38,Orçamento!$A$3:$J$125,8,FALSE)","v":97.422499999999999},{"$f":"VLOOKUP($A38,Orçamento!$A$3:$J$125,9,FALSE)","v":3.31},{"$f":"VLOOKUP($A38,Orçamento!$A$3:$J$125,10,FALSE)","v":121.22875000000001},null,{"$f":"Eventograma!H64*'Desembolso-cronograma'!$I38","v":0},{"$f":"Eventograma!I64*'Desembolso-cronograma'!$I38","v":0},{"$f":"Eventograma!J64*'Desembolso-cronograma'!$I38","v":0},{"$f":"Eventograma!K64*'Desembolso-cronograma'!$I38","v":0},{"$f":"Eventograma!L64*'Desembolso-cronograma'!$I38","v":0},{"$f":"Eventograma!M64*'Desembolso-cronograma'!$I38","v":0},{"$f":"Eventograma!N64*'Desembolso-cronograma'!$I38","v":0},{"$f":"Eventograma!O64*'Desembolso-cronograma'!$I38","v":40.409583333333337},{"$f":"Eventograma!P64*'Desembolso-cronograma'!$I38","v":40.409583333333337},{"$f":"Eventograma!Q64*'Desembolso-cronograma'!$I38","v":40.409583333333337},{"$f":"Eventograma!R64*'Desembolso-cronograma'!$I38","v":0},{"$f":"Eventograma!S64*'Desembolso-cronograma'!$I38","v":0},{"$f":"Eventograma!T64*'Desembolso-cronograma'!$I38","v":0},{"$f":"Eventograma!U64*'Desembolso-cronograma'!$I38","v":0},{"$f":"Eventograma!V64*'Desembolso-cronograma'!$I38","v":0}]
["3.1.3",{"$f":"VLOOKUP($A39,Orçamento!$A$3:$J$125,2,FALSE)","v":"SICRO"},{"$f":"VLOOKUP($A39,Orçamento!$A$3:$J$125,3,FALSE)","v":3108007},{"$f":"VLOOKUP($A39,Orçamento!$A$3:$J$125,4,FALSE)","v":"Forma em Compensado Plastificado e=10mm"},{"$f":"VLOOKUP($A39,Orçamento!$A$3:$J$125,5,FALSE)","v":"m²"},{"$f":"VLOOKUP($A39,Orçamento!$A$3:$J$125,6,FALSE)","v":5.2},{"$f":"VLOOKUP($A39,Orçamento!$A$3:$J$125,7,FALSE)","v":111.51},{"$f":"VLOOKUP($A39,Orçamento!$A$3:$J$125,8,FALSE)","v":579.85200000000009},{"$f":"VLOOKUP($A39,Orçamento!$A$3:$J$125,9,FALSE)","v":138.78},{"$f":"VLOOKUP($A39,Orçamento!$A$3:$J$125,10,FALSE)","v":721.65600000000006},null,{"$f":"Eventograma!H65*'Desembolso-cronograma'!$I39","v":0},{"$f":"Eventograma!I65*'Desembolso-cronograma'!$I39","v":0},{"$f":"Eventograma!J65*'Desembolso-cronograma'!$I39","v":0},{"$f":"Eventograma!K65*'Desembolso-cronograma'!$I39","v":0},{"$f":"Eventograma!L65*'Desembolso-cronograma'!$I39","v":0},{"$f":"Eventograma!M65*'Desembolso-cronograma'!$I39","v":0},{"$f":"Eventograma!N65*'Desembolso-cronograma'!$I39","v":0},{"$f":"Eventograma!O65*'Desembolso-cronograma'!$I39","v":240.55200000000002},{"$f":"Eventograma!P65*'Desembolso-cronograma'!$I39","v":240.55200000000002},{"$f":"Eventograma!Q65*'Desembolso-cronograma'!$I39","v":240.55200000000002},{"$f":"Eventograma!R65*'Desembolso-cronograma'!$I39","v":0},{"$f":"Eventograma!S65*'Desembolso-cronograma'!$I39","v":0},{"$f":"Eventograma!T65*'Desembolso-cronograma'!$I39","v":0},{"$f":"Eventograma!U65*'Desembolso-cronograma'!$I39","v":0},{"$f":"Eventograma!V65*'Desembolso-cronograma'!$I39","v":0}]
["3.1.4",{"$f":"VLOOKUP($A40,Orçamento!$A$3:$J$125,2,FALSE)","v":"SICRO"},{"$f":"VLOOKUP($A40,Orçamento!$A$3:$J$125,3,FALSE)","v":407819},{"$f":"VLOOKUP($A40,Orçamento!$A$3:$J$125,4,FALSE)","v":"Armação em Aço CA-50"},{"$f":"VLOOKUP($A40,Orçamento!$A$3:$J$125,5,FALSE)","v":"kg"},{"$f":"VLOOKUP($A40,Orçamento!$A$3:$J$125,6,FALSE)","v":477},{"$f":"VLOOKUP($A40,Orçamento!$A$3:$J$125,7,FALSE)","v":9.2100000000000009},{"$f":"VLOOKUP($A40,Orçamento!$A$3:$J$125,8,FALSE)","v":4393.17},{"$f":"VLOOKUP($A40,Orçamento!$A$3:$J$125,9,FALSE)","v":11.46},{"$f":"VLOOKUP($A40,Orçamento!$A$3:$J$125,10,FALSE)","v":5466.42},null,{"$f":"Eventograma!H66*'Desembolso-cronograma'!$I40","v":0},{"$f":"Eventograma!I66*'Desembolso-cronograma'!$I40","v":0},{"$f":"Eventograma!J66*'Desembolso-cronograma'!$I40","v":0},{"$f":"Eventograma!K66*'Desembolso-cronograma'!$I40","v":0},{"$f":"Eventograma!L66*'Desembolso-cronograma'!$I40","v":0},{"$f":"Eventograma!M66*'Desembolso-cronograma'!$I40","v":0},{"$f":"Eventograma!N66*'Desembolso-cronograma'!$I40","v":0},{"$f":"Eventograma!O66*'Desembolso-cronograma'!$I40","v":1822.14},{"$f":"Eventograma!P66*'Desembolso-cronograma'!$I40","v":1822.14},{"$f":"Eventograma!Q66*'Desembolso-cronograma'!$I40","v":1822.14},{"$f":"Eventograma!R66*'Desembolso-cronograma'!$I40","v":0},{"$f":"Eventograma!S66*'Desembolso-cronograma'!$I40","v":0},{"$f":"Eventograma!T66*'Desembolso-cronograma'!$I40","v":0},{"$f":"Eventograma!U66*'Desembolso-cronograma'!$I40","v":0},{"$f":"Eventograma!V66*'Desembolso-cronograma'!$I40","v":0}]
["3.1.5",{"$f":"VLOOKUP($A41,Orçamento!$A$3:$J$125,2,FALSE)","v":"SICRO"},{"$f":"VLOOKUP($A41,Orçamento!$A$3:$J$125,3,FALSE)","v":1116263},{"$f":"VLOOKUP($A41,Orçamento!$A$3:$J$125,4,FALSE)","v":"Concreto Fck 25 Mpa"},{"$f":"VLOOKUP($A41,Orçamento!$A$3:$J$125,5,FALSE)","v":"m³"},{"$f":"VLOOKUP($A41,Orçamento!$A$3:$J$125,6,FALSE)","v":23.383749999999999},{"$f":"VLOOKUP($A41,Orçamento!$A$3:$J$125,7,FALSE)","v":243.98},{"$f":"VLOOKUP($A41,Orçamento!$A$3:$J$125,8,FALSE)","v":5705.1673249999994},{"$f":"VLOOKUP($A41,Orçamento!$A$3:$J$125,9,FALSE)","v":303.64999999999998},{"$f":"VLOOKUP($A41,Orçamento!$A$3:$J$125,10,FALSE)","v":7100.4756874999994},null,{"$f":"Eventograma!H67*'Desembolso-cronograma'!$I41","v":0},{"$f":"Eventograma!I67*'Desembolso-cronograma'!$I41","v":0},{"$f":"Eventograma!J67*'Desembolso-cronograma'!$I41","v":0},{"$f":"Eventograma!K67*'Desembolso-cronograma'!$I41","v":0},{"$f":"Eventograma!L67*'Desembolso-cronograma'!$I41","v":0},{"$f":"Eventograma!M67*'Desembolso-cronograma'!$I41","v":0},{"$f":"Eventograma!N67*'Desembolso-cronograma'!$I41","v":0},{"$f":"Eventograma!O67*'Desembolso-cronograma'!$I41","v":2366.8252291666663},{"$f":"Eventograma!P67*'Desembolso-cronograma'!$I41","v":2366.8252291666663},{"$f":"Eventograma!Q67*'Desembolso-cronograma'!$I41","v":2366.8252291666663},{"$f":"Eventograma!R67*'Desembolso-cronograma'!$I41","v":0},{"$f":"Eventograma!S67*'Desembolso-cronograma'!$I41","v":0},{"$f":"Eventograma!T67*'Desembolso-cronograma'!$I41","v":0},{"$f":"Eventograma!U67*'Desembolso-cronograma'!$I41","v":0},{"$f":"Eventograma!V67*'Desembolso-cronograma'!$I41","v":0}]
["3.1.6",{"$f":"VLOOKUP($A42,Orçamento!$A$3:$J$125,2,FALSE)","v":"SICRO"},{"$f":"VLOOKUP($A42,Orçamento!$A$3:$J$125,3,FALSE)","v":1107860},{"$f":"VLOOKUP($A42,Orçamento!$A$3:$J$125,4,FALSE)","v":"Bombeamento de Concreto"},{"$f":"VLOOKUP($A42,Orçamento!$A$3:$J$125,5,FALSE)","v":"m³"},{"$f":"VLOOKUP($A42,Orçamento!$A$3:$J$125,6,FALSE)","v":23.383749999999999},{"$f":"VLOOKUP($A42,Orçamento!$A$3:$J$125,7,FALSE)","v":28.93},{"$f":"VLOOKUP($A42,Orçamento!$A$3:$J$125,8,FALSE)","v":676.49188749999996},{"$f":"VLOOKUP($A42,Orçamento!$A$3:$J$125,9,FALSE)","v":36},{"$f":"VLOOKUP($A42,Orçamento!$A$3:$J$125,10,FALSE)","v":841.81499999999994},null,{"$f":"Eventograma!H68*'Desembolso-cronograma'!$I42","v":0},{"$f":"Eventograma!I68*'Desembolso-cronograma'!$I42","v":0},{"$f":"Eventograma!J68*'Desembolso-cronograma'!$I42","v":0},{"$f":"Eventograma!K68*'Desembolso-cronograma'!$I42","v":0},{"$f":"Eventograma!L68*'Desembolso-cronograma'!$I42","v":0},{"$f":"Eventograma!M68*'Desembolso-cronograma'!$I42","v":0},{"$f":"Eventograma!N68*'Desembolso-cronograma'!$I42","v":0},{"$f":"Eventograma!O68*'Desembolso-cronograma'!$I42","v":280.60499999999996},{"$f":"Eventograma!P68*'Desembolso-cronograma'!$I42","v":280.60499999999996},{"$f":"Eventograma!Q68*'Desembolso-cronograma'!$I42","v":280.60499999999996},{"$f":"Eventograma!R68*'Desembolso-cronograma'!$I42","v":0},{"$f":"Eventograma!S68*'Desembolso-cronograma'!$I42","v":0},{"$f":"Eventograma!T68*'Desembolso-cronograma'!$I42","v":0},{"$f":"Eventograma!U68*'Desembolso-cronograma'!$I42","v":0},{"$f":"Eventograma!V68*'Desembolso-cronograma'!$I42","v":0}]
["3.1.7",{"$f":"VLOOKUP($A43,Orçamento!$A$3:$J$125,2,FALSE)","v":"SICRO"},{"$f":"VLOOKUP($A43,Orçamento!$A$3:$J$125,3,FALSE)","v":1100657},{"$f":"VLOOKUP($A43,Orçamento!$A$3:$J$125,4,FALSE)","v":"Adensamento de Concreto"},{"$f":"VLOOKUP($A43,Orçamento!$A$3:$J$125,5,FALSE)","v":"m³"},{"$f":"VLOOKUP($A43,Orçamento!$A$3:$J$125,6,FALSE)","v":23.383749999999999},{"$f":"VLOOKUP($A43,Orçamento!$A$3:$J$125,7,FALSE)","v":2.4500000000000002},{"$f":"VLOOKUP($A43,Orçamento!$A$3:$J$125,8,FALSE)","v":57.290187500000002},{"$f":"VLOOKUP($A43,Orçamento!$A$3:$J$125,9,FALSE)","v":3.05},{"$f":"VLOOKUP($A43,Orçamento!$A$3:$J$125,10,FALSE)","v":71.320437499999997},null,{"$f":"Eventograma!H69*'Desembolso-cronograma'!$I43","v":0},{"$f":"Eventograma!I69*'Desembolso-cronograma'!$I43","v":0},{"$f":"Eventograma!J69*'Desembolso-cronograma'!$I43","v":0},{"$f":"Eventograma!K69*'Desembolso-cronograma'!$I43","v":0},{"$f":"Eventograma!L69*'Desembolso-cronograma'!$I43","v":0},{"$f":"Eventograma!M69*'Desembolso-cronograma'!$I43","v":0},{"$f":"Eventograma!N69*'Desembolso-cronograma'!$I43","v":0},{"$f":"Eventograma!O69*'Desembolso-cronograma'!$I43","v":23.773479166666664},{"$f":"Eventograma!P69*'Desembolso-cronograma'!$I43","v":23.773479166666664},{"$f":"Eventograma!Q69*'Desembolso-cronograma'!$I43","v":23.773479166666664},{"$f":"Eventograma!R69*'Desembolso-cronograma'!$I43","v":0},{"$f":"Eventograma!S69*'Desembolso-cronograma'!$I43","v":0},{"$f":"Eventograma!T69*'Desembolso-cronograma'!$I43","v":0},{"$f":"Eventograma!U69*'Desembolso-cronograma'!$I43","v":0},{"$f":"Eventograma!V69*'Desembolso-cronograma'!$I43","v":0}]
["3.1.8",{"$f":"VLOOKUP($A44,Orçamento!$A$3:$J$125,2,FALSE)","v":"COMPOS."},{"$f":"VLOOKUP($A44,Orçamento!$A$3:$J$125,3,FALSE)","v":"0.006"},{"$f":"VLOOKUP($A44,Orçamento!$A$3:$J$125,4,FALSE)","v":"Veda Juntas O-22"},{"$f":"VLOOKUP($A44,Orçamento!$A$3:$J$125,5,FALSE)","v":"m"},{"$f":"VLOOKUP($A44,Orçamento!$A$3:$J$125,6,FALSE)","v":16},{"$f":"VLOOKUP($A44,Orçamento!$A$3:$J$125,7,FALSE)","v":90.0625},{"$f":"VLOOKUP($A44,Orçamento!$A$3:$J$125,8,FALSE)","v":1441},{"$f":"VLOOKUP($A44,Orçamento!$A$3:$J$125,9,FALSE)","v":112.09},{"$f":"VLOOKUP($A44,Orçamento!$A$3:$J$125,10,FALSE)","v":1793.44},null,{"$f":"Eventograma!H70*'Desembolso-cronograma'!$I44","v":0},{"$f":"Eventograma!I70*'Desembolso-cronograma'!$I44","v":0},{"$f":"Eventograma!J70*'Desembolso-cronograma'!$I44","v":0},{"$f":"Eventograma!K70*'Desembolso-cronograma'!$I44","v":0},{"$f":"Eventograma!L70*'Desembolso-cronograma'!$I44","v":0},{"$f":"Eventograma!M70*'Desembolso-cronograma'!$I44","v":0},{"$f":"Eventograma!N70*'Desembolso-cronograma'!$I44","v":0},{"$f":"Eventograma!O70*'Desembolso-cronograma'!$I44","v":597.81333333333328},{"$f":"Eventograma!P70*'Desembolso-cronograma'!$I44","v":597.81333333333328},{"$f":"Eventograma!Q70*'Desembolso-cronograma'!$I44","v":597.81333333333328},{"$f":"Eventograma!R70*'Desembolso-cronograma'!$I44","v":0},{"$f":"Eventograma!S70*'Desembolso-cronograma'!$I44","v":0},{"$f":"Eventograma!T70*'Desembolso-cronograma'!$I44","v":0},{"$f":"Eventograma!U70*'Desembolso-cronograma'!$I44","v":0},{"$f":"Eventograma!V70*'Desembolso-cronograma'!$I44","v":0}]
["3.1.9",{"$f":"VLOOKUP($A45,Orçamento!$A$3:$J$125,2,FALSE)","v":"SICRO"},{"$f":"VLOOKUP($A45,Orçamento!$A$3:$J$125,3,FALSE)","v":2003578},{"$f":"VLOOKUP($A45,Orçamento!$A$3:$J$125,4,FALSE)","v":"Drenagem Interna"},{"$f":"VLOOKUP($A45,Orçamento!$A$3:$J$125,5,FALSE)","v":"m"},{"$f":"VLOOKUP($A45,Orçamento!$A$3:$J$125,6,FALSE)","v":73.25},{"$f":"VLOOKUP($A45,Orçamento!$A$3:$J$125,7,FALSE)","v":91.61},{"$f":"VLOOKUP($A45,Orçamento!$A$3:$J$125,8,FALSE)","v":6710.4324999999999},{"$f":"VLOOKUP($A45,Orçamento!$A$3:$J$125,9,FALSE)","v":114.01},{"$f":"VLOOKUP($A45,Orçamento!$A$3:$J$125,10,FALSE)","v":8351.2325000000001},null,{"$f":"Eventograma!H71*'Desembolso-cronograma'!$I45","v":0},{"$f":"Eventograma!I71*'Desembolso-cronograma'!$I45","v":0},{"$f":"Eventograma!J71*'Desembolso-cronograma'!$I45","v":0},{"$f":"Eventograma!K71*'Desembolso-cronograma'!$I45","v":0},{"$f":"Eventograma!L71*'Desembolso-cronograma'!$I45","v":0},{"$f":"Eventograma!M71*'Desembolso-cronograma'!$I45","v":0},{"$f":"Eventograma!N71*'Desembolso-cronograma'!$I45","v":0},{"$f":"Eventograma!O71*'Desembolso-cronograma'!$I45","v":2783.7441666666668},{"$f":"Eventograma!P71*'Desembolso-cronograma'!$I45","v":2783.7441666666668},{"$f":"Eventograma!Q71*'Desembolso-cronograma'!$I45","v":2783.7441666666668},{"$f":"Eventograma!R71*'Desembolso-cronograma'!$I45","v":0},{"$f":"Eventograma!S71*'Desembolso-cronograma'!$I45","v":0},{"$f":"Eventograma!T71*'Desembolso-cronograma'!$I45","v":0},{"$f":"Eventograma!U71*'Desembolso-cronograma'!$I45","v":0},{"$f":"Eventograma!V71*'Desembolso-cronograma'!$I45","v":0}]
[{"$nulls":5},{"$f":"Orçamento!F45","v":0},{"$f":"Orçamento!G45","v":0}]
["3.2",null,null,"Proteção Gabião",null,{"$f":"Orçamento!F46","v":0},{"$f":"Orçamento!G46","v":0},{"$f":"SUBTOTAL(9,H48:H51)","v":398418.01},null,{"$f":"SUBTOTAL(9,J48:J51)","v":495841.88},null,{"$f":"SUBTOTAL(9,L48:L52)","v":0},{"$f":"SUBTOTAL(9,M48:M52)","v":0},0,0,0,0,0,{"$f":"SUBTOTAL(9,S48:S52)","v":165280.62666666665},{"$f":"SUBTOTAL(9,T48:T52)","v":165280.62666666665},{"$f":"SUBTOTAL(9,U48:U52)","v":165280.62666666665},null,null,null,0,0]
["3.2.1",{"$f":"VLOOKUP($A48,Orçamento!$A$3:$J$125,2,FALSE)","v":"SICRO"},{"$f":"VLOOKUP($A48,Orçamento!$A$3:$J$125,3,FALSE)","v":3108007},{"$f":"VLOOKUP($A48,Orçamento!$A$3:$J$125,4,FALSE)","v":"Forma em Compensado Plastificado e=10mm"},{"$f":"VLOOKUP($A48,Orçamento!$A$3:$J$125,5,FALSE)","v":"m²"},{"$f":"VLOOKUP($A48,Orçamento!$A$3:$J$125,6,FALSE)","v":108},{"$f":"VLOOKUP($A48,Orçamento!$A$3:$J$125,7,FALSE)","v":111.51},{"$f":"VLOOKUP($A48,Orçamento!$A$3:$J$125,8,FALSE)","v":12043.08},{"$f":"VLOOKUP($A48,Orçamento!$A$3:$J$125,9,FALSE)","v":138.78},{"$f":"VLOOKUP($A48,Orçamento!$A$3:$J$125,10,FALSE)","v":14988.24},null,{"$f":"Eventograma!H74*'Desembolso-cronograma'!$I48","v":0},{"$f":"Eventograma!I74*'Desembolso-cronograma'!$I48","v":0},{"$f":"Eventograma!J74*'Desembolso-cronograma'!$I48","v":0},{"$f":"Eventograma!K74*'Desembolso-cronograma'!$I48","v":0},{"$f":"Eventograma!L74*'Desembolso-cronograma'!$I48","v":0},{"$f":"Eventograma!M74*'Desembolso-cronograma'!$I48","v":0},{"$f":"Eventograma!N74*'Desembolso-cronograma'!$I48","v":0},{"$f":"Eventograma!R74*'Desembolso-cronograma'!$I48","v":4996.08},{"$f":"Eventograma!S74*'Desembolso-cronograma'!$I48","v":4996.08},{"$f":"Eventograma!T74*'Desembolso-cronograma'!$I48","v":4996.08},null,null,null,{"$f":"Eventograma!U74*'Desembolso-cronograma'!$I48","v":0},{"$f":"Eventograma!V74*'Desembolso-cronograma'!$I48","v":0}]
["3.2.2",{"$f":"VLOOKUP($A49,Orçamento!$A$3:$J$125,2,FALSE)","v":"SICRO"},{"$f":"VLOOKUP($A49,Orçamento!$A$3:$J$125,3,FALSE)","v":1106109},{"$f":"VLOOKUP($A49,Orçamento!$A$3:$J$125,4,FALSE)","v":"Concreto fck = 20 Mpa"},{"$f":"VLOOKUP($A49,Orçamento!$A$3:$J$125,5,FALSE)","v":"m³"},{"$f":"VLOOKUP($A49,Orçamento!$A$3:$J$125,6,FALSE)","v":1541},{"$f":"VLOOKUP($A49,Orçamento!$A$3:$J$125,7,FALSE)","v":219.35},{"$f":"VLOOKUP($A49,Orçamento!$A$3:$J$125,8,FALSE)","v":338018.35},{"$f":"VLOOKUP($A49,Orçamento!$A$3:$J$125,9,FALSE)","v":272.99},{"$f":"VLOOKUP($A49,Orçamento!$A$3:$J$125,10,FALSE)","v":420677.59},null,{"$f":"Eventograma!H75*'Desembolso-cronograma'!$I49","v":0},{"$f":"Eventograma!I75*'Desembolso-cronograma'!$I49","v":0},{"$f":"Eventograma!J75*'Desembolso-cronograma'!$I49","v":0},{"$f":"Eventograma!K75*'Desembolso-cronograma'!$I49","v":0},{"$f":"Eventograma!L75*'Desembolso-cronograma'!$I49","v":0},{"$f":"Eventograma!M75*'Desembolso-cronograma'!$I49","v":0},{"$f":"Eventograma!N75*'Desembolso-cronograma'!$I49","v":0},{"$f":"Eventograma!R75*'Desembolso-cronograma'!$I49","v":140225.86333333334},{"$f":"Eventograma!S75*'Desembolso-cronograma'!$I49","v":140225.86333333334},{"$f":"Eventograma!T75*'Desembolso-cronograma'!$I49","v":140225.86333333334},null,null,null,{"$f":"Eventograma!U75*'Desembolso-cronograma'!$I49","v":0},{"$f":"Eventograma!V75*'Desembolso-cronograma'!$I49","v":0}]
["3.2.3",{"$f":"VLOOKUP($A50,Orçamento!$A$3:$J$125,2,FALSE)","v":"SICRO"},{"$f":"VLOOKUP($A50,Orçamento!$A$3:$J$125,3,FALSE)","v":1107860},{"$f":"VLOOKUP($A50,Orçamento!$A$3:$J$125,4,FALSE)","v":"Bombeamento"},{"$f":"VLOOKUP($A50,Orçamento!$A$3:$J$125,5,FALSE)","v":"m³"},{"$f":"VLOOKUP($A50,Orçamento!$A$3:$J$125,6,FALSE)","v":1541},{"$f":"VLOOKUP($A50,Orçamento!$A$3:$J$125,7,FALSE)","v":28.93},{"$f":"VLOOKUP($A50,Orçamento!$A$3:$J$125,8,FALSE)","v":44581.13},{"$f":"VLOOKUP($A50,Orçamento!$A$3:$J$125,9,FALSE)","v":36},{"$f":"VLOOKUP($A50,Orçamento!$A$3:$J$125,10,FALSE)","v":55476},null,{"$f":"Eventograma!H76*'Desembolso-cronograma'!$I50","v":0},{"$f":"Eventograma!I76*'Desembolso-cronograma'!$I50","v":0},{"$f":"Eventograma!J76*'Desembolso-cronograma'!$I50","v":0},{"$f":"Eventograma!K76*'Desembolso-cronograma'!$I50","v":0},{"$f":"Eventograma!L76*'Desembolso-cronograma'!$I50","v":0},{"$f":"Eventograma!M76*'Desembolso-cronograma'!$I50","v":0},{"$f":"Eventograma!N76*'Desembolso-cronograma'!$I50","v":0},{"$f":"Eventograma!R76*'Desembolso-cronograma'!$I50","v":18492},{"$f":"Eventograma!S76*'Desembolso-cronograma'!$I50","v":18492},{"$f":"Eventograma!T76*'Desembolso-cronograma'!$I50","v":18492},null,null,null,{"$f":"Eventograma!U76*'Desembolso-cronograma'!$I50","v":0},{"$f":"Eventograma!V76*'Desembolso-cronograma'!$I50","v":0}]
["3.2.4",{"$f":"VLOOKUP($A51,Orçamento!$A$3:$J$125,2,FALSE)","v":"SICRO"},{"$f":"VLOOKUP($A51,Orçamento!$A$3:$J$125,3,FALSE)","v":1100657},{"$f":"VLOOKUP($A51,Orçamento!$A$3:$J$125,4,FALSE)","v":"Adensamento de Concreto"},{"$f":"VLOOKUP($A51,Orçamento!$A$3:$J$125,5,FALSE)","v":"m³"},{"$f":"VLOOKUP($A51,Orçamento!$A$3:$J$125,6,FALSE)","v":1541},{"$f":"VLOOKUP($A51,Orçamento!$A$3:$J$125,7,FALSE)","v":2.4500000000000002},{"$f":"VLOOKUP($A51,Orçamento!$A$3:$J$125,8,FALSE)","v":3775.4500000000003},{"$f":"VLOOKUP($A51,Orçamento!$A$3:$J$125,9,FALSE)","v":3.05},{"$f":"VLOOKUP($A51,Orçamento!$A$3:$J$125,10,FALSE)","v":4700.0499999999993},null,{"$f":"Eventograma!H77*'Desembolso-cronograma'!$I51","v":0},{"$f":"Eventograma!I77*'Desembolso-cronograma'!$I51","v":0},{"$f":"Eventograma!J77*'Desembolso-cronograma'!$I51","v":0},{"$f":"Eventograma!K77*'Desembolso-cronograma'!$I51","v":0},{"$f":"Eventograma!L77*'Desembolso-cronograma'!$I51","v":0},{"$f":"Eventograma!M77*'Desembolso-cronograma'!$I51","v":0},{"$f":"Eventograma!N77*'Desembolso-cronograma'!$I51","v":0},{"$f":"Eventograma!R77*'Desembolso-cronograma'!$I51","v":1566.6833333333332},{"$f":"Eventograma!S77*'Desembolso-cronograma'!$I51","v":1566.6833333333332},{"$f":"Eventograma!T77*'Desembolso-cronograma'!$I51","v":1566.6833333333332},null,null,null,{"$f":"Eventograma!U77*'Desembolso-cronograma'!$I51","v":0},{"$f":"Eventograma!V77*'Desembolso-cronograma'!$I51","v":0}]
[{"$nulls":5},{"$f":"Orçamento!F51","v":0},{"$f":"Orçamento!G51","v":0}]
["3.3",null,null,"Reparos estruturas de concreto",null,{"$f":"Orçamento!F52","v":0},{"$f":"Orçamento!G52","v":0},{"$f":"SUBTOTAL(9,H54:H62)","v":26143.044999999998},null,{"$f":"SUBTOTAL(9,J54:J62)","v":32536.329999999998},null,{"$f":"SUBTOTAL(9,L54:L62)","v":0},{"$f":"SUBTOTAL(9,M54:M62)","v":0},0,4648.0471428571427,4648.0471428571427,4648.0471428571427,4648.0471428571427,4648.0471428571427,4648.0471428571427,4648.0471428571427,0,0,0,0,0]
["3.3.1",{"$f":"VLOOKUP($A54,Orçamento!$A$3:$J$125,2,FALSE)","v":"SICRO"},{"$f":"VLOOKUP($A54,Orçamento!$A$3:$J$125,3,FALSE)","v":3806413},{"$f":"VLOOKUP($A54,Orçamento!$A$3:$J$125,4,FALSE)","v":"Apicoamento"},{"$f":"VLOOKUP($A54,Orçamento!$A$3:$J$125,5,FALSE)","v":"m²"},{"$f":"VLOOKUP($A54,Orçamento!$A$3:$J$125,6,FALSE)","v":50},{"$f":"VLOOKUP($A54,Orçamento!$A$3:$J$125,7,FALSE)","v":9.2100000000000009},{"$f":"VLOOKUP($A54,Orçamento!$A$3:$J$125,8,FALSE)","v":460.50000000000006},{"$f":"VLOOKUP($A54,Orçamento!$A$3:$J$125,9,FALSE)","v":11.46},{"$f":"VLOOKUP($A54,Orçamento!$A$3:$J$125,10,FALSE)","v":573},null,{"$f":"Eventograma!H80*'Desembolso-cronograma'!$I54","v":0},{"$f":"Eventograma!I80*'Desembolso-cronograma'!$I54","v":0},{"$f":"Eventograma!J80*'Desembolso-cronograma'!$I54","v":0},{"$f":"Eventograma!K80*'Desembolso-cronograma'!$I54","v":81.857142857142861},{"$f":"Eventograma!L80*'Desembolso-cronograma'!$I54","v":81.857142857142861},{"$f":"Eventograma!M80*'Desembolso-cronograma'!$I54","v":81.857142857142861},{"$f":"Eventograma!N80*'Desembolso-cronograma'!$I54","v":81.857142857142861},{"$f":"Eventograma!O80*'Desembolso-cronograma'!$I54","v":81.857142857142861},{"$f":"Eventograma!P80*'Desembolso-cronograma'!$I54","v":81.857142857142861},{"$f":"Eventograma!Q80*'Desembolso-cronograma'!$I54","v":81.857142857142861},{"$f":"Eventograma!R80*'Desembolso-cronograma'!$I54","v":0},{"$f":"Eventograma!S80*'Desembolso-cronograma'!$I54","v":0},{"$f":"Eventograma!T80*'Desembolso-cronograma'!$I54","v":0},{"$f":"Eventograma!U80*'Desembolso-cronograma'!$I54","v":0},{"$f":"Eventograma!V80*'Desembolso-cronograma'!$I54","v":0}]
["3.3.2",{"$f":"VLOOKUP($A55,Orçamento!$A$3:$J$125,2,FALSE)","v":"SICRO"},{"$f":"VLOOKUP($A55,Orçamento!$A$3:$J$125,3,FALSE)","v":3806402},{"$f":"VLOOKUP($A55,Orçamento!$A$3:$J$125,4,FALSE)","v":"Limpeza em superfície de concreto "},{"$f":"VLOOKUP($A55,Orçamento!$A$3:$J$125,5,FALSE)","v":"m²"},{"$f":"VLOOKUP($A55,Orçamento!$A$3:$J$125,6,FALSE)","v":50},{"$f":"VLOOKUP($A55,Orçamento!$A$3:$J$125,7,FALSE)","v":2.66},{"$f":"VLOOKUP($A55,Orçamento!$A$3:$J$125,8,FALSE)","v":133},{"$f":"VLOOKUP($A55,Orçamento!$A$3:$J$125,9,FALSE)","v":3.31},{"$f":"VLOOKUP($A55,Orçamento!$A$3:$J$125,10,FALSE)","v":165.5},null,{"$f":"Eventograma!H81*'Desembolso-cronograma'!$I55","v":0},{"$f":"Eventograma!I81*'Desembolso-cronograma'!$I55","v":0},{"$f":"Eventograma!J81*'Desembolso-cronograma'!$I55","v":0},{"$f":"Eventograma!K81*'Desembolso-cronograma'!$I55","v":23.642857142857146},{"$f":"Eventograma!L81*'Desembolso-cronograma'!$I55","v":23.642857142857146},{"$f":"Eventograma!M81*'Desembolso-cronograma'!$I55","v":23.642857142857146},{"$f":"Eventograma!N81*'Desembolso-cronograma'!$I55","v":23.642857142857146},{"$f":"Eventograma!O81*'Desembolso-cronograma'!$I55","v":23.642857142857146},{"$f":"Eventograma!P81*'Desembolso-cronograma'!$I55","v":23.642857142857146},{"$f":"Eventograma!Q81*'Desembolso-cronograma'!$I55","v":23.642857142857146},{"$f":"Eventograma!R81*'Desembolso-cronograma'!$I55","v":0},{"$f":"Eventograma!S81*'Desembolso-cronograma'!$I55","v":0},{"$f":"Eventograma!T81*'Desembolso-cronograma'!$I55","v":0},{"$f":"Eventograma!U81*'Desembolso-cronograma'!$I55","v":0},{"$f":"Eventograma!V81*'Desembolso-cronograma'!$I55","v":0}]
["3.3.3",{"$f":"VLOOKUP($A56,Orçamento!$A$3:$J$125,2,FALSE)","v":"COMPOS."},{"$f":"VLOOKUP($A56,Orçamento!$A$3:$J$125,3,FALSE)","v":"0.006"},{"$f":"VLOOKUP($A56,Orçamento!$A$3:$J$125,4,FALSE)","v":"Veda Juntas O-22"},{"$f":"VLOOKUP($A56,Orçamento!$A$3:$J$125,5,FALSE)","v":"m"},{"$f":"VLOOKUP($A56,Orçamento!$A$3:$J$125,6,FALSE)","v":30},{"$f":"VLOOKUP($A56,Orçamento!$A$3:$J$125,7,FALSE)","v":90.0625},{"$f":"VLOOKUP($A56,Orçamento!$A$3:$J$125,8,FALSE)","v":2701.875},{"$f":"VLOOKUP($A56,Orçamento!$A$3:$J$125,9,FALSE)","v":112.09},{"$f":"VLOOKUP($A56,Orçamento!$A$3:$J$125,10,FALSE)","v":3362.7000000000003},null,{"$f":"Eventograma!H82*'Desembolso-cronograma'!$I56","v":0},{"$f":"Eventograma!I82*'Desembolso-cronograma'!$I56","v":0},{"$f":"Eventograma!J82*'Desembolso-cronograma'!$I56","v":0},{"$f":"Eventograma!K82*'Desembolso-cronograma'!$I56","v":480.3857142857143},{"$f":"Eventograma!L82*'Desembolso-cronograma'!$I56","v":480.3857142857143},{"$f":"Eventograma!M82*'Desembolso-cronograma'!$I56","v":480.3857142857143},{"$f":"Eventograma!N82*'Desembolso-cronograma'!$I56","v":480.3857142857143},{"$f":"Eventograma!O82*'Desembolso-cronograma'!$I56","v":480.3857142857143},{"$f":"Eventograma!P82*'Desembolso-cronograma'!$I56","v":480.3857142857143},{"$f":"Eventograma!Q82*'Desembolso-cronograma'!$I56","v":480.3857142857143},{"$f":"Eventograma!R82*'Desembolso-cronograma'!$I56","v":0},{"$f":"Eventograma!S82*'Desembolso-cronograma'!$I56","v":0},{"$f":"Eventograma!T82*'Desembolso-cronograma'!$I56","v":0},{"$f":"Eventograma!U82*'Desembolso-cronograma'!$I56","v":0},{"$f":"Eventograma!V82*'Desembolso-cronograma'!$I56","v":0}]
["3.3.4",{"$f":"VLOOKUP($A57,Orçamento!$A$3:$J$125,2,FALSE)","v":"SICRO"},{"$f":"VLOOKUP($A57,Orçamento!$A$3:$J$125,3,FALSE)","v":2407972},{"$f":"VLOOKUP($A57,Orçamento!$A$3:$J$125,4,FALSE)","v":"Adesivo estrutural à base de resina epóxi"},{"$f":"VLOOKUP($A57,Orçamento!$A$3:$J$125,5,FALSE)","v":"kg"},{"$f":"VLOOKUP($A57,Orçamento!$A$3:$J$125,6,FALSE)","v":40},{"$f":"VLOOKUP($A57,Orçamento!$A$3:$J$125,7,FALSE)","v":55.17},{"$f":"VLOOKUP($A57,Orçamento!$A$3:$J$125,8,FALSE)","v":2206.8000000000002},{"$f":"VLOOKUP($A57,Orçamento!$A$3:$J$125,9,FALSE)","v":68.66},{"$f":"VLOOKUP($A57,Orçamento!$A$3:$J$125,10,FALSE)","v":2746.3999999999996},null,{"$f":"Eventograma!H83*'Desembolso-cronograma'!$I57","v":0},{"$f":"Eventograma!I83*'Desembolso-cronograma'!$I57","v":0},{"$f":"Eventograma!J83*'Desembolso-cronograma'!$I57","v":0},{"$f":"Eventograma!K83*'Desembolso-cronograma'!$I57","v":392.34285714285716},{"$f":"Eventograma!L83*'Desembolso-cronograma'!$I57","v":392.34285714285716},{"$f":"Eventograma!M83*'Desembolso-cronograma'!$I57","v":392.34285714285716},{"$f":"Eventograma!N83*'Desembolso-cronograma'!$I57","v":392.34285714285716},{"$f":"Eventograma!O83*'Desembolso-cronograma'!$I57","v":392.34285714285716},{"$f":"Eventograma!P83*'Desembolso-cronograma'!$I57","v":392.34285714285716},{"$f":"Eventograma!Q83*'Desembolso-cronograma'!$I57","v":392.34285714285716},{"$f":"Eventograma!R83*'Desembolso-cronograma'!$I57","v":0},{"$f":"Eventograma!S83*'Desembolso-cronograma'!$I57","v":0},{"$f":"Eventograma!T83*'Desembolso-cronograma'!$I57","v":0},{"$f":"Eventograma!U83*'Desembolso-cronograma'!$I57","v":0},{"$f":"Eventograma!V83*'Desembolso-cronograma'!$I57","v":0}]
["3.3.5",{"$f":"VLOOKUP($A58,Orçamento!$A$3:$J$125,2,FALSE)","v":"SICRO"},{"$f":"VLOOKUP($A58,Orçamento!$A$3:$J$125,3,FALSE)","v":1108060},{"$f":"VLOOKUP($A58,Orçamento!$A$3:$J$125,4,FALSE)","v":"Argamassa polimérica com microssílica"},{"$f":"VLOOKUP($A58,Orçamento!$A$3:$J$125,5,FALSE)","v":"m³"},{"$f":"VLOOKUP($A58,Orçamento!$A$3:$J$125,6,FALSE)","v":3},{"$f":"VLOOKUP($A58,Orçamento!$A$3:$J$125,7,FALSE)","v":382.96},{"$f":"VLOOKUP($A58,Orçamento!$A$3:$J$125,8,FALSE)","v":1148.8799999999999},{"$f":"VLOOKUP($A58,Orçamento!$A$3:$J$125,9,FALSE)","v":476.61},{"$f":"VLOOKUP($A58,Orçamento!$A$3:$J$125,10,FALSE)","v":1429.83},null,{"$f":"Eventograma!H84*'Desembolso-cronograma'!$I58","v":0},{"$f":"Eventograma!I84*'Desembolso-cronograma'!$I58","v":0},{"$f":"Eventograma!J84*'Desembolso-cronograma'!$I58","v":0},{"$f":"Eventograma!K84*'Desembolso-cronograma'!$I58","v":204.26142857142855},{"$f":"Eventograma!L84*'Desembolso-cronograma'!$I58","v":204.26142857142855},{"$f":"Eventograma!M84*'Desembolso-cronograma'!$I58","v":204.26142857142855},{"$f":"Eventograma!N84*'Desembolso-cronograma'!$I58","v":204.26142857142855},{"$f":"Eventograma!O84*'Desembolso-cronograma'!$I58","v":204.26142857142855},{"$f":"Eventograma!P84*'Desembolso-cronograma'!$I58","v":204.26142857142855},{"$f":"Eventograma!Q84*'Desembolso-cronograma'!$I58","v":204.26142857142855},{"$f":"Eventograma!R84*'Desembolso-cronograma'!$I58","v":0},{"$f":"Eventograma!S84*'Desembolso-cronograma'!$I58","v":0},{"$f":"Eventograma!T84*'Desembolso-cronograma'!$I58","v":0},{"$f":"Eventograma!U84*'Desembolso-cronograma'!$I58","v":0},{"$f":"Eventograma!V84*'Desembolso-cronograma'!$I58","v":0}]
["3.3.6",{"$f":"VLOOKUP($A59,Orçamento!$A$3:$J$125,2,FALSE)","v":"SICRO"},{"$f":"VLOOKUP($A59,Orçamento!$A$3:$J$125,3,FALSE)","v":1109667},{"$f":"VLOOKUP($A59,Orçamento!$A$3:$J$125,4,FALSE)","v":"Argamassa Dry Pack"},{"$f":"VLOOKUP($A59,Orçamento!$A$3:$J$125,5,FALSE)","v":"m³"},{"$f":"VLOOKUP($A59,Orçamento!$A$3:$J$125,6,FALSE)","v":3},{"$f":"VLOOKUP($A59,Orçamento!$A$3:$J$125,7,FALSE)","v":364.36},{"$f":"VLOOKUP($A59,Orçamento!$A$3:$J$125,8,FALSE)","v":1093.08},{"$f":"VLOOKUP($A59,Orçamento!$A$3:$J$125,9,FALSE)","v":453.47},{"$f":"VLOOKUP($A59,Orçamento!$A$3:$J$125,10,FALSE)","v":1360.41},null,{"$f":"Eventograma!H85*'Desembolso-cronograma'!$I59","v":0},{"$f":"Eventograma!I85*'Desembolso-cronograma'!$I59","v":0},{"$f":"Eventograma!J85*'Desembolso-cronograma'!$I59","v":0},{"$f":"Eventograma!K85*'Desembolso-cronograma'!$I59","v":194.34428571428572},{"$f":"Eventograma!L85*'Desembolso-cronograma'!$I59","v":194.34428571428572},{"$f":"Eventograma!M85*'Desembolso-cronograma'!$I59","v":194.34428571428572},{"$f":"Eventograma!N85*'Desembolso-cronograma'!$I59","v":194.34428571428572},{"$f":"Eventograma!O85*'Desembolso-cronograma'!$I59","v":194.34428571428572},{"$f":"Eventograma!P85*'Desembolso-cronograma'!$I59","v":194.34428571428572},{"$f":"Eventograma!Q85*'Desembolso-cronograma'!$I59","v":194.34428571428572},{"$f":"Eventograma!R85*'Desembolso-cronograma'!$I59","v":0},{"$f":"Eventograma!S85*'Desembolso-cronograma'!$I59","v":0},{"$f":"Eventograma!T85*'Desembolso-cronograma'!$I59","v":0},{"$f":"Eventograma!U85*'Desembolso-cronograma'!$I59","v":0},{"$f":"Eventograma!V85*'Desembolso-cronograma'!$I59","v":0}]
["3.3.7",{"$f":"VLOOKUP($A60,Orçamento!$A$3:$J$125,2,FALSE)","v":"SICRO"},{"$f":"VLOOKUP($A60,Orçamento!$A$3:$J$125,3,FALSE)","v":1108056},{"$f":"VLOOKUP($A60,Orçamento!$A$3:$J$125,4,FALSE)","v":"Microconcreto autoadensável "},{"$f":"VLOOKUP($A60,Orçamento!$A$3:$J$125,5,FALSE)","v":"m³"},{"$f":"VLOOKUP($A60,Orçamento!$A$3:$J$125,6,FALSE)","v":9},{"$f":"VLOOKUP($A60,Orçamento!$A$3:$J$125,7,FALSE)","v":1823.22},{"$f":"VLOOKUP($A60,Orçamento!$A$3:$J$125,8,FALSE)","v":16408.98},{"$f":"VLOOKUP($A60,Orçamento!$A$3:$J$125,9,FALSE)","v":2269.1},{"$f":"VLOOKUP($A60,Orçamento!$A$3:$J$125,10,FALSE)","v":20421.899999999998},null,{"$f":"Eventograma!H86*'Desembolso-cronograma'!$I60","v":0},{"$f":"Eventograma!I86*'Desembolso-cronograma'!$I60","v":0},{"$f":"Eventograma!J86*'Desembolso-cronograma'!$I60","v":0},{"$f":"Eventograma!K86*'Desembolso-cronograma'!$I60","v":2917.4142857142856},{"$f":"Eventograma!L86*'Desembolso-cronograma'!$I60","v":2917.4142857142856},{"$f":"Eventograma!M86*'Desembolso-cronograma'!$I60","v":2917.4142857142856},{"$f":"Eventograma!N86*'Desembolso-cronograma'!$I60","v":2917.4142857142856},{"$f":"Eventograma!O86*'Desembolso-cronograma'!$I60","v":2917.4142857142856},{"$f":"Eventograma!P86*'Desembolso-cronograma'!$I60","v":2917.4142857142856},{"$f":"Eventograma!Q86*'Desembolso-cronograma'!$I60","v":2917.4142857142856},{"$f":"Eventograma!R86*'Desembolso-cronograma'!$I60","v":0},{"$f":"Eventograma!S86*'Desembolso-cronograma'!$I60","v":0},{"$f":"Eventograma!T86*'Desembolso-cronograma'!$I60","v":0},{"$f":"Eventograma!U86*'Desembolso-cronograma'!$I60","v":0},{"$f":"Eventograma!V86*'Desembolso-cronograma'!$I60","v":0}]
["3.3.8",{"$f":"VLOOKUP($A61,Orçamento!$A$3:$J$125,2,FALSE)","v":"SICRO"},{"$f":"VLOOKUP($A61,Orçamento!$A$3:$J$125,3,FALSE)","v":3806415},{"$f":"VLOOKUP($A61,Orçamento!$A$3:$J$125,4,FALSE)","v":"Demolição controlada "},{"$f":"VLOOKUP($A61,Orçamento!$A$3:$J$125,5,FALSE)","v":"m³"},{"$f":"VLOOKUP($A61,Orçamento!$A$3:$J$125,6,FALSE)","v":3},{"$f":"VLOOKUP($A61,Orçamento!$A$3:$J$125,7,FALSE)","v":663.31},{"$f":"VLOOKUP($A61,Orçamento!$A$3:$J$125,8,FALSE)","v":1989.9299999999998},{"$f":"VLOOKUP($A61,Orçamento!$A$3:$J$125,9,FALSE)","v":825.53},{"$f":"VLOOKUP($A61,Orçamento!$A$3:$J$125,10,FALSE)","v":2476.59},null,{"$f":"Eventograma!H87*'Desembolso-cronograma'!$I61","v":0},{"$f":"Eventograma!I87*'Desembolso-cronograma'!$I61","v":0},{"$f":"Eventograma!J87*'Desembolso-cronograma'!$I61","v":0},{"$f":"Eventograma!K87*'Desembolso-cronograma'!$I61","v":353.79857142857139},{"$f":"Eventograma!L87*'Desembolso-cronograma'!$I61","v":353.79857142857139},{"$f":"Eventograma!M87*'Desembolso-cronograma'!$I61","v":353.79857142857139},{"$f":"Eventograma!N87*'Desembolso-cronograma'!$I61","v":353.79857142857139},{"$f":"Eventograma!O87*'Desembolso-cronograma'!$I61","v":353.79857142857139},{"$f":"Eventograma!P87*'Desembolso-cronograma'!$I61","v":353.79857142857139},{"$f":"Eventograma!Q87*'Desembolso-cronograma'!$I61","v":353.79857142857139},{"$f":"Eventograma!R87*'Desembolso-cronograma'!$I61","v":0},{"$f":"Eventograma!S87*'Desembolso-cronograma'!$I61","v":0},{"$f":"Eventograma!T87*'Desembolso-cronograma'!$I61","v":0},{"$f":"Eventograma!U87*'Desembolso-cronograma'!$I61","v":0},{"$f":"Eventograma!V87*'Desembolso-cronograma'!$I61","v":0}]
[{"$nulls":5},{"$f":"Orçamento!F61","v":0},{"$f":"Orçamento!G61","v":0}]
[4,null,null,"Barragem de Terra",null,{"$f":"Orçamento!F62","v":0},{"$f":"Orçamento!G62","v":0},{"$f":"SUBTOTAL(9,H64:H116)","v":3030938.3232643143},null,{"$f":"SUBTOTAL(9,J64:J116)","v":3772419.794206996},null,{"$f":"SUBTOTAL(9,L64:L116)","v":0},{"$f":"SUBTOTAL(9,N64:N116)","v":54125.124877124996},140620.70248426785,253727.05415989287,690725.47286509979,806277.1128650998,813684.35286509979,731967.75160614157,275455.09248426784,0,null,0,0,0,0]
["4.1",null,null,"Montante",null,{"$f":"Orçamento!F63","v":0},{"$f":"Orçamento!G63","v":0},{"$f":"SUBTOTAL(9,H65:H78)","v":1710065.4573833141},null,{"$f":"SUBTOTAL(9,J65:J78)","v":2128275.8231899953},null,{"$f":"SUBTOTAL(9,L65:L79)","v":0},{"$f":"SUBTOTAL(9,N65:N79)","v":4378.3999999999996},7850.2,124739.081675625,531808.01079749875,509382.07079749875,509382.07079749875,436988.94912187377,3747.04,0,null,0,0,0,0]
["4.2.1",{"$f":"VLOOKUP($A65,Orçamento!$A$3:$J$125,2,FALSE)","v":"SICRO"},{"$f":"VLOOKUP($A65,Orçamento!$A$3:$J$125,3,FALSE)","v":5502985},{"$f":"VLOOKUP($A65,Orçamento!$A$3:$J$125,4,FALSE)","v":"Limpeza da camada vegetal"},{"$f":"VLOOKUP($A65,Orçamento!$A$3:$J$125,5,FALSE)","v":"m²"},{"$f":"VLOOKUP($A65,Orçamento!$A$3:$J$125,6,FALSE)","v":16840},{"$f":"VLOOKUP($A65,Orçamento!$A$3:$J$125,7,FALSE)","v":0.31},{"$f":"VLOOKUP($A65,Orçamento!$A$3:$J$125,8,FALSE)","v":5220.3999999999996},{"$f":"VLOOKUP($A65,Orçamento!$A$3:$J$125,9,FALSE)","v":0.39},{"$f":"VLOOKUP($A65,Orçamento!$A$3:$J$125,10,FALSE)","v":6567.6},null,{"$f":"Eventograma!H97*'Desembolso-cronograma'!$I65","v":0},{"$f":"Eventograma!J97*'Desembolso-cronograma'!$I65","v":0},{"$f":"Eventograma!K97*'Desembolso-cronograma'!$I65","v":4378.3999999999996},{"$f":"Eventograma!L97*'Desembolso-cronograma'!$I65","v":2189.1999999999998},{"$f":"Eventograma!M97*'Desembolso-cronograma'!$I65","v":0},{"$f":"Eventograma!N97*'Desembolso-cronograma'!$I65","v":0},{"$f":"Eventograma!O97*'Desembolso-cronograma'!$I65","v":0},{"$f":"Eventograma!P97*'Desembolso-cronograma'!$I65","v":0},{"$f":"Eventograma!Q97*'Desembolso-cronograma'!$I65","v":0},{"$f":"Eventograma!R97*'Desembolso-cronograma'!$I65","v":0},null,{"$f":"Eventograma!S97*'Desembolso-cronograma'!$I65","v":0},{"$f":"Eventograma!T97*'Desembolso-cronograma'!$I65","v":0},{"$f":"Eventograma!U97*'Desembolso-cronograma'!$I65","v":0},{"$f":"Eventograma!V97*'Desembolso-cronograma'!$I65","v":0}]
["4.2.2",{"$f":"VLOOKUP($A66,Orçamento!$A$3:$J$125,2,FALSE)","v":"SINAPI"},{"$f":"VLOOKUP($A66,Orçamento!$A$3:$J$125,3,FALSE)","v":98527},{"$f":"VLOOKUP($A66,Orçamento!$A$3:$J$125,4,FALSE)","v":"Remoção de raízes e cupinzeiros"},{"$f":"VLOOKUP($A66,Orçamento!$A$3:$J$125,5,FALSE)","v":"und"},{"$f":"VLOOKUP($A66,Orçamento!$A$3:$J$125,6,FALSE)","v":34},{"$f":"VLOOKUP($A66,Orçamento!$A$3:$J$125,7,FALSE)","v":133.78},{"$f":"VLOOKUP($A66,Orçamento!$A$3:$J$125,8,FALSE)","v":4548.5200000000004},{"$f":"VLOOKUP($A66,Orçamento!$A$3:$J$125,9,FALSE)","v":166.5},{"$f":"VLOOKUP($A66,Orçamento!$A$3:$J$125,10,FALSE)","v":5661},null,{"$f":"Eventograma!H98*'Desembolso-cronograma'!$I66","v":0},{"$f":"Eventograma!J98*'Desembolso-cronograma'!$I66","v":0},{"$f":"Eventograma!K98*'Desembolso-cronograma'!$I66","v":0},{"$f":"Eventograma!L98*'Desembolso-cronograma'!$I66","v":5661},{"$f":"Eventograma!M98*'Desembolso-cronograma'!$I66","v":0},{"$f":"Eventograma!N98*'Desembolso-cronograma'!$I66","v":0},{"$f":"Eventograma!O98*'Desembolso-cronograma'!$I66","v":0},{"$f":"Eventograma!P98*'Desembolso-cronograma'!$I66","v":0},{"$f":"Eventograma!Q98*'Desembolso-cronograma'!$I66","v":0},{"$f":"Eventograma!R98*'Desembolso-cronograma'!$I66","v":0},null,{"$f":"Eventograma!S98*'Desembolso-cronograma'!$I66","v":0},{"$f":"Eventograma!T98*'Desembolso-cronograma'!$I66","v":0},{"$f":"Eventograma!U98*'Desembolso-cronograma'!$I66","v":0},{"$f":"Eventograma!V98*'Desembolso-cronograma'!$I66","v":0}]
["4.2.3",{"$f":"VLOOKUP($A67,Orçamento!$A$3:$J$125,2,FALSE)","v":"SICRO"},{"$f":"VLOOKUP($A67,Orçamento!$A$3:$J$125,3,FALSE)","v":4915625},{"$f":"VLOOKUP($A67,Orçamento!$A$3:$J$125,4,FALSE)","v":"Recomposição em Solo Cimento"},{"$f":"VLOOKUP($A67,Orçamento!$A$3:$J$125,5,FALSE)","v":"m³"},{"$f":"VLOOKUP($A67,Orçamento!$A$3:$J$125,6,FALSE)","v":1718},{"$f":"VLOOKUP($A67,Orçamento!$A$3:$J$125,7,FALSE)","v":27.05},{"$f":"VLOOKUP($A67,Orçamento!$A$3:$J$125,8,FALSE)","v":46471.9},{"$f":"VLOOKUP($A67,Orçamento!$A$3:$J$125,9,FALSE)","v":33.67},{"$f":"VLOOKUP($A67,Orçamento!$A$3:$J$125,10,FALSE)","v":57845.060000000005},null,{"$f":"Eventograma!H99*'Desembolso-cronograma'!$I67","v":0},{"$f":"Eventograma!J99*'Desembolso-cronograma'!$I67","v":0},{"$f":"Eventograma!K99*'Desembolso-cronograma'!$I67","v":0},{"$f":"Eventograma!L99*'Desembolso-cronograma'!$I67","v":0},{"$f":"Eventograma!M99*'Desembolso-cronograma'!$I67","v":38563.373333333329},{"$f":"Eventograma!N99*'Desembolso-cronograma'!$I67","v":19281.686666666665},{"$f":"Eventograma!O99*'Desembolso-cronograma'!$I67","v":0},{"$f":"Eventograma!P99*'Desembolso-cronograma'!$I67","v":0},{"$f":"Eventograma!Q99*'Desembolso-cronograma'!$I67","v":0},{"$f":"Eventograma!R99*'Desembolso-cronograma'!$I67","v":0},null,{"$f":"Eventograma!S99*'Desembolso-cronograma'!$I67","v":0},{"$f":"Eventograma!T99*'Desembolso-cronograma'!$I67","v":0},{"$f":"Eventograma!U99*'Desembolso-cronograma'!$I67","v":0},{"$f":"Eventograma!V99*'Desembolso-cronograma'!$I67","v":0}]
["4.2.5",{"$f":"VLOOKUP($A68,Orçamento!$A$3:$J$125,2,FALSE)","v":"SICRO"},{"$f":"VLOOKUP($A68,Orçamento!$A$3:$J$125,3,FALSE)","v":4805754},{"$f":"VLOOKUP($A68,Orçamento!$A$3:$J$125,4,FALSE)","v":"Compactação Manual"},{"$f":"VLOOKUP($A68,Orçamento!$A$3:$J$125,5,FALSE)","v":"m³"},{"$f":"VLOOKUP($A68,Orçamento!$A$3:$J$125,6,FALSE)","v":1718},{"$f":"VLOOKUP($A68,Orçamento!$A$3:$J$125,7,FALSE)","v":4.93},{"$f":"VLOOKUP($A68,Orçamento!$A$3:$J$125,8,FALSE)","v":8469.74},{"$f":"VLOOKUP($A68,Orçamento!$A$3:$J$125,9,FALSE)","v":6.14},{"$f":"VLOOKUP($A68,Orçamento!$A$3:$J$125,10,FALSE)","v":10548.519999999999},null,{"$f":"Eventograma!H101*'Desembolso-cronograma'!$I68","v":0},{"$f":"Eventograma!J101*'Desembolso-cronograma'!$I68","v":0},{"$f":"Eventograma!K101*'Desembolso-cronograma'!$I68","v":0},{"$f":"Eventograma!L101*'Desembolso-cronograma'!$I68","v":0},{"$f":"Eventograma!M101*'Desembolso-cronograma'!$I68","v":7032.3466666666654},{"$f":"Eventograma!N101*'Desembolso-cronograma'!$I68","v":3516.1733333333327},{"$f":"Eventograma!O101*'Desembolso-cronograma'!$I68","v":0},{"$f":"Eventograma!P101*'Desembolso-cronograma'!$I68","v":0},{"$f":"Eventograma!Q101*'Desembolso-cronograma'!$I68","v":0},{"$f":"Eventograma!R101*'Desembolso-cronograma'!$I68","v":0},null,{"$f":"Eventograma!S101*'Desembolso-cronograma'!$I68","v":0},{"$f":"Eventograma!T101*'Desembolso-cronograma'!$I68","v":0},{"$f":"Eventograma!U101*'Desembolso-cronograma'!$I68","v":0},{"$f":"Eventograma!V101*'Desembolso-cronograma'!$I68","v":0}]
["4.2.6",{"$f":"VLOOKUP($A69,Orçamento!$A$3:$J$125,2,FALSE)","v":"SICRO"},{"$f":"VLOOKUP($A69,Orçamento!$A$3:$J$125,3,FALSE)","v":4805757},{"$f":"VLOOKUP($A69,Orçamento!$A$3:$J$125,4,FALSE)","v":"Escavação mecânica de vala"},{"$f":"VLOOKUP($A69,Orçamento!$A$3:$J$125,5,FALSE)","v":"m³"},{"$f":"VLOOKUP($A69,Orçamento!$A$3:$J$125,6,FALSE)","v":2058},{"$f":"VLOOKUP($A69,Orçamento!$A$3:$J$125,7,FALSE)","v":3.95},{"$f":"VLOOKUP($A69,Orçamento!$A$3:$J$125,8,FALSE)","v":8129.1},{"$f":"VLOOKUP($A69,Orçamento!$A$3:$J$125,9,FALSE)","v":4.92},{"$f":"VLOOKUP($A69,Orçamento!$A$3:$J$125,10,FALSE)","v":10125.36},null,{"$f":"Eventograma!H102*'Desembolso-cronograma'!$I69","v":0},{"$f":"Eventograma!J102*'Desembolso-cronograma'!$I69","v":0},{"$f":"Eventograma!K102*'Desembolso-cronograma'!$I69","v":0},{"$f":"Eventograma!L102*'Desembolso-cronograma'!$I69","v":0},{"$f":"Eventograma!M102*'Desembolso-cronograma'!$I69","v":6750.24},{"$f":"Eventograma!N102*'Desembolso-cronograma'!$I69","v":3375.12},{"$f":"Eventograma!O102*'Desembolso-cronograma'!$I69","v":0},{"$f":"Eventograma!P102*'Desembolso-cronograma'!$I69","v":0},{"$f":"Eventograma!Q102*'Desembolso-cronograma'!$I69","v":0},{"$f":"Eventograma!R102*'Desembolso-cronograma'!$I69","v":0},null,{"$f":"Eventograma!S102*'Desembolso-cronograma'!$I69","v":0},{"$f":"Eventograma!T102*'Desembolso-cronograma'!$I69","v":0},{"$f":"Eventograma!U102*'Desembolso-cronograma'!$I69","v":0},{"$f":"Eventograma!V102*'Desembolso-cronograma'!$I69","v":0}]
["4.2.7",{"$f":"VLOOKUP($A70,Orçamento!$A$3:$J$125,2,FALSE)","v":"SICRO"},{"$f":"VLOOKUP($A70,Orçamento!$A$3:$J$125,3,FALSE)","v":2004505},{"$f":"VLOOKUP($A70,Orçamento!$A$3:$J$125,4,FALSE)","v":"Reaterro e compactação em vala"},{"$f":"VLOOKUP($A70,Orçamento!$A$3:$J$125,5,FALSE)","v":"m³"},{"$f":"VLOOKUP($A70,Orçamento!$A$3:$J$125,6,FALSE)","v":704},{"$f":"VLOOKUP($A70,Orçamento!$A$3:$J$125,7,FALSE)","v":17.11},{"$f":"VLOOKUP($A70,Orçamento!$A$3:$J$125,8,FALSE)","v":12045.439999999999},{"$f":"VLOOKUP($A70,Orçamento!$A$3:$J$125,9,FALSE)","v":21.29},{"$f":"VLOOKUP($A70,Orçamento!$A$3:$J$125,10,FALSE)","v":14988.16},null,{"$f":"Eventograma!H103*'Desembolso-cronograma'!$I70","v":0},{"$f":"Eventograma!J103*'Desembolso-cronograma'!$I70","v":0},{"$f":"Eventograma!K103*'Desembolso-cronograma'!$I70","v":0},{"$f":"Eventograma!L103*'Desembolso-cronograma'!$I70","v":0},{"$f":"Eventograma!M103*'Desembolso-cronograma'!$I70","v":0},{"$f":"Eventograma!N103*'Desembolso-cronograma'!$I70","v":0},{"$f":"Eventograma!O103*'Desembolso-cronograma'!$I70","v":3747.04},{"$f":"Eventograma!P103*'Desembolso-cronograma'!$I70","v":3747.04},{"$f":"Eventograma!Q103*'Desembolso-cronograma'!$I70","v":3747.04},{"$f":"Eventograma!R103*'Desembolso-cronograma'!$I70","v":3747.04},null,{"$f":"Eventograma!S103*'Desembolso-cronograma'!$I70","v":0},{"$f":"Eventograma!T103*'Desembolso-cronograma'!$I70","v":0},{"$f":"Eventograma!U103*'Desembolso-cronograma'!$I70","v":0},{"$f":"Eventograma!V103*'Desembolso-cronograma'!$I70","v":0}]
["4.2.8",{"$f":"VLOOKUP($A71,Orçamento!$A$3:$J$125,2,FALSE)","v":"SICRO"},{"$f":"VLOOKUP($A71,Orçamento!$A$3:$J$125,3,FALSE)","v":2003867},{"$f":"VLOOKUP($A71,Orçamento!$A$3:$J$125,4,FALSE)","v":"Aplicação de geotextil"},{"$f":"VLOOKUP($A71,Orçamento!$A$3:$J$125,5,FALSE)","v":"m²"},{"$f":"VLOOKUP($A71,Orçamento!$A$3:$J$125,6,FALSE)","v":14765},{"$f":"VLOOKUP($A71,Orçamento!$A$3:$J$125,7,FALSE)","v":14.11},{"$f":"VLOOKUP($A71,Orçamento!$A$3:$J$125,8,FALSE)","v":208334.15},{"$f":"VLOOKUP($A71,Orçamento!$A$3:$J$125,9,FALSE)","v":17.559999999999999},{"$f":"VLOOKUP($A71,Orçamento!$A$3:$J$125,10,FALSE)","v":259273.4},null,{"$f":"Eventograma!H104*'Desembolso-cronograma'!$I71","v":0},{"$f":"Eventograma!J104*'Desembolso-cronograma'!$I71","v":0},{"$f":"Eventograma!K104*'Desembolso-cronograma'!$I71","v":0},{"$f":"Eventograma!L104*'Desembolso-cronograma'!$I71","v":0},{"$f":"Eventograma!M104*'Desembolso-cronograma'!$I71","v":64818.35},{"$f":"Eventograma!N104*'Desembolso-cronograma'!$I71","v":64818.35},{"$f":"Eventograma!O104*'Desembolso-cronograma'!$I71","v":64818.35},{"$f":"Eventograma!P104*'Desembolso-cronograma'!$I71","v":64818.35},{"$f":"Eventograma!Q104*'Desembolso-cronograma'!$I71","v":0},{"$f":"Eventograma!R104*'Desembolso-cronograma'!$I71","v":0},null,{"$f":"Eventograma!S104*'Desembolso-cronograma'!$I71","v":0},{"$f":"Eventograma!T104*'Desembolso-cronograma'!$I71","v":0},{"$f":"Eventograma!U104*'Desembolso-cronograma'!$I71","v":0},{"$f":"Eventograma!V104*'Desembolso-cronograma'!$I71","v":0}]
["4.2.9",{"$f":"VLOOKUP($A72,Orçamento!$A$3:$J$125,2,FALSE)","v":"SICRO"},{"$f":"VLOOKUP($A72,Orçamento!$A$3:$J$125,3,FALSE)","v":407820},{"$f":"VLOOKUP($A72,Orçamento!$A$3:$J$125,4,FALSE)","v":"Armação em aço CA-60 "},{"$f":"VLOOKUP($A72,Orçamento!$A$3:$J$125,5,FALSE)","v":"kg"},{"$f":"VLOOKUP($A72,Orçamento!$A$3:$J$125,6,FALSE)","v":2655.4852500000002},{"$f":"VLOOKUP($A72,Orçamento!$A$3:$J$125,7,FALSE)","v":9.17},{"$f":"VLOOKUP($A72,Orçamento!$A$3:$J$125,8,FALSE)","v":24350.799742500003},{"$f":"VLOOKUP($A72,Orçamento!$A$3:$J$125,9,FALSE)","v":11.41},{"$f":"VLOOKUP($A72,Orçamento!$A$3:$J$125,10,FALSE)","v":30299.086702500001},null,{"$f":"Eventograma!H105*'Desembolso-cronograma'!$I72","v":0},{"$f":"Eventograma!J105*'Desembolso-cronograma'!$I72","v":0},{"$f":"Eventograma!K105*'Desembolso-cronograma'!$I72","v":0},{"$f":"Eventograma!L105*'Desembolso-cronograma'!$I72","v":0},{"$f":"Eventograma!M105*'Desembolso-cronograma'!$I72","v":7574.7716756250002},{"$f":"Eventograma!N105*'Desembolso-cronograma'!$I72","v":7574.7716756250002},{"$f":"Eventograma!O105*'Desembolso-cronograma'!$I72","v":7574.7716756250002},{"$f":"Eventograma!P105*'Desembolso-cronograma'!$I72","v":7574.7716756250002},{"$f":"Eventograma!Q105*'Desembolso-cronograma'!$I72","v":0},{"$f":"Eventograma!R105*'Desembolso-cronograma'!$I72","v":0},null,{"$f":"Eventograma!S105*'Desembolso-cronograma'!$I72","v":0},{"$f":"Eventograma!T105*'Desembolso-cronograma'!$I72","v":0},{"$f":"Eventograma!U105*'Desembolso-cronograma'!$I72","v":0},{"$f":"Eventograma!V105*'Desembolso-cronograma'!$I72","v":0}]
["4.2.10",{"$f":"VLOOKUP($A73,Orçamento!$A$3:$J$125,2,FALSE)","v":"SICRO"},{"$f":"VLOOKUP($A73,Orçamento!$A$3:$J$125,3,FALSE)","v":1516303},{"$f":"VLOOKUP($A73,Orçamento!$A$3:$J$125,4,FALSE)","v":"Geocélula de PEAD"},{"$f":"VLOOKUP($A73,Orçamento!$A$3:$J$125,5,FALSE)","v":"m²"},{"$f":"VLOOKUP($A73,Orçamento!$A$3:$J$125,6,FALSE)","v":14765},{"$f":"VLOOKUP($A73,Orçamento!$A$3:$J$125,7,FALSE)","v":36.409999999999997},{"$f":"VLOOKUP($A73,Orçamento!$A$3:$J$125,8,FALSE)","v":537593.64999999991},{"$f":"VLOOKUP($A73,Orçamento!$A$3:$J$125,9,FALSE)","v":45.31},{"$f":"VLOOKUP($A73,Orçamento!$A$3:$J$125,10,FALSE)","v":669002.15},null,{"$f":"Eventograma!H106*'Desembolso-cronograma'!$I73","v":0},{"$f":"Eventograma!J106*'Desembolso-cronograma'!$I73","v":0},{"$f":"Eventograma!K106*'Desembolso-cronograma'!$I73","v":0},{"$f":"Eventograma!L106*'Desembolso-cronograma'!$I73","v":0},{"$f":"Eventograma!M106*'Desembolso-cronograma'!$I73","v":0},{"$f":"Eventograma!N106*'Desembolso-cronograma'!$I73","v":167250.53750000001},{"$f":"Eventograma!O106*'Desembolso-cronograma'!$I73","v":167250.53750000001},{"$f":"Eventograma!P106*'Desembolso-cronograma'!$I73","v":167250.53750000001},{"$f":"Eventograma!Q106*'Desembolso-cronograma'!$I73","v":167250.53750000001},{"$f":"Eventograma!R106*'Desembolso-cronograma'!$I73","v":0},null,{"$f":"Eventograma!S106*'Desembolso-cronograma'!$I73","v":0},{"$f":"Eventograma!T106*'Desembolso-cronograma'!$I73","v":0},{"$f":"Eventograma!U106*'Desembolso-cronograma'!$I73","v":0},{"$f":"Eventograma!V106*'Desembolso-cronograma'!$I73","v":0}]
["4.2.11",{"$f":"VLOOKUP($A74,Orçamento!$A$3:$J$125,2,FALSE)","v":"SICRO"},{"$f":"VLOOKUP($A74,Orçamento!$A$3:$J$125,3,FALSE)","v":2008091},{"$f":"VLOOKUP($A74,Orçamento!$A$3:$J$125,4,FALSE)","v":"Tubo PVC de ancoragem "},{"$f":"VLOOKUP($A74,Orçamento!$A$3:$J$125,5,FALSE)","v":"m"},{"$f":"VLOOKUP($A74,Orçamento!$A$3:$J$125,6,FALSE)","v":1759},{"$f":"VLOOKUP($A74,Orçamento!$A$3:$J$125,7,FALSE)","v":78.08},{"$f":"VLOOKUP($A74,Orçamento!$A$3:$J$125,8,FALSE)","v":137342.72},{"$f":"VLOOKUP($A74,Orçamento!$A$3:$J$125,9,FALSE)","v":97.17},{"$f":"VLOOKUP($A74,Orçamento!$A$3:$J$125,10,FALSE)","v":170922.03},null,{"$f":"Eventograma!H107*'Desembolso-cronograma'!$I74","v":0},{"$f":"Eventograma!J107*'Desembolso-cronograma'!$I74","v":0},{"$f":"Eventograma!K107*'Desembolso-cronograma'!$I74","v":0},{"$f":"Eventograma!L107*'Desembolso-cronograma'!$I74","v":0},{"$f":"Eventograma!M107*'Desembolso-cronograma'!$I74","v":0},{"$f":"Eventograma!N107*'Desembolso-cronograma'!$I74","v":42730.5075},{"$f":"Eventograma!O107*'Desembolso-cronograma'!$I74","v":42730.5075},{"$f":"Eventograma!P107*'Desembolso-cronograma'!$I74","v":42730.5075},{"$f":"Eventograma!Q107*'Desembolso-cronograma'!$I74","v":42730.5075},{"$f":"Eventograma!R107*'Desembolso-cronograma'!$I74","v":0},null,{"$f":"Eventograma!S107*'Desembolso-cronograma'!$I74","v":0},{"$f":"Eventograma!T107*'Desembolso-cronograma'!$I74","v":0},{"$f":"Eventograma!U107*'Desembolso-cronograma'!$I74","v":0},{"$f":"Eventograma!V107*'Desembolso-cronograma'!$I74","v":0}]
["4.2.12",{"$f":"VLOOKUP($A75,Orçamento!$A$3:$J$125,2,FALSE)","v":"SICRO"},{"$f":"VLOOKUP($A75,Orçamento!$A$3:$J$125,3,FALSE)","v":1106109},{"$f":"VLOOKUP($A75,Orçamento!$A$3:$J$125,4,FALSE)","v":"Concreto fck = 20 Mpa"},{"$f":"VLOOKUP($A75,Orçamento!$A$3:$J$125,5,FALSE)","v":"m³"},{"$f":"VLOOKUP($A75,Orçamento!$A$3:$J$125,6,FALSE)","v":2492.7590958118626},{"$f":"VLOOKUP($A75,Orçamento!$A$3:$J$125,7,FALSE)","v":219.85},{"$f":"VLOOKUP($A75,Orçamento!$A$3:$J$125,8,FALSE)","v":548033.08721423801},{"$f":"VLOOKUP($A75,Orçamento!$A$3:$J$125,9,FALSE)","v":273.62},{"$f":"VLOOKUP($A75,Orçamento!$A$3:$J$125,10,FALSE)","v":682068.74379604182},null,{"$f":"Eventograma!H108*'Desembolso-cronograma'!$I75","v":0},{"$f":"Eventograma!J108*'Desembolso-cronograma'!$I75","v":0},{"$f":"Eventograma!K108*'Desembolso-cronograma'!$I75","v":0},{"$f":"Eventograma!L108*'Desembolso-cronograma'!$I75","v":0},{"$f":"Eventograma!M108*'Desembolso-cronograma'!$I75","v":0},{"$f":"Eventograma!N108*'Desembolso-cronograma'!$I75","v":170517.18594901045},{"$f":"Eventograma!O108*'Desembolso-cronograma'!$I75","v":170517.18594901045},{"$f":"Eventograma!P108*'Desembolso-cronograma'!$I75","v":170517.18594901045},{"$f":"Eventograma!Q108*'Desembolso-cronograma'!$I75","v":170517.18594901045},{"$f":"Eventograma!R108*'Desembolso-cronograma'!$I75","v":0},null,{"$f":"Eventograma!S108*'Desembolso-cronograma'!$I75","v":0},{"$f":"Eventograma!T108*'Desembolso-cronograma'!$I75","v":0},{"$f":"Eventograma!U108*'Desembolso-cronograma'!$I75","v":0},{"$f":"Eventograma!V108*'Desembolso-cronograma'!$I75","v":0}]
["4.2.13",{"$f":"VLOOKUP($A76,Orçamento!$A$3:$J$125,2,FALSE)","v":"SICRO"},{"$f":"VLOOKUP($A76,Orçamento!$A$3:$J$125,3,FALSE)","v":1107860},{"$f":"VLOOKUP($A76,Orçamento!$A$3:$J$125,4,FALSE)","v":"Bombeamento"},{"$f":"VLOOKUP($A76,Orçamento!$A$3:$J$125,5,FALSE)","v":"m³"},{"$f":"VLOOKUP($A76,Orçamento!$A$3:$J$125,6,FALSE)","v":2492.7590958118626},{"$f":"VLOOKUP($A76,Orçamento!$A$3:$J$125,7,FALSE)","v":28.93},{"$f":"VLOOKUP($A76,Orçamento!$A$3:$J$125,8,FALSE)","v":72115.520641837182},{"$f":"VLOOKUP($A76,Orçamento!$A$3:$J$125,9,FALSE)","v":36},{"$f":"VLOOKUP($A76,Orçamento!$A$3:$J$125,10,FALSE)","v":89739.327449227058},null,{"$f":"Eventograma!H109*'Desembolso-cronograma'!$I76","v":0},{"$f":"Eventograma!J109*'Desembolso-cronograma'!$I76","v":0},{"$f":"Eventograma!K109*'Desembolso-cronograma'!$I76","v":0},{"$f":"Eventograma!L109*'Desembolso-cronograma'!$I76","v":0},{"$f":"Eventograma!M109*'Desembolso-cronograma'!$I76","v":0},{"$f":"Eventograma!N109*'Desembolso-cronograma'!$I76","v":22434.831862306764},{"$f":"Eventograma!O109*'Desembolso-cronograma'!$I76","v":22434.831862306764},{"$f":"Eventograma!P109*'Desembolso-cronograma'!$I76","v":22434.831862306764},{"$f":"Eventograma!Q109*'Desembolso-cronograma'!$I76","v":22434.831862306764},{"$f":"Eventograma!R109*'Desembolso-cronograma'!$I76","v":0},null,{"$f":"Eventograma!S109*'Desembolso-cronograma'!$I76","v":0},{"$f":"Eventograma!T109*'Desembolso-cronograma'!$I76","v":0},{"$f":"Eventograma!U109*'Desembolso-cronograma'!$I76","v":0},{"$f":"Eventograma!V109*'Desembolso-cronograma'!$I76","v":0}]
["4.2.14",{"$f":"VLOOKUP($A77,Orçamento!$A$3:$J$125,2,FALSE)","v":"SICRO"},{"$f":"VLOOKUP($A77,Orçamento!$A$3:$J$125,3,FALSE)","v":1100657},{"$f":"VLOOKUP($A77,Orçamento!$A$3:$J$125,4,FALSE)","v":"Adensamento de Concreto"},{"$f":"VLOOKUP($A77,Orçamento!$A$3:$J$125,5,FALSE)","v":"m³"},{"$f":"VLOOKUP($A77,Orçamento!$A$3:$J$125,6,FALSE)","v":2492.7590958118626},{"$f":"VLOOKUP($A77,Orçamento!$A$3:$J$125,7,FALSE)","v":2.4500000000000002},{"$f":"VLOOKUP($A77,Orçamento!$A$3:$J$125,8,FALSE)","v":6107.2597847390634},{"$f":"VLOOKUP($A77,Orçamento!$A$3:$J$125,9,FALSE)","v":3.05},{"$f":"VLOOKUP($A77,Orçamento!$A$3:$J$125,10,FALSE)","v":7602.9152422261805},null,{"$f":"Eventograma!H110*'Desembolso-cronograma'!$I77","v":0},{"$f":"Eventograma!J110*'Desembolso-cronograma'!$I77","v":0},{"$f":"Eventograma!K110*'Desembolso-cronograma'!$I77","v":0},{"$f":"Eventograma!L110*'Desembolso-cronograma'!$I77","v":0},{"$f":"Eventograma!M110*'Desembolso-cronograma'!$I77","v":0},{"$f":"Eventograma!N110*'Desembolso-cronograma'!$I77","v":1900.7288105565451},{"$f":"Eventograma!O110*'Desembolso-cronograma'!$I77","v":1900.7288105565451},{"$f":"Eventograma!P110*'Desembolso-cronograma'!$I77","v":1900.7288105565451},{"$f":"Eventograma!Q110*'Desembolso-cronograma'!$I77","v":1900.7288105565451},{"$f":"Eventograma!R110*'Desembolso-cronograma'!$I77","v":0},null,{"$f":"Eventograma!S110*'Desembolso-cronograma'!$I77","v":0},{"$f":"Eventograma!T110*'Desembolso-cronograma'!$I77","v":0},{"$f":"Eventograma!U110*'Desembolso-cronograma'!$I77","v":0},{"$f":"Eventograma!V110*'Desembolso-cronograma'!$I77","v":0}]
["4.2.15",{"$f":"VLOOKUP($A78,Orçamento!$A$3:$J$125,2,FALSE)","v":"SICRO"},{"$f":"VLOOKUP($A78,Orçamento!$A$3:$J$125,3,FALSE)","v":1505877},{"$f":"VLOOKUP($A78,Orçamento!$A$3:$J$125,4,FALSE)","v":"Enrocamento de Proteção"},{"$f":"VLOOKUP($A78,Orçamento!$A$3:$J$125,5,FALSE)","v":"m³"},{"$f":"VLOOKUP($A78,Orçamento!$A$3:$J$125,6,FALSE)","v":1029},{"$f":"VLOOKUP($A78,Orçamento!$A$3:$J$125,7,FALSE)","v":88.73},{"$f":"VLOOKUP($A78,Orçamento!$A$3:$J$125,8,FALSE)","v":91303.17},{"$f":"VLOOKUP($A78,Orçamento!$A$3:$J$125,9,FALSE)","v":110.43},{"$f":"VLOOKUP($A78,Orçamento!$A$3:$J$125,10,FALSE)","v":113632.47},null,{"$f":"Eventograma!H111*'Desembolso-cronograma'!$I78","v":0},{"$f":"Eventograma!J111*'Desembolso-cronograma'!$I78","v":0},{"$f":"Eventograma!K111*'Desembolso-cronograma'!$I78","v":0},{"$f":"Eventograma!L111*'Desembolso-cronograma'!$I78","v":0},{"$f":"Eventograma!M111*'Desembolso-cronograma'!$I78","v":0},{"$f":"Eventograma!N111*'Desembolso-cronograma'!$I78","v":28408.1175},{"$f":"Eventograma!O111*'Desembolso-cronograma'!$I78","v":28408.1175},{"$f":"Eventograma!P111*'Desembolso-cronograma'!$I78","v":28408.1175},{"$f":"Eventograma!Q111*'Desembolso-cronograma'!$I78","v":28408.1175},{"$f":"Eventograma!R111*'Desembolso-cronograma'!$I78","v":0},null,{"$f":"Eventograma!S111*'Desembolso-cronograma'!$I78","v":0},{"$f":"Eventograma!T111*'Desembolso-cronograma'!$I78","v":0},{"$f":"Eventograma!U111*'Desembolso-cronograma'!$I78","v":0},{"$f":"Eventograma!V111*'Desembolso-cronograma'!$I78","v":0}]
[{"$nulls":5},{"$f":"Orçamento!F78","v":0},{"$f":"Orçamento!G78","v":0}]
["4.3",null,null,"Crista",null,{"$f":"Orçamento!F79","v":0},{"$f":"Orçamento!G79","v":0},{"$f":"SUBTOTAL(9,H81:H90)","v":324432.07713100006},null,{"$f":"SUBTOTAL(9,J81:J90)","v":403810.92901699996},null,{"$f":"SUBTOTAL(9,L81:L91)","v":0},{"$f":"SUBTOTAL(9,M81:M91)","v":5837.13},49746.724877124994,49746.724877124994,49746.724877124994,49746.724877124994,49746.724877124994,49746.724877124994,49746.724877124994,49746.724877124994,null,null,null,{"$f":"SUBTOTAL(9,Y81:Y91)","v":0}]
["4.3.1",{"$f":"VLOOKUP($A81,Orçamento!$A$3:$J$125,2,FALSE)","v":"SICRO"},{"$f":"VLOOKUP($A81,Orçamento!$A$3:$J$125,3,FALSE)","v":5502985},{"$f":"VLOOKUP($A81,Orçamento!$A$3:$J$125,4,FALSE)","v":"Limpeza da camada vegetal"},{"$f":"VLOOKUP($A81,Orçamento!$A$3:$J$125,5,FALSE)","v":"m²"},{"$f":"VLOOKUP($A81,Orçamento!$A$3:$J$125,6,FALSE)","v":7032},{"$f":"VLOOKUP($A81,Orçamento!$A$3:$J$125,7,FALSE)","v":0.31},{"$f":"VLOOKUP($A81,Orçamento!$A$3:$J$125,8,FALSE)","v":2179.92},{"$f":"VLOOKUP($A81,Orçamento!$A$3:$J$125,9,FALSE)","v":0.39},{"$f":"VLOOKUP($A81,Orçamento!$A$3:$J$125,10,FALSE)","v":2742.48},null,{"$f":"Eventograma!H114*'Desembolso-cronograma'!$I81","v":0},{"$f":"Eventograma!J114*'Desembolso-cronograma'!$I81","v":2742.48},{"$f":"Eventograma!N114*'Desembolso-cronograma'!$I81","v":0},{"$f":"Eventograma!O114*'Desembolso-cronograma'!$I81","v":0},{"$f":"Eventograma!P114*'Desembolso-cronograma'!$I81","v":0},{"$f":"Eventograma!Q114*'Desembolso-cronograma'!$I81","v":0},{"$f":"Eventograma!R114*'Desembolso-cronograma'!$I81","v":0},{"$f":"Eventograma!S114*'Desembolso-cronograma'!$I81","v":0},{"$f":"Eventograma!T114*'Desembolso-cronograma'!$I81","v":0},{"$f":"Eventograma!U114*'Desembolso-cronograma'!$I81","v":0},null,null,null,{"$f":"Eventograma!V114*'Desembolso-cronograma'!$I81","v":0}]
["4.3.2",{"$f":"VLOOKUP($A82,Orçamento!$A$3:$J$125,2,FALSE)","v":"SINAPI"},{"$f":"VLOOKUP($A82,Orçamento!$A$3:$J$125,3,FALSE)","v":98527},{"$f":"VLOOKUP($A82,Orçamento!$A$3:$J$125,4,FALSE)","v":"Remoção de raízes e cupinzeiros"},{"$f":"VLOOKUP($A82,Orçamento!$A$3:$J$125,5,FALSE)","v":"und"},{"$f":"VLOOKUP($A82,Orçamento!$A$3:$J$125,6,FALSE)","v":15},{"$f":"VLOOKUP($A82,Orçamento!$A$3:$J$125,7,FALSE)","v":133.78},{"$f":"VLOOKUP($A82,Orçamento!$A$3:$J$125,8,FALSE)","v":2006.7},{"$f":"VLOOKUP($A82,Orçamento!$A$3:$J$125,9,FALSE)","v":166.5},{"$f":"VLOOKUP($A82,Orçamento!$A$3:$J$125,10,FALSE)","v":2497.5},null,{"$f":"Eventograma!H115*'Desembolso-cronograma'!$I82","v":0},{"$f":"Eventograma!J115*'Desembolso-cronograma'!$I82","v":2497.5},{"$f":"Eventograma!N115*'Desembolso-cronograma'!$I82","v":0},{"$f":"Eventograma!O115*'Desembolso-cronograma'!$I82","v":0},{"$f":"Eventograma!P115*'Desembolso-cronograma'!$I82","v":0},{"$f":"Eventograma!Q115*'Desembolso-cronograma'!$I82","v":0},{"$f":"Eventograma!R115*'Desembolso-cronograma'!$I82","v":0},{"$f":"Eventograma!S115*'Desembolso-cronograma'!$I82","v":0},{"$f":"Eventograma!T115*'Desembolso-cronograma'!$I82","v":0},{"$f":"Eventograma!U115*'Desembolso-cronograma'!$I82","v":0},null,null,null,{"$f":"Eventograma!V115*'Desembolso-cronograma'!$I82","v":0}]
["4.3.3",{"$f":"VLOOKUP($A83,Orçamento!$A$3:$J$125,2,FALSE)","v":"SICRO"},{"$f":"VLOOKUP($A83,Orçamento!$A$3:$J$125,3,FALSE)","v":4915625},{"$f":"VLOOKUP($A83,Orçamento!$A$3:$J$125,4,FALSE)","v":"Recomposição em Solo Cimento"},{"$f":"VLOOKUP($A83,Orçamento!$A$3:$J$125,5,FALSE)","v":"m³"},{"$f":"VLOOKUP($A83,Orçamento!$A$3:$J$125,6,FALSE)","v":15},{"$f":"VLOOKUP($A83,Orçamento!$A$3:$J$125,7,FALSE)","v":27.05},{"$f":"VLOOKUP($A83,Orçamento!$A$3:$J$125,8,FALSE)","v":405.75},{"$f":"VLOOKUP($A83,Orçamento!$A$3:$J$125,9,FALSE)","v":33.67},{"$f":"VLOOKUP($A83,Orçamento!$A$3:$J$125,10,FALSE)","v":505.05},null,{"$f":"Eventograma!H116*'Desembolso-cronograma'!$I83","v":0},{"$f":"Eventograma!J116*'Desembolso-cronograma'!$I83","v":505.05},{"$f":"Eventograma!N116*'Desembolso-cronograma'!$I83","v":0},{"$f":"Eventograma!O116*'Desembolso-cronograma'!$I83","v":0},{"$f":"Eventograma!P116*'Desembolso-cronograma'!$I83","v":0},{"$f":"Eventograma!Q116*'Desembolso-cronograma'!$I83","v":0},{"$f":"Eventograma!R116*'Desembolso-cronograma'!$I83","v":0},{"$f":"Eventograma!S116*'Desembolso-cronograma'!$I83","v":0},{"$f":"Eventograma!T116*'Desembolso-cronograma'!$I83","v":0},{"$f":"Eventograma!U116*'Desembolso-cronograma'!$I83","v":0},null,null,null,{"$f":"Eventograma!V116*'Desembolso-cronograma'!$I83","v":0}]
["4.3.5",{"$f":"VLOOKUP($A84,Orçamento!$A$3:$J$125,2,FALSE)","v":"SICRO"},{"$f":"VLOOKUP($A84,Orçamento!$A$3:$J$125,3,FALSE)","v":4805754},{"$f":"VLOOKUP($A84,Orçamento!$A$3:$J$125,4,FALSE)","v":"Compactação Manual"},{"$f":"VLOOKUP($A84,Orçamento!$A$3:$J$125,5,FALSE)","v":"m³"},{"$f":"VLOOKUP($A84,Orçamento!$A$3:$J$125,6,FALSE)","v":15},{"$f":"VLOOKUP($A84,Orçamento!$A$3:$J$125,7,FALSE)","v":4.93},{"$f":"VLOOKUP($A84,Orçamento!$A$3:$J$125,8,FALSE)","v":73.949999999999989},{"$f":"VLOOKUP($A84,Orçamento!$A$3:$J$125,9,FALSE)","v":6.14},{"$f":"VLOOKUP($A84,Orçamento!$A$3:$J$125,10,FALSE)","v":92.1},null,{"$f":"Eventograma!H118*'Desembolso-cronograma'!$I84","v":0},{"$f":"Eventograma!J118*'Desembolso-cronograma'!$I84","v":92.1},{"$f":"Eventograma!N118*'Desembolso-cronograma'!$I84","v":0},{"$f":"Eventograma!O118*'Desembolso-cronograma'!$I84","v":0},{"$f":"Eventograma!P118*'Desembolso-cronograma'!$I84","v":0},{"$f":"Eventograma!Q118*'Desembolso-cronograma'!$I84","v":0},{"$f":"Eventograma!R118*'Desembolso-cronograma'!$I84","v":0},{"$f":"Eventograma!S118*'Desembolso-cronograma'!$I84","v":0},{"$f":"Eventograma!T118*'Desembolso-cronograma'!$I84","v":0},{"$f":"Eventograma!U118*'Desembolso-cronograma'!$I84","v":0},null,null,null,{"$f":"Eventograma!V118*'Desembolso-cronograma'!$I84","v":0}]
["4.3.6",{"$f":"VLOOKUP($A85,Orçamento!$A$3:$J$125,2,FALSE)","v":"SICRO"},{"$f":"VLOOKUP($A85,Orçamento!$A$3:$J$125,3,FALSE)","v":903845},{"$f":"VLOOKUP($A85,Orçamento!$A$3:$J$125,4,FALSE)","v":"Bica Corrida"},{"$f":"VLOOKUP($A85,Orçamento!$A$3:$J$125,5,FALSE)","v":"m³"},{"$f":"VLOOKUP($A85,Orçamento!$A$3:$J$125,6,FALSE)","v":1029},{"$f":"VLOOKUP($A85,Orçamento!$A$3:$J$125,7,FALSE)","v":73.98},{"$f":"VLOOKUP($A85,Orçamento!$A$3:$J$125,8,FALSE)","v":76125.42},{"$f":"VLOOKUP($A85,Orçamento!$A$3:$J$125,9,FALSE)","v":92.07},{"$f":"VLOOKUP($A85,Orçamento!$A$3:$J$125,10,FALSE)","v":94740.03},null,{"$f":"Eventograma!H119*'Desembolso-cronograma'!$I85","v":0},{"$f":"Eventograma!J119*'Desembolso-cronograma'!$I85","v":0},{"$f":"Eventograma!N119*'Desembolso-cronograma'!$I85","v":11842.50375},{"$f":"Eventograma!O119*'Desembolso-cronograma'!$I85","v":11842.50375},{"$f":"Eventograma!P119*'Desembolso-cronograma'!$I85","v":11842.50375},{"$f":"Eventograma!Q119*'Desembolso-cronograma'!$I85","v":11842.50375},{"$f":"Eventograma!R119*'Desembolso-cronograma'!$I85","v":11842.50375},{"$f":"Eventograma!S119*'Desembolso-cronograma'!$I85","v":11842.50375},{"$f":"Eventograma!T119*'Desembolso-cronograma'!$I85","v":11842.50375},{"$f":"Eventograma!U119*'Desembolso-cronograma'!$I85","v":11842.50375},null,null,null,{"$f":"Eventograma!V119*'Desembolso-cronograma'!$I85","v":0}]
["4.3.7",{"$f":"VLOOKUP($A86,Orçamento!$A$3:$J$125,2,FALSE)","v":"SICRO"},{"$f":"VLOOKUP($A86,Orçamento!$A$3:$J$125,3,FALSE)","v":2003939},{"$f":"VLOOKUP($A86,Orçamento!$A$3:$J$125,4,FALSE)","v":"Meio fio de concreto"},{"$f":"VLOOKUP($A86,Orçamento!$A$3:$J$125,5,FALSE)","v":"m"},{"$f":"VLOOKUP($A86,Orçamento!$A$3:$J$125,6,FALSE)","v":1759},{"$f":"VLOOKUP($A86,Orçamento!$A$3:$J$125,7,FALSE)","v":45.06},{"$f":"VLOOKUP($A86,Orçamento!$A$3:$J$125,8,FALSE)","v":79260.540000000008},{"$f":"VLOOKUP($A86,Orçamento!$A$3:$J$125,9,FALSE)","v":56.08},{"$f":"VLOOKUP($A86,Orçamento!$A$3:$J$125,10,FALSE)","v":98644.72},null,{"$f":"Eventograma!H120*'Desembolso-cronograma'!$I86","v":0},{"$f":"Eventograma!J120*'Desembolso-cronograma'!$I86","v":0},{"$f":"Eventograma!N120*'Desembolso-cronograma'!$I86","v":12330.59},{"$f":"Eventograma!O120*'Desembolso-cronograma'!$I86","v":12330.59},{"$f":"Eventograma!P120*'Desembolso-cronograma'!$I86","v":12330.59},{"$f":"Eventograma!Q120*'Desembolso-cronograma'!$I86","v":12330.59},{"$f":"Eventograma!R120*'Desembolso-cronograma'!$I86","v":12330.59},{"$f":"Eventograma!S120*'Desembolso-cronograma'!$I86","v":12330.59},{"$f":"Eventograma!T120*'Desembolso-cronograma'!$I86","v":12330.59},{"$f":"Eventograma!U120*'Desembolso-cronograma'!$I86","v":12330.59},null,null,null,{"$f":"Eventograma!V120*'Desembolso-cronograma'!$I86","v":0}]
["4.3.8",{"$f":"VLOOKUP($A87,Orçamento!$A$3:$J$125,2,FALSE)","v":"SICRO"},{"$f":"VLOOKUP($A87,Orçamento!$A$3:$J$125,3,FALSE)","v":3713826},{"$f":"VLOOKUP($A87,Orçamento!$A$3:$J$125,4,FALSE)","v":"Barreira simples tipo New Jersey"},{"$f":"VLOOKUP($A87,Orçamento!$A$3:$J$125,5,FALSE)","v":"m"},{"$f":"VLOOKUP($A87,Orçamento!$A$3:$J$125,6,FALSE)","v":1759},{"$f":"VLOOKUP($A87,Orçamento!$A$3:$J$125,7,FALSE)","v":46.72},{"$f":"VLOOKUP($A87,Orçamento!$A$3:$J$125,8,FALSE)","v":82180.479999999996},{"$f":"VLOOKUP($A87,Orçamento!$A$3:$J$125,9,FALSE)","v":58.15},{"$f":"VLOOKUP($A87,Orçamento!$A$3:$J$125,10,FALSE)","v":102285.84999999999},null,{"$f":"Eventograma!H121*'Desembolso-cronograma'!$I87","v":0},{"$f":"Eventograma!J121*'Desembolso-cronograma'!$I87","v":0},{"$f":"Eventograma!N121*'Desembolso-cronograma'!$I87","v":12785.731249999999},{"$f":"Eventograma!O121*'Desembolso-cronograma'!$I87","v":12785.731249999999},{"$f":"Eventograma!P121*'Desembolso-cronograma'!$I87","v":12785.731249999999},{"$f":"Eventograma!Q121*'Desembolso-cronograma'!$I87","v":12785.731249999999},{"$f":"Eventograma!R121*'Desembolso-cronograma'!$I87","v":12785.731249999999},{"$f":"Eventograma!S121*'Desembolso-cronograma'!$I87","v":12785.731249999999},{"$f":"Eventograma!T121*'Desembolso-cronograma'!$I87","v":12785.731249999999},{"$f":"Eventograma!U121*'Desembolso-cronograma'!$I87","v":12785.731249999999},null,null,null,{"$f":"Eventograma!V121*'Desembolso-cronograma'!$I87","v":0}]
["4.3.9",{"$f":"VLOOKUP($A88,Orçamento!$A$3:$J$125,2,FALSE)","v":"SICRO"},{"$f":"VLOOKUP($A88,Orçamento!$A$3:$J$125,3,FALSE)","v":1106109},{"$f":"VLOOKUP($A88,Orçamento!$A$3:$J$125,4,FALSE)","v":"Concreto fck = 20 Mpa"},{"$f":"VLOOKUP($A88,Orçamento!$A$3:$J$125,5,FALSE)","v":"m³"},{"$f":"VLOOKUP($A88,Orçamento!$A$3:$J$125,6,FALSE)","v":337.20030000000003},{"$f":"VLOOKUP($A88,Orçamento!$A$3:$J$125,7,FALSE)","v":219.85},{"$f":"VLOOKUP($A88,Orçamento!$A$3:$J$125,8,FALSE)","v":74133.485955000011},{"$f":"VLOOKUP($A88,Orçamento!$A$3:$J$125,9,FALSE)","v":273.62},{"$f":"VLOOKUP($A88,Orçamento!$A$3:$J$125,10,FALSE)","v":92264.746086000014},null,{"$f":"Eventograma!H122*'Desembolso-cronograma'!$I88","v":0},{"$f":"Eventograma!J122*'Desembolso-cronograma'!$I88","v":0},{"$f":"Eventograma!N122*'Desembolso-cronograma'!$I88","v":11533.093260750002},{"$f":"Eventograma!O122*'Desembolso-cronograma'!$I88","v":11533.093260750002},{"$f":"Eventograma!P122*'Desembolso-cronograma'!$I88","v":11533.093260750002},{"$f":"Eventograma!Q122*'Desembolso-cronograma'!$I88","v":11533.093260750002},{"$f":"Eventograma!R122*'Desembolso-cronograma'!$I88","v":11533.093260750002},{"$f":"Eventograma!S122*'Desembolso-cronograma'!$I88","v":11533.093260750002},{"$f":"Eventograma!T122*'Desembolso-cronograma'!$I88","v":11533.093260750002},{"$f":"Eventograma!U122*'Desembolso-cronograma'!$I88","v":11533.093260750002},null,null,null,{"$f":"Eventograma!V122*'Desembolso-cronograma'!$I88","v":0}]
["4.3.10",{"$f":"VLOOKUP($A89,Orçamento!$A$3:$J$125,2,FALSE)","v":"SICRO"},{"$f":"VLOOKUP($A89,Orçamento!$A$3:$J$125,3,FALSE)","v":1106051},{"$f":"VLOOKUP($A89,Orçamento!$A$3:$J$125,4,FALSE)","v":"Lançamento livre de concreto"},{"$f":"VLOOKUP($A89,Orçamento!$A$3:$J$125,5,FALSE)","v":"m³"},{"$f":"VLOOKUP($A89,Orçamento!$A$3:$J$125,6,FALSE)","v":337.20030000000003},{"$f":"VLOOKUP($A89,Orçamento!$A$3:$J$125,7,FALSE)","v":21.47},{"$f":"VLOOKUP($A89,Orçamento!$A$3:$J$125,8,FALSE)","v":7239.6904410000006},{"$f":"VLOOKUP($A89,Orçamento!$A$3:$J$125,9,FALSE)","v":26.72},{"$f":"VLOOKUP($A89,Orçamento!$A$3:$J$125,10,FALSE)","v":9009.9920160000001},null,{"$f":"Eventograma!H123*'Desembolso-cronograma'!$I89","v":0},{"$f":"Eventograma!J123*'Desembolso-cronograma'!$I89","v":0},{"$f":"Eventograma!N123*'Desembolso-cronograma'!$I89","v":1126.249002},{"$f":"Eventograma!O123*'Desembolso-cronograma'!$I89","v":1126.249002},{"$f":"Eventograma!P123*'Desembolso-cronograma'!$I89","v":1126.249002},{"$f":"Eventograma!Q123*'Desembolso-cronograma'!$I89","v":1126.249002},{"$f":"Eventograma!R123*'Desembolso-cronograma'!$I89","v":1126.249002},{"$f":"Eventograma!S123*'Desembolso-cronograma'!$I89","v":1126.249002},{"$f":"Eventograma!T123*'Desembolso-cronograma'!$I89","v":1126.249002},{"$f":"Eventograma!U123*'Desembolso-cronograma'!$I89","v":1126.249002},null,null,null,{"$f":"Eventograma!V123*'Desembolso-cronograma'!$I89","v":0}]
["4.3.11",{"$f":"VLOOKUP($A90,Orçamento!$A$3:$J$125,2,FALSE)","v":"SICRO"},{"$f":"VLOOKUP($A90,Orçamento!$A$3:$J$125,3,FALSE)","v":1100657},{"$f":"VLOOKUP($A90,Orçamento!$A$3:$J$125,4,FALSE)","v":"Adensamento de Concreto"},{"$f":"VLOOKUP($A90,Orçamento!$A$3:$J$125,5,FALSE)","v":"m³"},{"$f":"VLOOKUP($A90,Orçamento!$A$3:$J$125,6,FALSE)","v":337.20030000000003},{"$f":"VLOOKUP($A90,Orçamento!$A$3:$J$125,7,FALSE)","v":2.4500000000000002},{"$f":"VLOOKUP($A90,Orçamento!$A$3:$J$125,8,FALSE)","v":826.14073500000018},{"$f":"VLOOKUP($A90,Orçamento!$A$3:$J$125,9,FALSE)","v":3.05},{"$f":"VLOOKUP($A90,Orçamento!$A$3:$J$125,10,FALSE)","v":1028.4609150000001},null,{"$f":"Eventograma!H124*'Desembolso-cronograma'!$I90","v":0},{"$f":"Eventograma!J124*'Desembolso-cronograma'!$I90","v":0},{"$f":"Eventograma!N124*'Desembolso-cronograma'!$I90","v":128.55761437500001},{"$f":"Eventograma!O124*'Desembolso-cronograma'!$I90","v":128.55761437500001},{"$f":"Eventograma!P124*'Desembolso-cronograma'!$I90","v":128.55761437500001},{"$f":"Eventograma!Q124*'Desembolso-cronograma'!$I90","v":128.55761437500001},{"$f":"Eventograma!R124*'Desembolso-cronograma'!$I90","v":128.55761437500001},{"$f":"Eventograma!S124*'Desembolso-cronograma'!$I90","v":128.55761437500001},{"$f":"Eventograma!T124*'Desembolso-cronograma'!$I90","v":128.55761437500001},{"$f":"Eventograma!U124*'Desembolso-cronograma'!$I90","v":128.55761437500001},null,null,null,{"$f":"Eventograma!V124*'Desembolso-cronograma'!$I90","v":0}]
[{"$nulls":5},{"$f":"Orçamento!F90","v":0},{"$f":"Orçamento!G90","v":0}]
["4.4",null,null,"Jusante",null,{"$f":"Orçamento!F91","v":0},{"$f":"Orçamento!G91","v":0},{"$f":"SUBTOTAL(9,H93:H101)","v":316542.55074999999},null,{"$f":"SUBTOTAL(9,J93:J104)","v":1012375.7620000001},null,{"$f":"SUBTOTAL(9,L93:L105)","v":0},0,0,60624.037607142862,56958.037607142862,71746.097190476197,215188.2571904762,215188.2571904762,200400.19760714285,192270.87760714284,0,0,0,0,0]
["4.4.1",{"$f":"VLOOKUP($A93,Orçamento!$A$3:$J$125,2,FALSE)","v":"SICRO"},{"$f":"VLOOKUP($A93,Orçamento!$A$3:$J$125,3,FALSE)","v":5502985},{"$f":"VLOOKUP($A93,Orçamento!$A$3:$J$125,4,FALSE)","v":"Limpeza da camada vegetal"},{"$f":"VLOOKUP($A93,Orçamento!$A$3:$J$125,5,FALSE)","v":"m²"},{"$f":"VLOOKUP($A93,Orçamento!$A$3:$J$125,6,FALSE)","v":65800},{"$f":"VLOOKUP($A93,Orçamento!$A$3:$J$125,7,FALSE)","v":0.31},{"$f":"VLOOKUP($A93,Orçamento!$A$3:$J$125,8,FALSE)","v":20398},{"$f":"VLOOKUP($A93,Orçamento!$A$3:$J$125,9,FALSE)","v":0.39},{"$f":"VLOOKUP($A93,Orçamento!$A$3:$J$125,10,FALSE)","v":25662},null,{"$f":"Eventograma!H127*'Desembolso-cronograma'!$I93","v":0},{"$f":"Eventograma!I127*'Desembolso-cronograma'!$I93","v":0},null,{"$f":"Eventograma!K127*'Desembolso-cronograma'!$I93+3666","v":7332},{"$f":"Eventograma!L127*'Desembolso-cronograma'!$I93","v":3666},{"$f":"Eventograma!M127*'Desembolso-cronograma'!$I93","v":3666},{"$f":"Eventograma!N127*'Desembolso-cronograma'!$I93","v":3666},{"$f":"Eventograma!O127*'Desembolso-cronograma'!$I93","v":3666},{"$f":"Eventograma!P127*'Desembolso-cronograma'!$I93","v":3666},{"$f":"Eventograma!Q127*'Desembolso-cronograma'!$I93","v":0},{"$nulls":4},{"$f":"Eventograma!V127*'Desembolso-cronograma'!$I93","v":0}]
["4.4.2",{"$f":"VLOOKUP($A94,Orçamento!$A$3:$J$125,2,FALSE)","v":"SINAPI"},{"$f":"VLOOKUP($A94,Orçamento!$A$3:$J$125,3,FALSE)","v":98527},{"$f":"VLOOKUP($A94,Orçamento!$A$3:$J$125,4,FALSE)","v":"Remoção de raízes e cupinzeiros"},{"$f":"VLOOKUP($A94,Orçamento!$A$3:$J$125,5,FALSE)","v":"und"},{"$f":"VLOOKUP($A94,Orçamento!$A$3:$J$125,6,FALSE)","v":132},{"$f":"VLOOKUP($A94,Orçamento!$A$3:$J$125,7,FALSE)","v":133.78},{"$f":"VLOOKUP($A94,Orçamento!$A$3:$J$125,8,FALSE)","v":17658.96},{"$f":"VLOOKUP($A94,Orçamento!$A$3:$J$125,9,FALSE)","v":166.5},{"$f":"VLOOKUP($A94,Orçamento!$A$3:$J$125,10,FALSE)","v":21978},null,{"$f":"Eventograma!H128*'Desembolso-cronograma'!$I94","v":0},{"$f":"Eventograma!I128*'Desembolso-cronograma'!$I94","v":0},null,{"$f":"$J$94/6","v":3663},{"$f":"$J$94/6","v":3663},3663,3663,3663,3663,{"$f":"Eventograma!Q128*'Desembolso-cronograma'!$I94","v":0},{"$nulls":4},{"$f":"Eventograma!V128*'Desembolso-cronograma'!$I94","v":0}]
["4.4.3",{"$f":"VLOOKUP($A95,Orçamento!$A$3:$J$125,2,FALSE)","v":"SICRO"},{"$f":"VLOOKUP($A95,Orçamento!$A$3:$J$125,3,FALSE)","v":4915774},{"$f":"VLOOKUP($A95,Orçamento!$A$3:$J$125,4,FALSE)","v":"Recomposição de erosão "},{"$f":"VLOOKUP($A95,Orçamento!$A$3:$J$125,5,FALSE)","v":"m³"},{"$f":"VLOOKUP($A95,Orçamento!$A$3:$J$125,6,FALSE)","v":6712},{"$f":"VLOOKUP($A95,Orçamento!$A$3:$J$125,7,FALSE)","v":11.95},{"$f":"VLOOKUP($A95,Orçamento!$A$3:$J$125,8,FALSE)","v":80208.399999999994},{"$f":"VLOOKUP($A95,Orçamento!$A$3:$J$125,9,FALSE)","v":14.87},{"$f":"VLOOKUP($A95,Orçamento!$A$3:$J$125,10,FALSE)","v":99807.439999999988},null,{"$f":"Eventograma!H129*'Desembolso-cronograma'!$I95","v":0},{"$f":"Eventograma!I129*'Desembolso-cronograma'!$I95","v":0},{"$f":"Eventograma!J129*'Desembolso-cronograma'!$I95","v":0},{"$f":"Eventograma!K129*'Desembolso-cronograma'!$I95","v":14258.205714285714},{"$f":"Eventograma!L129*'Desembolso-cronograma'!$I95","v":14258.205714285714},{"$f":"Eventograma!M129*'Desembolso-cronograma'!$I95","v":14258.205714285714},{"$f":"Eventograma!N129*'Desembolso-cronograma'!$I95","v":14258.205714285714},{"$f":"Eventograma!O129*'Desembolso-cronograma'!$I95","v":14258.205714285714},{"$f":"Eventograma!P129*'Desembolso-cronograma'!$I95","v":14258.205714285714},{"$f":"Eventograma!Q129*'Desembolso-cronograma'!$I95","v":14258.205714285714},{"$nulls":4},{"$f":"Eventograma!V129*'Desembolso-cronograma'!$I95","v":0}]
["4.4.4",{"$f":"VLOOKUP($A96,Orçamento!$A$3:$J$125,2,FALSE)","v":"SICRO"},{"$f":"VLOOKUP($A96,Orçamento!$A$3:$J$125,3,FALSE)","v":4805757},{"$f":"VLOOKUP($A96,Orçamento!$A$3:$J$125,4,FALSE)","v":"Escavação mecânica de vala "},{"$f":"VLOOKUP($A96,Orçamento!$A$3:$J$125,5,FALSE)","v":"m³"},{"$f":"VLOOKUP($A96,Orçamento!$A$3:$J$125,6,FALSE)","v":976},{"$f":"VLOOKUP($A96,Orçamento!$A$3:$J$125,7,FALSE)","v":3.95},{"$f":"VLOOKUP($A96,Orçamento!$A$3:$J$125,8,FALSE)","v":3855.2000000000003},{"$f":"VLOOKUP($A96,Orçamento!$A$3:$J$125,9,FALSE)","v":4.92},{"$f":"VLOOKUP($A96,Orçamento!$A$3:$J$125,10,FALSE)","v":4801.92},null,{"$f":"Eventograma!H130*'Desembolso-cronograma'!$I96","v":0},{"$f":"Eventograma!I130*'Desembolso-cronograma'!$I96","v":0},null,{"$f":"$J$96/6","v":800.32},{"$f":"$J$96/6","v":800.32},800.32,800.32,800.32,800.32,{"$f":"Eventograma!Q130*'Desembolso-cronograma'!$I96","v":0},{"$nulls":4},{"$f":"Eventograma!V130*'Desembolso-cronograma'!$I96","v":0}]
["4.4.5",{"$f":"VLOOKUP($A97,Orçamento!$A$3:$J$125,2,FALSE)","v":"SICRO"},{"$f":"VLOOKUP($A97,Orçamento!$A$3:$J$125,3,FALSE)","v":1106109},{"$f":"VLOOKUP($A97,Orçamento!$A$3:$J$125,4,FALSE)","v":"Concreto fck = 20 Mpa"},{"$f":"VLOOKUP($A97,Orçamento!$A$3:$J$125,5,FALSE)","v":"m³"},{"$f":"VLOOKUP($A97,Orçamento!$A$3:$J$125,6,FALSE)","v":431.92500000000001},{"$f":"VLOOKUP($A97,Orçamento!$A$3:$J$125,7,FALSE)","v":219.85},{"$f":"VLOOKUP($A97,Orçamento!$A$3:$J$125,8,FALSE)","v":94958.711249999993},{"$f":"VLOOKUP($A97,Orçamento!$A$3:$J$125,9,FALSE)","v":273.62},{"$f":"VLOOKUP($A97,Orçamento!$A$3:$J$125,10,FALSE)","v":118183.31850000001},null,{"$f":"Eventograma!H134*'Desembolso-cronograma'!$I97","v":0},{"$f":"Eventograma!I134*'Desembolso-cronograma'!$I97","v":0},{"$f":"Eventograma!J134*'Desembolso-cronograma'!$I97","v":0},{"$f":"$J$97/7","v":16883.331214285714},{"$f":"$J$97/7","v":16883.331214285714},{"$f":"$J$97/7","v":16883.331214285714},16883.331214285714,16883.331214285714,16883.331214285714,16883.331214285714,{"$nulls":4},{"$f":"Eventograma!V134*'Desembolso-cronograma'!$I97","v":0},null,{"$f":"O97+V97","v":16883.331214285714}]
["4.4.6",{"$f":"VLOOKUP($A98,Orçamento!$A$3:$J$125,2,FALSE)","v":"SICRO"},{"$f":"VLOOKUP($A98,Orçamento!$A$3:$J$125,3,FALSE)","v":1107860},{"$f":"VLOOKUP($A98,Orçamento!$A$3:$J$125,4,FALSE)","v":"Bombeamento"},{"$f":"VLOOKUP($A98,Orçamento!$A$3:$J$125,5,FALSE)","v":"m³"},{"$f":"VLOOKUP($A98,Orçamento!$A$3:$J$125,6,FALSE)","v":431.92500000000001},{"$f":"VLOOKUP($A98,Orçamento!$A$3:$J$125,7,FALSE)","v":28.93},{"$f":"VLOOKUP($A98,Orçamento!$A$3:$J$125,8,FALSE)","v":12495.590250000001},{"$f":"VLOOKUP($A98,Orçamento!$A$3:$J$125,9,FALSE)","v":36},{"$f":"VLOOKUP($A98,Orçamento!$A$3:$J$125,10,FALSE)","v":15549.300000000001},null,{"$f":"Eventograma!H135*'Desembolso-cronograma'!$I98","v":0},{"$f":"Eventograma!I135*'Desembolso-cronograma'!$I98","v":0},{"$f":"Eventograma!J135*'Desembolso-cronograma'!$I98","v":0},{"$f":"$J$98/7","v":2221.3285714285716},{"$f":"$J$98/7","v":2221.3285714285716},{"$f":"$J$98/7","v":2221.3285714285716},2221.3285714285716,2221.3285714285716,2221.3285714285716,2221.3285714285716,{"$nulls":4},{"$f":"Eventograma!V135*'Desembolso-cronograma'!$I98","v":0},null,{"$f":"O98+V98","v":2221.3285714285716}]
["4.4.7",{"$f":"VLOOKUP($A99,Orçamento!$A$3:$J$125,2,FALSE)","v":"SICRO"},{"$f":"VLOOKUP($A99,Orçamento!$A$3:$J$125,3,FALSE)","v":1100657},{"$f":"VLOOKUP($A99,Orçamento!$A$3:$J$125,4,FALSE)","v":"Adensamento de Concreto"},{"$f":"VLOOKUP($A99,Orçamento!$A$3:$J$125,5,FALSE)","v":"m³"},{"$f":"VLOOKUP($A99,Orçamento!$A$3:$J$125,6,FALSE)","v":431.92500000000001},{"$f":"VLOOKUP($A99,Orçamento!$A$3:$J$125,7,FALSE)","v":2.4500000000000002},{"$f":"VLOOKUP($A99,Orçamento!$A$3:$J$125,8,FALSE)","v":1058.2162500000002},{"$f":"VLOOKUP($A99,Orçamento!$A$3:$J$125,9,FALSE)","v":3.05},{"$f":"VLOOKUP($A99,Orçamento!$A$3:$J$125,10,FALSE)","v":1317.3712499999999},null,{"$f":"Eventograma!H136*'Desembolso-cronograma'!$I99","v":0},{"$f":"Eventograma!I136*'Desembolso-cronograma'!$I99","v":0},{"$f":"Eventograma!J136*'Desembolso-cronograma'!$I99","v":0},{"$f":"$J$99/7","v":188.19589285714284},{"$f":"$J$99/7","v":188.19589285714284},{"$f":"$J$99/7","v":188.19589285714284},188.19589285714284,188.19589285714284,188.19589285714284,188.19589285714284,{"$nulls":4},{"$f":"Eventograma!V136*'Desembolso-cronograma'!$I99","v":0},null,{"$f":"O99+V99","v":188.19589285714284}]
["4.4.8",{"$f":"VLOOKUP($A100,Orçamento!$A$3:$J$125,2,FALSE)","v":"SICRO"},{"$f":"VLOOKUP($A100,Orçamento!$A$3:$J$125,3,FALSE)","v":4915625},{"$f":"VLOOKUP($A100,Orçamento!$A$3:$J$125,4,FALSE)","v":"Recomposição em Solo Cimento"},{"$f":"VLOOKUP($A100,Orçamento!$A$3:$J$125,5,FALSE)","v":"m³"},{"$f":"VLOOKUP($A100,Orçamento!$A$3:$J$125,6,FALSE)","v":2686.35},{"$f":"VLOOKUP($A100,Orçamento!$A$3:$J$125,7,FALSE)","v":27.05},{"$f":"VLOOKUP($A100,Orçamento!$A$3:$J$125,8,FALSE)","v":72665.767500000002},{"$f":"VLOOKUP($A100,Orçamento!$A$3:$J$125,9,FALSE)","v":33.67},{"$f":"VLOOKUP($A100,Orçamento!$A$3:$J$125,10,FALSE)","v":90449.404500000004},null,{"$f":"Eventograma!H137*'Desembolso-cronograma'!$I100","v":0},{"$f":"Eventograma!I137*'Desembolso-cronograma'!$I100","v":0},{"$f":"Eventograma!J137*'Desembolso-cronograma'!$I100","v":0},{"$f":"$J$100/7","v":12921.343500000001},{"$f":"$J$100/7","v":12921.343500000001},{"$f":"$J$100/7","v":12921.343500000001},12921.343500000001,12921.343500000001,12921.343500000001,12921.343500000001,{"$nulls":4},{"$f":"Eventograma!V137*'Desembolso-cronograma'!$I100","v":0},null,{"$f":"O100+V100","v":12921.343500000001}]
["4.4.10",{"$f":"VLOOKUP($A101,Orçamento!$A$3:$J$125,2,FALSE)","v":"SICRO"},{"$f":"VLOOKUP($A101,Orçamento!$A$3:$J$125,3,FALSE)","v":4805754},{"$f":"VLOOKUP($A101,Orçamento!$A$3:$J$125,4,FALSE)","v":"Compactação Manual"},{"$f":"VLOOKUP($A101,Orçamento!$A$3:$J$125,5,FALSE)","v":"m³"},{"$f":"VLOOKUP($A101,Orçamento!$A$3:$J$125,6,FALSE)","v":2686.35},{"$f":"VLOOKUP($A101,Orçamento!$A$3:$J$125,7,FALSE)","v":4.93},{"$f":"VLOOKUP($A101,Orçamento!$A$3:$J$125,8,FALSE)","v":13243.705499999998},{"$f":"VLOOKUP($A101,Orçamento!$A$3:$J$125,9,FALSE)","v":6.14},{"$f":"VLOOKUP($A101,Orçamento!$A$3:$J$125,10,FALSE)","v":16494.188999999998},null,{"$f":"Eventograma!H139*'Desembolso-cronograma'!$I101","v":0},{"$f":"Eventograma!I139*'Desembolso-cronograma'!$I101","v":0},{"$f":"Eventograma!J139*'Desembolso-cronograma'!$I101","v":0},{"$f":"$J$101/7","v":2356.3127142857143},{"$f":"$J$101/7","v":2356.3127142857143},{"$f":"$J$101/7","v":2356.3127142857143},2356.3127142857143,2356.3127142857143,2356.3127142857143,2356.3127142857143,{"$nulls":4},{"$f":"Eventograma!V139*'Desembolso-cronograma'!$I101","v":0},null,{"$f":"O101+V101","v":2356.3127142857143}]
["4.4.11","SICRO",2003850,"Lastro de Brita","m³",{"$f":"1759*0.075","v":131.92499999999998},81.760000000000005,{"$f":"VLOOKUP($A102,Orçamento!$A$3:$J$125,8,FALSE)","v":10786.188},{"$f":"VLOOKUP($A102,Orçamento!$A$3:$J$125,9,FALSE)","v":101.75},{"$f":"VLOOKUP($A102,Orçamento!$A$3:$J$125,10,FALSE)","v":13423.368749999998},{"$nulls":6},{"$f":"$J$102/3","v":4474.4562499999993},{"$f":"$J$102/3","v":4474.4562499999993},4474.4562499999993]
["4.4.12","SICRO",2003947,"Meio fio de concreto","m",1759,14.13,{"$f":"VLOOKUP($A103,Orçamento!$A$3:$J$125,8,FALSE)","v":24854.670000000002},{"$f":"VLOOKUP($A103,Orçamento!$A$3:$J$125,9,FALSE)","v":17.59},{"$f":"VLOOKUP($A103,Orçamento!$A$3:$J$125,10,FALSE)","v":30940.81},{"$nulls":6},{"$f":"$J$103/3","v":10313.603333333334},{"$f":"$J$103/3","v":10313.603333333334},10313.603333333334]
["4.4.13","SICRO",4915673,"Revestimento vegetal com grama em mudas (superficies inclinadas)","m²",43336,10.64,{"$f":"VLOOKUP($A104,Orçamento!$A$3:$J$125,8,FALSE)","v":461095.04000000004},{"$f":"VLOOKUP($A104,Orçamento!$A$3:$J$125,9,FALSE)","v":13.24},{"$f":"VLOOKUP($A104,Orçamento!$A$3:$J$125,10,FALSE)","v":573768.64},{"$nulls":7},{"$f":"$J$104/4","v":143442.16},{"$f":"$J$104/4","v":143442.16},143442.16,143442.16]
[{"$nulls":5},{"$f":"Orçamento!F104","v":0},{"$f":"Orçamento!G104","v":0}]
["4.5",null,null,"Drenagem Superficial",null,{"$f":"Orçamento!F105","v":0},{"$f":"Orçamento!G105","v":0},{"$f":"SUBTOTAL(9,H107:H115)","v":183162.34},null,{"$f":"SUBTOTAL(9,J107:J115)","v":227957.28},null,{"$f":"SUBTOTAL(9,L107:L116)","v":0},{"$f":"SUBTOTAL(9,M107:M116)","v":0},{"$f":"SUBTOTAL(9,N107:N116)","v":0},22399.74,22283.210000000003,37424.639999999999,31960.06,39367.300000000003,{"$f":"SUBTOTAL(9,T108:T117)","v":44752.349999999991},{"$f":"SUBTOTAL(9,U107:U116)","v":29690.450000000004}]
["4.5.1",{"$f":"VLOOKUP($A107,Orçamento!$A$3:$J$125,2,FALSE)","v":"SICRO"},{"$f":"VLOOKUP($A107,Orçamento!$A$3:$J$125,3,FALSE)","v":4915711},{"$f":"VLOOKUP($A107,Orçamento!$A$3:$J$125,4,FALSE)","v":"Limpeza de Descida d'água"},{"$f":"VLOOKUP($A107,Orçamento!$A$3:$J$125,5,FALSE)","v":"m"},{"$f":"VLOOKUP($A107,Orçamento!$A$3:$J$125,6,FALSE)","v":482},{"$f":"VLOOKUP($A107,Orçamento!$A$3:$J$125,7,FALSE)","v":1.06},{"$f":"VLOOKUP($A107,Orçamento!$A$3:$J$125,8,FALSE)","v":510.92},{"$f":"VLOOKUP($A107,Orçamento!$A$3:$J$125,9,FALSE)","v":1.32},{"$f":"VLOOKUP($A107,Orçamento!$A$3:$J$125,10,FALSE)","v":636.24},null,{"$f":"Eventograma!H144*'Desembolso-cronograma'!$I107","v":0},{"$f":"Eventograma!I144*'Desembolso-cronograma'!$I107","v":0},null,{"$f":"(Eventograma!P144*'Desembolso-cronograma'!$I107)*2","v":159.06},{"$f":"Eventograma!Q144*'Desembolso-cronograma'!$I107","v":79.53},{"$f":"Eventograma!R144*'Desembolso-cronograma'!$I107","v":79.53},{"$f":"Eventograma!S144*'Desembolso-cronograma'!$I107","v":79.53},{"$f":"Eventograma!T144*'Desembolso-cronograma'!$I107","v":79.53},{"$f":"Eventograma!U144*'Desembolso-cronograma'!$I107","v":79.53},{"$f":"Eventograma!V144*'Desembolso-cronograma'!$I107","v":79.53}]
["4.5.2",{"$f":"VLOOKUP($A108,Orçamento!$A$3:$J$125,2,FALSE)","v":"SICRO"},{"$f":"VLOOKUP($A108,Orçamento!$A$3:$J$125,3,FALSE)","v":2003353},{"$f":"VLOOKUP($A108,Orçamento!$A$3:$J$125,4,FALSE)","v":"Valeta trapezoidal de concreto "},{"$f":"VLOOKUP($A108,Orçamento!$A$3:$J$125,5,FALSE)","v":"m"},{"$f":"VLOOKUP($A108,Orçamento!$A$3:$J$125,6,FALSE)","v":1848},{"$f":"VLOOKUP($A108,Orçamento!$A$3:$J$125,7,FALSE)","v":38.68},{"$f":"VLOOKUP($A108,Orçamento!$A$3:$J$125,8,FALSE)","v":71480.639999999999},{"$f":"VLOOKUP($A108,Orçamento!$A$3:$J$125,9,FALSE)","v":48.14},{"$f":"VLOOKUP($A108,Orçamento!$A$3:$J$125,10,FALSE)","v":88962.72},null,{"$f":"Eventograma!H145*'Desembolso-cronograma'!$I108","v":0},{"$f":"Eventograma!I145*'Desembolso-cronograma'!$I108","v":0},null,{"$f":"(Eventograma!P145*'Desembolso-cronograma'!$I108)*2","v":22240.68},{"$f":"Eventograma!Q145*'Desembolso-cronograma'!$I108","v":11120.34},{"$f":"Eventograma!R145*'Desembolso-cronograma'!$I108","v":11120.34},{"$f":"Eventograma!S145*'Desembolso-cronograma'!$I108","v":11120.34},{"$f":"Eventograma!T145*'Desembolso-cronograma'!$I108","v":11120.34},{"$f":"Eventograma!U145*'Desembolso-cronograma'!$I108","v":11120.34},{"$f":"Eventograma!V145*'Desembolso-cronograma'!$I108","v":11120.34}]
["4.5.3",{"$f":"VLOOKUP($A109,Orçamento!$A$3:$J$125,2,FALSE)","v":"SICRO"},{"$f":"VLOOKUP($A109,Orçamento!$A$3:$J$125,3,FALSE)","v":2003477},{"$f":"VLOOKUP($A109,Orçamento!$A$3:$J$125,4,FALSE)","v":"Caixa Coletora "},{"$f":"VLOOKUP($A109,Orçamento!$A$3:$J$125,5,FALSE)","v":"und"},{"$f":"VLOOKUP($A109,Orçamento!$A$3:$J$125,6,FALSE)","v":18},{"$f":"VLOOKUP($A109,Orçamento!$A$3:$J$125,7,FALSE)","v":2665.19},{"$f":"VLOOKUP($A109,Orçamento!$A$3:$J$125,8,FALSE)","v":47973.42},{"$f":"VLOOKUP($A109,Orçamento!$A$3:$J$125,9,FALSE)","v":3316.98},{"$f":"VLOOKUP($A109,Orçamento!$A$3:$J$125,10,FALSE)","v":59705.64},null,{"$f":"Eventograma!H146*'Desembolso-cronograma'!$I109","v":0},{"$f":"Eventograma!I146*'Desembolso-cronograma'!$I109","v":0},{"$f":"Eventograma!O146*'Desembolso-cronograma'!$I109","v":0},{"$f":"Eventograma!P146*'Desembolso-cronograma'!$I109","v":0},{"$f":"Eventograma!Q146*'Desembolso-cronograma'!$I109","v":9950.94},{"$f":"Eventograma!R146*'Desembolso-cronograma'!$I109","v":9950.94},{"$f":"Eventograma!S146*'Desembolso-cronograma'!$I109","v":9950.94},{"$f":"Eventograma!T146*'Desembolso-cronograma'!$I109","v":9950.94},{"$f":"Eventograma!U146*'Desembolso-cronograma'!$I109","v":9950.94},{"$f":"Eventograma!V146*'Desembolso-cronograma'!$I109","v":9950.94}]
["4.5.4",{"$f":"VLOOKUP($A110,Orçamento!$A$3:$J$125,2,FALSE)","v":"SICRO"},{"$f":"VLOOKUP($A110,Orçamento!$A$3:$J$125,3,FALSE)","v":804021},{"$f":"VLOOKUP($A110,Orçamento!$A$3:$J$125,4,FALSE)","v":"BSTC 600mm"},{"$f":"VLOOKUP($A110,Orçamento!$A$3:$J$125,5,FALSE)","v":"m"},{"$f":"VLOOKUP($A110,Orçamento!$A$3:$J$125,6,FALSE)","v":24},{"$f":"VLOOKUP($A110,Orçamento!$A$3:$J$125,7,FALSE)","v":227.47},{"$f":"VLOOKUP($A110,Orçamento!$A$3:$J$125,8,FALSE)","v":5459.28},{"$f":"VLOOKUP($A110,Orçamento!$A$3:$J$125,9,FALSE)","v":283.10000000000002},{"$f":"VLOOKUP($A110,Orçamento!$A$3:$J$125,10,FALSE)","v":6794.4000000000005},null,{"$f":"Eventograma!H147*'Desembolso-cronograma'!$I110","v":0},{"$f":"Eventograma!I147*'Desembolso-cronograma'!$I110","v":0},{"$f":"Eventograma!O147*'Desembolso-cronograma'!$I110","v":0},{"$f":"Eventograma!P147*'Desembolso-cronograma'!$I110","v":0},{"$f":"Eventograma!Q147*'Desembolso-cronograma'!$I110","v":1132.4000000000001},{"$f":"Eventograma!R147*'Desembolso-cronograma'!$I110","v":1132.4000000000001},{"$f":"Eventograma!S147*'Desembolso-cronograma'!$I110","v":1132.4000000000001},{"$f":"Eventograma!T147*'Desembolso-cronograma'!$I110","v":1132.4000000000001},{"$f":"Eventograma!U147*'Desembolso-cronograma'!$I110","v":1132.4000000000001},{"$f":"Eventograma!V147*'Desembolso-cronograma'!$I110","v":1132.4000000000001}]
["4.5.5",{"$f":"VLOOKUP($A111,Orçamento!$A$3:$J$125,2,FALSE)","v":"SICRO"},{"$f":"VLOOKUP($A111,Orçamento!$A$3:$J$125,3,FALSE)","v":804037},{"$f":"VLOOKUP($A111,Orçamento!$A$3:$J$125,4,FALSE)","v":"Corpo BSTC 1000mm"},{"$f":"VLOOKUP($A111,Orçamento!$A$3:$J$125,5,FALSE)","v":"m"},{"$f":"VLOOKUP($A111,Orçamento!$A$3:$J$125,6,FALSE)","v":20},{"$f":"VLOOKUP($A111,Orçamento!$A$3:$J$125,7,FALSE)","v":531.45000000000005},{"$f":"VLOOKUP($A111,Orçamento!$A$3:$J$125,8,FALSE)","v":10629},{"$f":"VLOOKUP($A111,Orçamento!$A$3:$J$125,9,FALSE)","v":661.42},{"$f":"VLOOKUP($A111,Orçamento!$A$3:$J$125,10,FALSE)","v":13228.4},null,{"$f":"Eventograma!H148*'Desembolso-cronograma'!$I111","v":0},{"$f":"Eventograma!I148*'Desembolso-cronograma'!$I111","v":0},{"$f":"Eventograma!O148*'Desembolso-cronograma'!$I111","v":0},{"$f":"Eventograma!P148*'Desembolso-cronograma'!$I111","v":0},{"$f":"Eventograma!Q148*'Desembolso-cronograma'!$I111","v":0},{"$f":"Eventograma!R148*'Desembolso-cronograma'!$I111","v":3307.1},{"$f":"Eventograma!S148*'Desembolso-cronograma'!$I111","v":3307.1},{"$f":"Eventograma!T148*'Desembolso-cronograma'!$I111","v":3307.1},{"$f":"Eventograma!U148*'Desembolso-cronograma'!$I111","v":3307.1},{"$f":"Eventograma!V148*'Desembolso-cronograma'!$I111","v":0}]
["4.5.6",{"$f":"VLOOKUP($A112,Orçamento!$A$3:$J$125,2,FALSE)","v":"SICRO"},{"$f":"VLOOKUP($A112,Orçamento!$A$3:$J$125,3,FALSE)","v":804393},{"$f":"VLOOKUP($A112,Orçamento!$A$3:$J$125,4,FALSE)","v":"Boca BSTC 1000mm"},{"$f":"VLOOKUP($A112,Orçamento!$A$3:$J$125,5,FALSE)","v":"und"},{"$f":"VLOOKUP($A112,Orçamento!$A$3:$J$125,6,FALSE)","v":2},{"$f":"VLOOKUP($A112,Orçamento!$A$3:$J$125,7,FALSE)","v":1836.7},{"$f":"VLOOKUP($A112,Orçamento!$A$3:$J$125,8,FALSE)","v":3673.4},{"$f":"VLOOKUP($A112,Orçamento!$A$3:$J$125,9,FALSE)","v":2285.87},{"$f":"VLOOKUP($A112,Orçamento!$A$3:$J$125,10,FALSE)","v":4571.74},null,{"$f":"Eventograma!H149*'Desembolso-cronograma'!$I112","v":0},{"$f":"Eventograma!I149*'Desembolso-cronograma'!$I112","v":0},{"$f":"Eventograma!O149*'Desembolso-cronograma'!$I112","v":0},{"$f":"Eventograma!P149*'Desembolso-cronograma'!$I112","v":0},{"$f":"Eventograma!Q149*'Desembolso-cronograma'!$I112","v":0},{"$f":"Eventograma!R149*'Desembolso-cronograma'!$I112","v":2285.87},{"$f":"Eventograma!S149*'Desembolso-cronograma'!$I112","v":0},{"$f":"Eventograma!T149*'Desembolso-cronograma'!$I112","v":0},{"$f":"Eventograma!U149*'Desembolso-cronograma'!$I112","v":2285.87},{"$f":"Eventograma!V149*'Desembolso-cronograma'!$I112","v":0}]
["4.5.7",{"$f":"VLOOKUP($A113,Orçamento!$A$3:$J$125,2,FALSE)","v":"SICRO"},{"$f":"VLOOKUP($A113,Orçamento!$A$3:$J$125,3,FALSE)","v":804189},{"$f":"VLOOKUP($A113,Orçamento!$A$3:$J$125,4,FALSE)","v":"Corpo BDTC 1000mm"},{"$f":"VLOOKUP($A113,Orçamento!$A$3:$J$125,5,FALSE)","v":"m"},{"$f":"VLOOKUP($A113,Orçamento!$A$3:$J$125,6,FALSE)","v":20},{"$f":"VLOOKUP($A113,Orçamento!$A$3:$J$125,7,FALSE)","v":1023.62},{"$f":"VLOOKUP($A113,Orçamento!$A$3:$J$125,8,FALSE)","v":20472.400000000001},{"$f":"VLOOKUP($A113,Orçamento!$A$3:$J$125,9,FALSE)","v":1273.95},{"$f":"VLOOKUP($A113,Orçamento!$A$3:$J$125,10,FALSE)","v":25479},null,{"$f":"Eventograma!H150*'Desembolso-cronograma'!$I113","v":0},{"$f":"Eventograma!I150*'Desembolso-cronograma'!$I113","v":0},{"$f":"Eventograma!O150*'Desembolso-cronograma'!$I113","v":0},{"$f":"Eventograma!P150*'Desembolso-cronograma'!$I113","v":0},{"$f":"Eventograma!Q150*'Desembolso-cronograma'!$I113","v":0},{"$f":"Eventograma!R150*'Desembolso-cronograma'!$I113","v":6369.75},{"$f":"Eventograma!S150*'Desembolso-cronograma'!$I113","v":6369.75},{"$f":"Eventograma!T150*'Desembolso-cronograma'!$I113","v":6369.75},{"$f":"Eventograma!U150*'Desembolso-cronograma'!$I113","v":6369.75},{"$f":"Eventograma!V150*'Desembolso-cronograma'!$I113","v":0}]
["4.5.8",{"$f":"VLOOKUP($A114,Orçamento!$A$3:$J$125,2,FALSE)","v":"SICRO"},{"$f":"VLOOKUP($A114,Orçamento!$A$3:$J$125,3,FALSE)","v":804417},{"$f":"VLOOKUP($A114,Orçamento!$A$3:$J$125,4,FALSE)","v":"Boca BDTC 1000mm"},{"$f":"VLOOKUP($A114,Orçamento!$A$3:$J$125,5,FALSE)","v":"und"},{"$f":"VLOOKUP($A114,Orçamento!$A$3:$J$125,6,FALSE)","v":2},{"$f":"VLOOKUP($A114,Orçamento!$A$3:$J$125,7,FALSE)","v":2554.09},{"$f":"VLOOKUP($A114,Orçamento!$A$3:$J$125,8,FALSE)","v":5108.18},{"$f":"VLOOKUP($A114,Orçamento!$A$3:$J$125,9,FALSE)","v":3178.71},{"$f":"VLOOKUP($A114,Orçamento!$A$3:$J$125,10,FALSE)","v":6357.42},null,{"$f":"Eventograma!H151*'Desembolso-cronograma'!$I114","v":0},{"$f":"Eventograma!I151*'Desembolso-cronograma'!$I114","v":0},{"$f":"Eventograma!O151*'Desembolso-cronograma'!$I114","v":0},{"$f":"Eventograma!P151*'Desembolso-cronograma'!$I114","v":0},{"$f":"Eventograma!Q151*'Desembolso-cronograma'!$I114","v":0},{"$f":"Eventograma!R151*'Desembolso-cronograma'!$I114","v":3178.71},{"$f":"Eventograma!S151*'Desembolso-cronograma'!$I114","v":0},{"$f":"Eventograma!T151*'Desembolso-cronograma'!$I114","v":0},{"$f":"Eventograma!U151*'Desembolso-cronograma'!$I114","v":3178.71},{"$f":"Eventograma!V151*'Desembolso-cronograma'!$I114","v":0}]
["4.5.9",{"$f":"VLOOKUP($A115,Orçamento!$A$3:$J$125,2,FALSE)","v":"SICRO"},{"$f":"VLOOKUP($A115,Orçamento!$A$3:$J$125,3,FALSE)","v":2003453},{"$f":"VLOOKUP($A115,Orçamento!$A$3:$J$125,4,FALSE)","v":"Dissipador de Energia"},{"$f":"VLOOKUP($A115,Orçamento!$A$3:$J$125,5,FALSE)","v":"und"},{"$f":"VLOOKUP($A115,Orçamento!$A$3:$J$125,6,FALSE)","v":18},{"$f":"VLOOKUP($A115,Orçamento!$A$3:$J$125,7,FALSE)","v":991.95},{"$f":"VLOOKUP($A115,Orçamento!$A$3:$J$125,8,FALSE)","v":17855.100000000002},{"$f":"VLOOKUP($A115,Orçamento!$A$3:$J$125,9,FALSE)","v":1234.54},{"$f":"VLOOKUP($A115,Orçamento!$A$3:$J$125,10,FALSE)","v":22221.72},null,{"$f":"Eventograma!H152*'Desembolso-cronograma'!$I115","v":0},{"$f":"Eventograma!I152*'Desembolso-cronograma'!$I115","v":0},{"$f":"Eventograma!O152*'Desembolso-cronograma'!$I115","v":0},{"$f":"Eventograma!P152*'Desembolso-cronograma'!$I115","v":0},{"$f":"Eventograma!Q152*'Desembolso-cronograma'!$I115","v":0},{"$f":"Eventograma!R152*'Desembolso-cronograma'!$I115","v":0},{"$f":"Eventograma!S152*'Desembolso-cronograma'!$I115","v":0},{"$f":"Eventograma!T152*'Desembolso-cronograma'!$I115","v":7407.24},{"$f":"Eventograma!U152*'Desembolso-cronograma'!$I115","v":7407.24},{"$f":"Eventograma!V152*'Desembolso-cronograma'!$I115","v":7407.24}]
[{"$nulls":5},{"$f":"Orçamento!F115","v":0},{"$f":"Orçamento!G115","v":0}]
[5,null,null,"Momento de Transporte",null,{"$f":"Orçamento!F116","v":0},{"$f":"Orçamento!G116","v":0},{"$f":"SUBTOTAL(9,H118:H125)","v":978774.08386030269},null,{"$f":"SUBTOTAL(9,J118:J125)","v":1218700.0309231761},null,{"$f":"SUBTOTAL(9,L118:L125)","v":5499.5648000000001},{"$f":"SUBTOTAL(9,M118:M125)","v":0},{"$f":"SUBTOTAL(9,N118:N125)","v":566.15930000000003},2625.5304989816123,18093.783646045114,19548.975710622115,240142.2960194156,266882.95179580577,266560.66976455576,266560.66976455576,132219.43727427674,0,0,0,0]
["5.1",{"$f":"VLOOKUP($A118,Orçamento!$A$3:$J$125,2,FALSE)","v":"SICRO"},{"$f":"VLOOKUP($A118,Orçamento!$A$3:$J$125,3,FALSE)","v":5914329},{"$f":"VLOOKUP($A118,Orçamento!$A$3:$J$125,4,FALSE)","v":"Transporte com caminhão basculante de 6 m³"},{"$f":"VLOOKUP($A118,Orçamento!$A$3:$J$125,5,FALSE)","v":"txkm"},{"$f":"VLOOKUP($A118,Orçamento!$A$3:$J$125,6,FALSE)","v":429.70937500000002},{"$f":"VLOOKUP($A118,Orçamento!$A$3:$J$125,7,FALSE)","v":0.6},{"$f":"VLOOKUP($A118,Orçamento!$A$3:$J$125,8,FALSE)","v":257.825625},{"$f":"VLOOKUP($A118,Orçamento!$A$3:$J$125,9,FALSE)","v":0.75},{"$f":"VLOOKUP($A118,Orçamento!$A$3:$J$125,10,FALSE)","v":322.28203125000005},null,{"$f":"Eventograma!H186*'Desembolso-cronograma'!$I118","v":0},{"$f":"Eventograma!I186*'Desembolso-cronograma'!$I118","v":0},{"$f":"Eventograma!J186*'Desembolso-cronograma'!$I118","v":0},{"$f":"Eventograma!K186*'Desembolso-cronograma'!$I118","v":0},{"$f":"Eventograma!L186*'Desembolso-cronograma'!$I118","v":0},{"$f":"Eventograma!M186*'Desembolso-cronograma'!$I118","v":0},{"$f":"Eventograma!N186*'Desembolso-cronograma'!$I118","v":0},{"$f":"J118","v":322.28203125000005},{"$f":"Eventograma!P186*'Desembolso-cronograma'!$I118","v":0},{"$f":"Eventograma!Q186*'Desembolso-cronograma'!$I118","v":0},{"$f":"Eventograma!R186*'Desembolso-cronograma'!$I118","v":0},{"$f":"Eventograma!S186*'Desembolso-cronograma'!$I118","v":0},{"$f":"Eventograma!T186*'Desembolso-cronograma'!$I118","v":0},{"$f":"Eventograma!U186*'Desembolso-cronograma'!$I118","v":0},{"$f":"Eventograma!V186*'Desembolso-cronograma'!$I118","v":0}]
["5.2",{"$f":"VLOOKUP($A119,Orçamento!$A$3:$J$125,2,FALSE)","v":"SICRO"},{"$f":"VLOOKUP($A119,Orçamento!$A$3:$J$125,3,FALSE)","v":5914365},{"$f":"VLOOKUP($A119,Orçamento!$A$3:$J$125,4,FALSE)","v":"Transporte de cimento a granel com caminhão silo 30 m³ "},{"$f":"VLOOKUP($A119,Orçamento!$A$3:$J$125,5,FALSE)","v":"txkm"},{"$f":"VLOOKUP($A119,Orçamento!$A$3:$J$125,6,FALSE)","v":212313.31407912378},{"$f":"VLOOKUP($A119,Orçamento!$A$3:$J$125,7,FALSE)","v":0.41},{"$f":"VLOOKUP($A119,Orçamento!$A$3:$J$125,8,FALSE)","v":87048.458772440747},{"$f":"VLOOKUP($A119,Orçamento!$A$3:$J$125,9,FALSE)","v":0.51},{"$f":"VLOOKUP($A119,Orçamento!$A$3:$J$125,10,FALSE)","v":108279.79018035313},null,{"$f":"Eventograma!H187*'Desembolso-cronograma'!$I119","v":0},{"$f":"Eventograma!I187*'Desembolso-cronograma'!$I119","v":0},{"$f":"Eventograma!J187*'Desembolso-cronograma'!$I119","v":0},{"$f":"Eventograma!K187*'Desembolso-cronograma'!$I119","v":0},{"$f":"Eventograma!L187*'Desembolso-cronograma'!$I119","v":1347.6908549920724},{"$f":"Eventograma!M187*'Desembolso-cronograma'!$I119","v":1378.8928195690726},{"$f":"Eventograma!N187*'Desembolso-cronograma'!$I119","v":22954.851189844168},{"$f":"Eventograma!O187*'Desembolso-cronograma'!$I119","v":22392.253934984306},{"$f":"Eventograma!P187*'Desembolso-cronograma'!$I119","v":22392.253934984306},{"$f":"Eventograma!Q187*'Desembolso-cronograma'!$I119","v":22392.253934984306},{"$f":"Eventograma!R187*'Desembolso-cronograma'!$I119+AB119-3332.77","v":15357.493969705298},null,null,null,{"$f":"Eventograma!V187*'Desembolso-cronograma'!$I119","v":0},null,{"$f":"SUM(W119:Y119)","v":0}]
["5.3",{"$f":"VLOOKUP($A120,Orçamento!$A$3:$J$125,2,FALSE)","v":"SICRO"},{"$f":"VLOOKUP($A120,Orçamento!$A$3:$J$125,3,FALSE)","v":5914374},{"$f":"VLOOKUP($A120,Orçamento!$A$3:$J$125,4,FALSE)","v":"Transporte com caminhão basculante de 10 m³ "},{"$f":"VLOOKUP($A120,Orçamento!$A$3:$J$125,5,FALSE)","v":"txkm"},{"$f":"VLOOKUP($A120,Orçamento!$A$3:$J$125,6,FALSE)","v":1620483.7990248003},{"$f":"VLOOKUP($A120,Orçamento!$A$3:$J$125,7,FALSE)","v":0.49},{"$f":"VLOOKUP($A120,Orçamento!$A$3:$J$125,8,FALSE)","v":794037.06152215216},{"$f":"VLOOKUP($A120,Orçamento!$A$3:$J$125,9,FALSE)","v":0.61},{"$f":"VLOOKUP($A120,Orçamento!$A$3:$J$125,10,FALSE)","v":988495.1174051282},null,{"$f":"Eventograma!H188*'Desembolso-cronograma'!$I120","v":5499.5648000000001},{"$f":"Eventograma!I188*'Desembolso-cronograma'!$I120","v":0},{"$f":"Eventograma!J188*'Desembolso-cronograma'!$I120","v":566.15930000000003},{"$f":"Eventograma!K188*'Desembolso-cronograma'!$I120","v":1423.9901},{"$f":"Eventograma!L188*'Desembolso-cronograma'!$I120","v":1536.8187499999999},{"$f":"Eventograma!M188*'Desembolso-cronograma'!$I120","v":2960.8088499999999},{"$f":"Eventograma!N188*'Desembolso-cronograma'!$I120","v":203179.71118750001},{"$f":"Eventograma!O188*'Desembolso-cronograma'!$I120","v":230160.68218749997},{"$f":"Eventograma!P188*'Desembolso-cronograma'!$I120","v":230160.68218749997},{"$f":"Eventograma!Q188*'Desembolso-cronograma'!$I120","v":230160.68218749997},{"$f":"Eventograma!R188*'Desembolso-cronograma'!$I120+AB120+37488.09","v":83450.669662500004},null,null,null,{"$f":"Eventograma!V188*'Desembolso-cronograma'!$I120","v":0},null,{"$f":"SUM(W120:Y120)","v":0}]
["5.4",{"$f":"VLOOKUP($A121,Orçamento!$A$3:$J$125,2,FALSE)","v":"SICRO"},{"$f":"VLOOKUP($A121,Orçamento!$A$3:$J$125,3,FALSE)","v":5914464},{"$f":"VLOOKUP($A121,Orçamento!$A$3:$J$125,4,FALSE)","v":"Transporte com caminhão carroceria de 15 t "},{"$f":"VLOOKUP($A121,Orçamento!$A$3:$J$125,5,FALSE)","v":"txkm"},{"$f":"VLOOKUP($A121,Orçamento!$A$3:$J$125,6,FALSE)","v":5909.2150769587497},{"$f":"VLOOKUP($A121,Orçamento!$A$3:$J$125,7,FALSE)","v":0.49},{"$f":"VLOOKUP($A121,Orçamento!$A$3:$J$125,8,FALSE)","v":2895.5153877097873},{"$f":"VLOOKUP($A121,Orçamento!$A$3:$J$125,9,FALSE)","v":0.61},{"$f":"VLOOKUP($A121,Orçamento!$A$3:$J$125,10,FALSE)","v":3604.6211969448373},null,{"$f":"Eventograma!H189*'Desembolso-cronograma'!$I121","v":0},{"$f":"Eventograma!I189*'Desembolso-cronograma'!$I121","v":0},{"$f":"Eventograma!J189*'Desembolso-cronograma'!$I121","v":0},{"$f":"$J$121/3","v":1201.5403989816125},{"$f":"$J$121/3","v":1201.5403989816125},1201.5403989816125,{"$f":"Eventograma!N189*'Desembolso-cronograma'!$I121","v":0},{"$f":"Eventograma!O189*'Desembolso-cronograma'!$I121","v":0},{"$f":"Eventograma!P189*'Desembolso-cronograma'!$I121","v":0},{"$f":"Eventograma!Q189*'Desembolso-cronograma'!$I121","v":0},{"$f":"AB121","v":0},{"$nulls":5},0]
["5.5",{"$f":"VLOOKUP($A122,Orçamento!$A$3:$J$125,2,FALSE)","v":"SICRO"},{"$f":"VLOOKUP($A122,Orçamento!$A$3:$J$125,3,FALSE)","v":5915323},{"$f":"VLOOKUP($A122,Orçamento!$A$3:$J$125,4,FALSE)","v":"Transporte com caminhão carroceria de 5 t "},{"$f":"VLOOKUP($A122,Orçamento!$A$3:$J$125,5,FALSE)","v":"txkm"},{"$f":"VLOOKUP($A122,Orçamento!$A$3:$J$125,6,FALSE)","v":85474.648350000003},{"$f":"VLOOKUP($A122,Orçamento!$A$3:$J$125,7,FALSE)","v":0.84},{"$f":"VLOOKUP($A122,Orçamento!$A$3:$J$125,8,FALSE)","v":71798.704614000002},{"$f":"VLOOKUP($A122,Orçamento!$A$3:$J$125,9,FALSE)","v":1.05},{"$f":"VLOOKUP($A122,Orçamento!$A$3:$J$125,10,FALSE)","v":89748.380767500013},null,{"$f":"Eventograma!H190*'Desembolso-cronograma'!$I122","v":0},{"$f":"Eventograma!I190*'Desembolso-cronograma'!$I122","v":0},{"$f":"Eventograma!J190*'Desembolso-cronograma'!$I122","v":0},{"$f":"Eventograma!K190*'Desembolso-cronograma'!$I122","v":0},{"$f":"J122/9","v":9972.0423075000017},{"$f":"$J$122/9","v":9972.0423075000017},{"$f":"$J$122/9","v":9972.0423075000017},{"$f":"$J$122/9","v":9972.0423075000017},{"$f":"$J$122/9","v":9972.0423075000017},{"$f":"$J$122/9","v":9972.0423075000017},{"$f":"($J$122/9)+AB122+20323.97-920.43","v":29375.582307500001},null,null,null,{"$f":"Eventograma!V190*'Desembolso-cronograma'!$I122","v":0},null,0]
["5.6",{"$f":"VLOOKUP($A123,Orçamento!$A$3:$J$125,2,FALSE)","v":"SICRO"},{"$f":"VLOOKUP($A123,Orçamento!$A$3:$J$125,3,FALSE)","v":5914554},{"$f":"VLOOKUP($A123,Orçamento!$A$3:$J$125,4,FALSE)","v":"Transporte com caminhão betoneira "},{"$f":"VLOOKUP($A123,Orçamento!$A$3:$J$125,5,FALSE)","v":"txkm"},{"$f":"VLOOKUP($A123,Orçamento!$A$3:$J$125,6,FALSE)","v":1164.1113},{"$f":"VLOOKUP($A123,Orçamento!$A$3:$J$125,7,FALSE)","v":0.43},{"$f":"VLOOKUP($A123,Orçamento!$A$3:$J$125,8,FALSE)","v":500.567859},{"$f":"VLOOKUP($A123,Orçamento!$A$3:$J$125,9,FALSE)","v":0.54},{"$f":"VLOOKUP($A123,Orçamento!$A$3:$J$125,10,FALSE)","v":628.62010200000009},null,{"$f":"Eventograma!H191*'Desembolso-cronograma'!$I123","v":0},{"$f":"Eventograma!I191*'Desembolso-cronograma'!$I123","v":0},null,{"$f":"Eventograma!K191*'Desembolso-cronograma'!$I123","v":0},{"$f":"$J$123/7","v":89.802871714285729},{"$f":"$J$123/7","v":89.802871714285729},89.802871714285729,89.802871714285729,89.802871714285729,89.802871714285729,89.802871714285729,{"$nulls":5},0]
["5.7",{"$f":"VLOOKUP($A124,Orçamento!$A$3:$J$125,2,FALSE)","v":"SICRO"},{"$f":"VLOOKUP($A124,Orçamento!$A$3:$J$125,3,FALSE)","v":5914599},{"$f":"VLOOKUP($A124,Orçamento!$A$3:$J$125,4,FALSE)","v":"Transporte com caminhão carroceria com guindauto de 20 t.m"},{"$f":"VLOOKUP($A124,Orçamento!$A$3:$J$125,5,FALSE)","v":"txkm"},{"$f":"VLOOKUP($A124,Orçamento!$A$3:$J$125,6,FALSE)","v":17371.835999999999},{"$f":"VLOOKUP($A124,Orçamento!$A$3:$J$125,7,FALSE)","v":1.28},{"$f":"VLOOKUP($A124,Orçamento!$A$3:$J$125,8,FALSE)","v":22235.950079999999},{"$f":"VLOOKUP($A124,Orçamento!$A$3:$J$125,9,FALSE)","v":1.59},{"$f":"VLOOKUP($A124,Orçamento!$A$3:$J$125,10,FALSE)","v":27621.219239999999},null,{"$f":"Eventograma!H192*'Desembolso-cronograma'!$I124","v":0},{"$f":"Eventograma!I192*'Desembolso-cronograma'!$I124","v":0},{"$f":"Eventograma!J192*'Desembolso-cronograma'!$I124","v":0},{"$f":"Eventograma!K192*'Desembolso-cronograma'!$I124","v":0},{"$f":"$J$124/7","v":3945.8884628571427},{"$f":"$J$124/7","v":3945.8884628571427},3945.8884628571427,3945.8884628571427,3945.8884628571427,3945.8884628571427,3945.8884628571427,null,null,null,{"$f":"Eventograma!V192*'Desembolso-cronograma'!$I124","v":0},null,0]
[{"$nulls":5},{"$f":"Orçamento!F124","v":0},{"$f":"Orçamento!G124","v":0},{"$nulls":20},0]
[null,null,null,"TOTAL",null,null,"TOTAL",{"$f":"SUBTOTAL(9,H3:H125)","v":5443861.3876501163},null,{"$f":"SUBTOTAL(9,J3:J125)","v":6776107.1850921726},null,{"$f":"SUBTOTAL(9,L3:L125)","v":194185.65479999999},145854.13999999998,119107.42417712498,214040.28769753515,342614.8925202238,848985.62522750779,1121077.1163208014,1376195.7222943581,1246563.3457766497,865119.9666547759,189003.57727427673,113359.44,0,0,0]
[null,null,null,"TOTAL ACUMULADO",{"$nulls":7},{"$f":"L126","v":194185.65479999999},{"$f":"L127+M126","v":340039.79479999997},{"$f":"M127+N126","v":459147.21897712495},673187.50667466014,1015802.3991948839,1864788.0244223918,2985865.1407431932,4362060.8630375508,5608624.2088142,6473744.1754689757,6662747.7527432526,6776107.192743253,6776107.192743253,6776107.192743253,6776107.192743253]

{"sheet":"Transporte - memória","index":5,"n_rows":49,"n_cols":14,"rows_kept":49,"cut":false,"hidden":false,"merged":[]}
["Ítem","Base","Código","Descrição ","und","Volume Planilha","Quantidade Composição","Densidade","Peso Total (t)","Distância (km)","Transporte (txkm)"]
[1,null,null,"Transporte (estimativa - Serviços medidos a preços unitários)."]
["1.2","SICRO",5914374,"Revestimento Acesso","m³",{"$f":"Orçamento!F13","v":900},1.1000000000000001,{"$f":"1.5*1.25","v":1.875},{"$f":"H3*G3*F3","v":1856.25},1,{"$f":"I3*J3","v":1856.25}]
["1.3","SICRO",5914329,"Recomposição Revestimento Acesso","m³",{"$f":"Orçamento!F14","v":180},1.1000000000000001,{"$f":"1.5*1.25","v":1.875},371.25,1,371.25]
["1.4","SICRO",5914329,"Material Demolido","m³",{"$f":"Orçamento!F36","v":23.383749999999999},1,2.5,58.459374999999994,1,58.459374999999994]
["1.5","SICRO",5914374,"Valas de Montante","m³",{"$f":"Orçamento!F68-Orçamento!F69*1.1","v":1283.5999999999999},1,{"$f":"1.5*1.25","v":1.875},2406.75,1,2406.75]
["1.6","SICRO",5914374,"Pedra de mão enrocamento","m³",{"$f":"Orçamento!F77","v":1029},1.2,1.5,1852.1999999999998,102,188924.4]
["1.7","SICRO",5914374,"Bica corrida","m³",{"$f":"Orçamento!F84","v":1029},1.05,1.5,1620.6750000000002,102,165308.85]
["1.8","SICRO",5914374,"Valas de Jusante","m³",{"$f":"Orçamento!F95","v":976},1,{"$f":"1.5*1.25","v":1.875},1830,1,1830]
["1.9","SICRO",5914374,"Brita Geocélula","m³",{"$f":"Orçamento!F101","v":131.92499999999998},1.05,1.5,207.78187499999999,102,21193.751249999998]
["1.10","SICRO",5914374,"Pedra de mão dissipador","m³",{"$f":"Orçamento!F114*0.87","v":15.66},0.87,1.5,20.436299999999999,102,2084.5025999999998]
["1.11","SICRO",5914554,"Concreto 25MPa",null,46.583749999999995,1,2.4,111.80099999999999,0.1,11.180099999999999]
["1.11.1","SICRO",5914374,"Areia","m³",46.583749999999995,0.62995000000000001,1.5,{"$f":"H13*G13*F13","v":44.018149968749995},150,{"$f":"I13*J13","v":6602.7224953124996}]
["1.11.2","SICRO",5914374,"Brita","m³",46.583749999999995,0.68813000000000002,1.5,48.083513831249995,102,4904.5184107874993]
["1.11.3","SICRO",5914365,"Cimento","kg",46.583749999999995,340.98453999999998,1E-3,15.884338565224999,150,2382.6507847837497]
["1.11.4","SICRO",5914464,"Aditivo","kg",46.583749999999995,1.3639399999999999,1E-3,6.3537439974999985E-2,150,9.5306159962499972]
["1.12","SICRO",5914554,"Concreto 20MPa","m³",4803.88,1,2.4,11529.312,0.1,1152.9312]
["1.12.1","SICRO",5914374,"Areia","m³",4803.88,0.62873000000000001,1.5,4530.5152085999998,150,679577.28128999996]
["1.12.2","SICRO",5914374,"Brita","m³",{"$f":"F18","v":4803.88},{"$f":"0.36754*2","v":0.73507999999999996},1.5,5296.8541655999998,102,540279.12489119999]
["1.12.3","SICRO",5914365,"Cimento","kg",{"$f":"F19","v":4803.88},291.33487000000002,1E-3,1399.5377552956002,150,209930.66329434002]
["1.12.4","SICRO",5914464,"Aditivo","kg",{"$f":"F20","v":4803.88},0.874,1E-3,4.1985911199999997,150,629.78866799999992]
["1.14",null,null,"Armação em aço CA-50 "]
["1.14.1","SICRO",5914464,"Aço CA 50 ","kg",{"$f":"Orçamento!F39","v":477},1.1000000000000001,1E-3,{"$f":"H23*G23*F23","v":0.52470000000000006},150,{"$f":"I23*J23","v":78.705000000000013}]
["1.14.2","SICRO",5914464,"Arame recozido 18 BWG","kg",{"$f":"F23","v":477},1.4999999999999999E-2,1E-3,{"$f":"H24*G24*F24","v":7.1549999999999999E-3},150,{"$f":"I24*J24","v":1.07325}]
["1.15",null,null,"Armação em aço CA-60 "]
["1.15.2","SICRO",5914464,"Arame recozido 18 BWG","kg",10449.46485,1.4999999999999999E-2,1E-3,{"$f":"H26*G26*F26","v":0.15674197275000001},150,{"$f":"I26*J26","v":23.511295912500003}]
["1.16",null,null,"Dreno"]
["1.16.1","SICRO",5914374,"Brita 1 ","m³",73.25,0.24607000000000001,1.5,{"$f":"H28*G28*F28","v":27.036941250000002},102,{"$f":"I28*J28","v":2757.7680075000003}]
["1.16.2","SICRO",5914374,"Brita 2 - Caminhão basculante 10 m³","m³",73.25,0.24607999999999999,1.5,{"$f":"H29*G29*F29","v":27.038039999999999},102,{"$f":"I29*J29","v":2757.8800799999999}]
["1.16.3","SICRO",5914464,"Geotêxtil não-tecido agulhado RT 14","m²",73.25,3.5,2.5099999999999998E-4,{"$f":"H30*G30*F30","v":6.4350124999999994E-2},210,{"$f":"I30*J30","v":13.513526249999998}]
["1.16.4","SICRO",5914464,"Tubo de PEAD corrugado perfurado - D = 100 mm ","m",73.25,1,1.7099999999999999E-3,{"$f":"H31*G31*F31","v":0.12525749999999999},210,{"$f":"I31*J31","v":26.304074999999997}]
["1.17",null,null,"Formas de compensado plastificado 10 mm - uso geral "]
["1.17.1","SICRO",5914464,"Caibro de pinho de 7,5 x 7,5 cm","m",153.91,1.222,5.6219312602291327E-3,{"$f":"H33*G33*F33","v":1.0573617},102,{"$f":"I33*J33","v":107.85089339999999}]
["1.17.2","SICRO",5914464,"Compensado plastificado de 10 mm","m²",153.91,1.1000000000000001,9.9999999999999985E-3,1.6930099999999999,102,172.68701999999999]
["1.17.3","SICRO",5914464,"Peça de madeira de 2,5 x 7,5 cm","m",153.91,3.5333299999999999,1.8735866731949748E-3,1.0188842,102,103.9261884]
["1.17.4","SICRO",5914464,"Prego de ferro","kg",153.91,0.15137,9.9094932945762034E-4,2.3086499999999996E-2,102,2.3548229999999997]
["1.17.5","SICRO",5914464,"Tábua de 2,5 x 10 cm","m",153.91,4.5010599999999998,2.4994112497944928E-3,1.7314874999999998,102,176.61172499999998]
["1.17.6","SICRO",5914464,"Tábua de 2,5 x 30 cm","m",153.91,0.40699999999999997,7.4938574938574944E-3,0.4694255,102,47.881400999999997]
["1.18",null,null,"Solo Cimento"]
["1.18.1","SICRO",5915323,"Cimento Portland CP II - 32","kg",{"$f":"Orçamento!F66+Orçamento!F82+Orçamento!F99","v":4419.3500000000004},128.94,1E-3,{"$f":"H40*G40*F40","v":569.83098900000005},150,{"$f":"I40*J40","v":85474.648350000003}]
["1.19",null,null,"Geocélula"]
["1.19.1","SICRO",5914464,"Geotêxtil","m²",{"$f":"Orçamento!F72","v":14765},1.05,4.6666666666666661E-4,7.2348499999999998,210,{"$f":"I42*J42","v":1519.3184999999999},null,null,{"$f":"F42-43336","v":-28571}]
["1.19.2","SICRO",5914464,"Pead","m²",{"$f":"F42","v":14765},1.03,5.242718446601942E-4,7.9731000000000005,210,1674.3510000000001]
["1.19.3","SICRO",5914464,"Grampo","kg",{"$f":"F43","v":14765},0.42630000000000001,1E-3,6.2943195000000003,210,1321.8070950000001]
["1.20",null,null,"BSTC "]
["1.20.1","SICRO",5914599,"Tubo de Concreto Armado D=0,60","m",{"$f":"Orçamento!F109","v":24},1,0.42725999999999997,10.254239999999999,150,1538.136]
["1.20.2","SICRO",5914599,"Tubo de Concreto Armado D=1,00","m",{"$f":"Orçamento!F110","v":20},1,1.05558,21.111599999999999,150,3166.74]
["1.21",null,null,"BDTC"]
["1.21.1","SICRO",5914599,"Tubo de Concreto Armado D=1,00","m",{"$f":"Orçamento!F112","v":20},2,2.1111599999999999,84.446399999999997,150,12666.96]