{"text_format":"2","workbook":"xlsx","n_sheets":24,"sheets":["ORCAMENTO_RESUMO","ORCAMENTO_CONSOLIDADO","Mobilizacao_Desmobilizacao","CPU_MOBILIZACAO","CPU_DESMOBILIZAZAO","Canteiros","Reforma_Canteiros","Moveis_Equipamentos","Mao_de_Obra","Mao_de_Obra (Total)","Mem_Calculo_EQUIPE","Encargos Sociais e Benefícios","Viagens_Diárias","CPU_Viagens","Veiculos","Frentes_Moveis","Materiais_Consumo","CPU_MANUTENCAO_CANTEIRO","Ferramentas","Equipamentos","Instrumentos","Radios_Comunicadores","Custos Administração","Despesas Fiscais"],"not_rendered":{"charts":0,"images":1,"macros":0,"external_links":0,"defined_names":65,"comments":3,"pivot_tables":0},"unopened":[],"bounds":{"document_bytes":16777216,"sheet_cells":100000,"run_cost":"one","rows_first":2000,"rows_last":500,"rows_between":2000,"halvings":0,"cell_chars":16384,"cell_head_chars":4096},"cells_cut":0,"cells_raw":0,"read":"whole","date_system":"1900"}

{"sheet":"ORCAMENTO_RESUMO","index":0,"n_rows":45,"n_cols":5,"rows_kept":45,"cut":false,"hidden":false,"merged":[[7,0,7,2],[4,0,5,4],[0,2,0,4],[1,2,1,4],[2,2,2,4]]}
[null,null,"Ministério do Desenvolvimento Regional  - MDR"]
[null,null,"Companhia de Desenvolvimento dos Vales do São Francisco e do Parnaíba"]
[null,null,"Gerência de Operação do PISF - Centro de Controle e Operação (AD / GOI / CCO)"]
[]
["SERVIÇOS DE OPERAÇÃO E MANUTENÇÃO DAS INFRAESTRUTURAS DO EIXO LESTE DO PROJETO DE INTEGRAÇÃO DO RIO SÃO FRANCISCO COM AS BACIAS HIDROGRÁFICAS DO NORDESTE SETENTRIONAL – PISF"]
[]
[]
["ORÇAMENTO CONSOLIDADO",null,null,"TOTAL - (R$)",{"$f":"SUBTOTAL(109,D12:D45)","v":{"$error":"#REF!"}}]
[]
[]
["ITEM","CÓDIGO","DESCRIÇÃO","R$ TOTAL","%"]
["1.",null,{"$f":"VLOOKUP(A12,ORCAMENTO_CONSOLIDADO!A$12:C$782,3,FALSE)","v":"MOBILIZAÇÃO E DESMOBILIZAÇAO"},{"$f":"SUBTOTAL(109,D13:D14)","v":0},{"$f":"ROUND(D12/E$8,4)","v":{"$error":"#REF!"}}]
["1.1",null,{"$f":"VLOOKUP(A13&\".\",ORCAMENTO_CONSOLIDADO!A$12:C$782,3,FALSE)","v":"MOBILIZAÇÃO (Máquinas, Equipamentos, Ferramentas, Instrumentos, Materiais, Mobiliário)"},{"$f":"SUMIF(ORCAMENTO_CONSOLIDADO!A$12:A$782,A13&\".\",ORCAMENTO_CONSOLIDADO!G$12:G$782)","v":0},{"$f":"ROUND(D13/E$8,4)","v":{"$error":"#REF!"}}]
["1.2",null,{"$f":"VLOOKUP(A14&\".\",ORCAMENTO_CONSOLIDADO!A$12:C$782,3,FALSE)","v":"DESMOBILIZAÇÃO (Máquinas, Equip., Ferramentas, Instrumentos, Materiais, Mobiliário)"},{"$f":"SUMIF(ORCAMENTO_CONSOLIDADO!A$12:A$782,A14&\".\",ORCAMENTO_CONSOLIDADO!G$12:G$782)","v":0},{"$error":"#REF!"}]
["2.",null,{"$f":"VLOOKUP(A15,ORCAMENTO_CONSOLIDADO!A$12:C$782,3,FALSE)","v":"REFORMA DOS CANTEIROS"},{"$f":"SUBTOTAL(109,D16:D18)","v":0},{"$error":"#REF!"}]
["2.1",null,"REFORMA DO CANTEIRO DO LOTE 09 (FLORESTA/PE)",{"$f":"SUMIF(ORCAMENTO_CONSOLIDADO!A$12:A$782,A16&\".\",ORCAMENTO_CONSOLIDADO!G$12:G$782)","v":0},{"$error":"#REF!"}]
["2.2",null,{"$f":"VLOOKUP(A17&\".\",ORCAMENTO_CONSOLIDADO!A$12:C$782,3,FALSE)","v":"REFORMA DO CANTEIRO DO LOTE 10 (CUSTÓDIA/PE)"},{"$f":"SUMIF(ORCAMENTO_CONSOLIDADO!A$12:A$782,A17&\".\",ORCAMENTO_CONSOLIDADO!G$12:G$782)","v":0},{"$error":"#REF!"}]
["2.3",null,{"$f":"VLOOKUP(A18&\".\",ORCAMENTO_CONSOLIDADO!A$12:C$782,3,FALSE)","v":"REFORMA DO CANTEIRO DO LOTE 12 (SERTÂNIA/PE)"},{"$f":"SUMIF(ORCAMENTO_CONSOLIDADO!A$12:A$782,A18&\".\",ORCAMENTO_CONSOLIDADO!G$12:G$782)","v":0},{"$error":"#REF!"}]
["3.",null,{"$f":"VLOOKUP(A19,ORCAMENTO_CONSOLIDADO!A$12:C$782,3,FALSE)","v":"MOBILIÁRIO E EQUIPAMENTOS DE ESCRTÓRIO"},{"$f":"SUMIF(ORCAMENTO_CONSOLIDADO!A$12:A$782,A19,ORCAMENTO_CONSOLIDADO!G$12:G$782)","v":0},{"$error":"#REF!"}]
["4.",null,{"$f":"VLOOKUP(A20,ORCAMENTO_CONSOLIDADO!A$12:C$782,3,FALSE)","v":"EQUIPE - MÃO DE OBRA"},{"$f":"SUMIF(ORCAMENTO_CONSOLIDADO!A$12:A$782,A20,ORCAMENTO_CONSOLIDADO!G$12:G$782)","v":0},{"$error":"#REF!"}]
["5.",null,{"$f":"VLOOKUP(A21,ORCAMENTO_CONSOLIDADO!A$12:C$782,3,FALSE)","v":"VIAGENS / DIÁRIAS"},{"$f":"SUBTOTAL(109,D22:D23)","v":0},{"$error":"#REF!"}]
["5.1",null,{"$f":"VLOOKUP(A22&\".\",ORCAMENTO_CONSOLIDADO!A$12:C$782,3,FALSE)","v":"DESPESAS COM VIAGENS COMERCIAIS"},{"$f":"SUMIF(ORCAMENTO_CONSOLIDADO!A$12:A$782,A22&\".\",ORCAMENTO_CONSOLIDADO!G$12:G$782)","v":0},{"$error":"#REF!"}]
["5.2",null,{"$f":"VLOOKUP(A23&\".\",ORCAMENTO_CONSOLIDADO!A$12:C$782,3,FALSE)","v":"DESPESAS COM DIÁRIAS"},{"$f":"SUMIF(ORCAMENTO_CONSOLIDADO!A$12:A$782,A23&\".\",ORCAMENTO_CONSOLIDADO!G$12:G$782)","v":0},{"$error":"#REF!"}]
["6.",null,{"$f":"VLOOKUP(A24,ORCAMENTO_CONSOLIDADO!A$12:C$782,3,FALSE)","v":"VEÍCULOS AUTOMOTORES"},{"$f":"SUMIF(ORCAMENTO_CONSOLIDADO!A$12:A$782,A24,ORCAMENTO_CONSOLIDADO!G$12:G$782)","v":{"$error":"#REF!"}},{"$error":"#REF!"}]
["7.",null,{"$f":"VLOOKUP(A25,ORCAMENTO_CONSOLIDADO!A$12:C$782,3,FALSE)","v":"FRENTES MÓVEIS DE LIMPEZA E CONSERVAÇÃO"},{"$f":"SUMIF(ORCAMENTO_CONSOLIDADO!A$12:A$782,A25,ORCAMENTO_CONSOLIDADO!G$12:G$782)","v":0},{"$error":"#REF!"}]
["8.",null,{"$f":"VLOOKUP(A26,ORCAMENTO_CONSOLIDADO!A$12:C$782,3,FALSE)","v":"MATERIAL DE CONSUMO - ALMOXARIFADOS"},{"$f":"SUBTOTAL(109,D27:D30)","v":0},{"$error":"#REF!"}]
["8.1",null,{"$f":"VLOOKUP(A27&\".\",ORCAMENTO_CONSOLIDADO!A$12:C$782,3,FALSE)","v":"MATERIAL DE CONSUMO - MECÂNICA"},{"$f":"SUMIF(ORCAMENTO_CONSOLIDADO!A$12:A$782,A27&\".\",ORCAMENTO_CONSOLIDADO!G$12:G$782)","v":0},{"$error":"#REF!"}]
["8.2",null,{"$f":"VLOOKUP(A28&\".\",ORCAMENTO_CONSOLIDADO!A$12:C$782,3,FALSE)","v":"MATERIAL DE CONSUMO - ELÉTRICA"},{"$f":"SUMIF(ORCAMENTO_CONSOLIDADO!A$12:A$782,A28&\".\",ORCAMENTO_CONSOLIDADO!G$12:G$782)","v":0},{"$error":"#REF!"}]
["8.3",null,{"$f":"VLOOKUP(A29&\".\",ORCAMENTO_CONSOLIDADO!A$12:C$782,3,FALSE)","v":"MATERIAL DE CONSUMO - CIVIL"},{"$f":"SUMIF(ORCAMENTO_CONSOLIDADO!A$12:A$782,A29&\".\",ORCAMENTO_CONSOLIDADO!G$12:G$782)","v":0},{"$error":"#REF!"}]
["8.4",null,{"$f":"VLOOKUP(A30&\".\",ORCAMENTO_CONSOLIDADO!A$12:C$782,3,FALSE)","v":"MANUTENÇÃO DE CANTEIRO - ESCRITÓRIO"},{"$f":"SUMIF(ORCAMENTO_CONSOLIDADO!A$12:A$782,A30&\".\",ORCAMENTO_CONSOLIDADO!G$12:G$782)","v":0},{"$error":"#REF!"}]
["9.",null,{"$f":"VLOOKUP(A31,ORCAMENTO_CONSOLIDADO!A$12:C$782,3,FALSE)","v":"FERRAMENTAS"},{"$f":"SUBTOTAL(109,D32:D34)","v":0},{"$error":"#REF!"}]
["9.1",null,{"$f":"VLOOKUP(A32&\".\",ORCAMENTO_CONSOLIDADO!A$12:C$782,3,FALSE)","v":"FERRAMENTAS - MECÂNICA"},{"$f":"SUMIF(ORCAMENTO_CONSOLIDADO!A$12:A$782,A32&\".\",ORCAMENTO_CONSOLIDADO!G$12:G$782)","v":0},{"$error":"#REF!"}]
["9.2",null,{"$f":"VLOOKUP(A33&\".\",ORCAMENTO_CONSOLIDADO!A$12:C$782,3,FALSE)","v":"FERRAMENTAS - ELÉTRICA"},{"$f":"SUMIF(ORCAMENTO_CONSOLIDADO!A$12:A$782,A33&\".\",ORCAMENTO_CONSOLIDADO!G$12:G$782)","v":0},{"$error":"#REF!"}]
["9.3",null,{"$f":"VLOOKUP(A34&\".\",ORCAMENTO_CONSOLIDADO!A$12:C$782,3,FALSE)","v":"FERRAMENTAS - CIVIL"},{"$f":"SUMIF(ORCAMENTO_CONSOLIDADO!A$12:A$782,A34&\".\",ORCAMENTO_CONSOLIDADO!G$12:G$782)","v":0},{"$error":"#REF!"}]
["10.",null,{"$f":"VLOOKUP(A35,ORCAMENTO_CONSOLIDADO!A$12:C$782,3,FALSE)","v":"EQUIPAMENTOS"},{"$f":"SUBTOTAL(109,D36:D38)","v":0},{"$error":"#REF!"}]
["10.1",null,{"$f":"VLOOKUP(A36&\".\",ORCAMENTO_CONSOLIDADO!A$12:C$782,3,FALSE)","v":"EQUIPAMENTOS - MECÂNICA"},{"$f":"SUMIF(ORCAMENTO_CONSOLIDADO!A$12:A$782,A36&\".\",ORCAMENTO_CONSOLIDADO!G$12:G$782)","v":0},{"$error":"#REF!"}]
["10.2",null,{"$f":"VLOOKUP(A37&\".\",ORCAMENTO_CONSOLIDADO!A$12:C$782,3,FALSE)","v":"EQUIPAMENTOS - ELÉTRICA"},{"$f":"SUMIF(ORCAMENTO_CONSOLIDADO!A$12:A$782,A37&\".\",ORCAMENTO_CONSOLIDADO!G$12:G$782)","v":0},{"$error":"#REF!"}]
["10.3",null,{"$f":"VLOOKUP(A38&\".\",ORCAMENTO_CONSOLIDADO!A$12:C$782,3,FALSE)","v":"EQUIPAMENTOS - CIVIL"},{"$f":"SUMIF(ORCAMENTO_CONSOLIDADO!A$12:A$782,A38&\".\",ORCAMENTO_CONSOLIDADO!G$12:G$782)","v":0},{"$error":"#REF!"}]
["11.",null,{"$f":"VLOOKUP(A39,ORCAMENTO_CONSOLIDADO!A$12:C$782,3,FALSE)","v":"INSTRUMENTOS"},{"$f":"SUBTOTAL(109,D40:D42)","v":0},{"$error":"#REF!"}]
["11.1",null,{"$f":"VLOOKUP(A40&\".\",ORCAMENTO_CONSOLIDADO!A$12:C$782,3,FALSE)","v":"INSTRUMENTOS - MECÂNICA"},{"$f":"SUMIF(ORCAMENTO_CONSOLIDADO!A$12:A$782,A40&\".\",ORCAMENTO_CONSOLIDADO!G$12:G$782)","v":0},{"$error":"#REF!"}]
["11.2",null,{"$f":"VLOOKUP(A41&\".\",ORCAMENTO_CONSOLIDADO!A$12:C$782,3,FALSE)","v":"INSTRUMENTOS - ELÉTRICA"},{"$f":"SUMIF(ORCAMENTO_CONSOLIDADO!A$12:A$782,A41&\".\",ORCAMENTO_CONSOLIDADO!G$12:G$782)","v":0},{"$error":"#REF!"}]
["11.3",null,{"$f":"VLOOKUP(A42&\".\",ORCAMENTO_CONSOLIDADO!A$12:C$782,3,FALSE)","v":"INSTRUMENTOS - CIVIL"},{"$f":"SUMIF(ORCAMENTO_CONSOLIDADO!A$12:A$782,A42&\".\",ORCAMENTO_CONSOLIDADO!G$12:G$782)","v":0},{"$error":"#REF!"}]
["12.",null,{"$f":"VLOOKUP(A43,ORCAMENTO_CONSOLIDADO!A$12:C$782,3,FALSE)","v":"SISTEMA DE RÁDIO COMUNICAÇÃO"},{"$f":"SUMIF(ORCAMENTO_CONSOLIDADO!A$12:A$782,A43,ORCAMENTO_CONSOLIDADO!G$12:G$782)","v":{"$error":"#REF!"}},{"$error":"#REF!"}]
["13.",null,{"$f":"VLOOKUP(A44,ORCAMENTO_CONSOLIDADO!A$12:C$782,3,FALSE)","v":"SERVIÇOS E FORNECIMENTOS REEMBOLSÁVEIS"},{"$f":"SUMIF(ORCAMENTO_CONSOLIDADO!A$12:A$782,A44,ORCAMENTO_CONSOLIDADO!G$12:G$782)","v":{"$error":"#REF!"}},{"$error":"#REF!"}]
["14.",null,{"$f":"VLOOKUP(A45,ORCAMENTO_CONSOLIDADO!A$12:C$782,3,FALSE)","v":"CUSTOS INDIRETOS"},{"$f":"SUMIF(ORCAMENTO_CONSOLIDADO!A$12:A$782,A45,ORCAMENTO_CONSOLIDADO!G$12:G$782)","v":{"$error":"#REF!"}},{"$error":"#REF!"}]

{"sheet":"ORCAMENTO_CONSOLIDADO","index":1,"n_rows":788,"n_cols":8,"rows_kept":788,"cut":false,"hidden":false,"merged":[[7,6,7,7],[7,0,7,4],[0,2,0,7],[1,2,1,7],[2,2,2,7],[4,0,5,7],[783,0,783,5],[783,6,783,7],[784,0,784,5],[784,6,784,7],[785,0,785,5],[785,6,785,7],[788,0,788,7],[789,0,789,7],[786,0,786,5],[786,6,786,7],[787,0,787,7]]}
[null,null,"Ministério do Desenvolvimento Regional  - MDR"]
[null,null,"Companhia de Desenvolvimento dos Vales do São Francisco e do Parnaíba"]
[null,null,"Gerência de Operação do PISF - Centro de Controle e Operação (AD / GOI / CCO)"]
[]
["SERVIÇOS DE OPERAÇÃO E MANUTENÇÃO DAS INFRAESTRUTURAS DO EIXO LESTE DO PROJETO DE INTEGRAÇÃO DO RIO SÃO FRANCISCO COM AS BACIAS HIDROGRÁFICAS DO NORDESTE SETENTRIONAL – PISF"]
[]
[]
["ORÇAMENTO CONSOLIDADO",{"$nulls":4},"TOTAL - (R$)",{"$f":"SUBTOTAL(109,G12:G782)","v":{"$error":"#REF!"}}]
[]
[]
["ITEM","CÓDIGO","DESCRIÇÃO","UNID.","QUANTID.","R$ UNIT.","R$ TOTAL","%"]
[]
["1.",null,{"$f":"Mobilizacao_Desmobilizacao!C13","v":"MOBILIZAÇÃO E DESMOBILIZAÇAO"},null,null,null,{"$f":"SUBTOTAL(109,G14:G21)","v":0},{"$f":"ROUND(G13/G$8,4)","v":{"$error":"#REF!"}}]
["1.1.",null,{"$f":"Mobilizacao_Desmobilizacao!C15","v":"MOBILIZAÇÃO (Máquinas, Equipamentos, Ferramentas, Instrumentos, Materiais, Mobiliário)"},null,null,null,{"$f":"SUBTOTAL(109,G15:G17)","v":0},{"$f":"ROUND(G14/G$8,4)","v":{"$error":"#REF!"}}]
["1.1.1",{"$f":"Mobilizacao_Desmobilizacao!B16","v":0},{"$f":"Mobilizacao_Desmobilizacao!C16","v":"Mobilização da Equipe - Canteiro Lote 09 (Floresta/PE)"},{"$f":"Mobilizacao_Desmobilizacao!D16","v":"un"},{"$f":"Mobilizacao_Desmobilizacao!E16","v":1},{"$f":"Mobilizacao_Desmobilizacao!F16","v":0},{"$f":"ROUND(E15*F15,2)","v":0},{"$error":"#REF!"}]
["1.1.2",{"$f":"Mobilizacao_Desmobilizacao!B17","v":0},{"$f":"Mobilizacao_Desmobilizacao!C17","v":"Mobilização da Equipe - Canteiro Lote 10 (Custódia/PE)"},{"$f":"Mobilizacao_Desmobilizacao!D17","v":"un"},{"$f":"Mobilizacao_Desmobilizacao!E17","v":1},{"$f":"Mobilizacao_Desmobilizacao!F17","v":0},0,{"$error":"#REF!"}]
["1.1.3",{"$f":"Mobilizacao_Desmobilizacao!B18","v":0},{"$f":"Mobilizacao_Desmobilizacao!C18","v":"Mobilização da Equipe - Canteiro Lote 12 (Sertânia/PE)"},{"$f":"Mobilizacao_Desmobilizacao!D18","v":"un"},{"$f":"Mobilizacao_Desmobilizacao!E18","v":1},{"$f":"Mobilizacao_Desmobilizacao!F18","v":0},0,{"$error":"#REF!"}]
["1.2.",null,{"$f":"Mobilizacao_Desmobilizacao!C21","v":"DESMOBILIZAÇÃO (Máquinas, Equip., Ferramentas, Instrumentos, Materiais, Mobiliário)"},null,null,null,{"$f":"SUBTOTAL(109,G19:G21)","v":0},{"$error":"#REF!"}]
["1.2.1",{"$f":"Mobilizacao_Desmobilizacao!B20","v":0},{"$f":"Mobilizacao_Desmobilizacao!C22","v":"Desmobilização da Equipe - Canteiro Lote 09 (Floresta/PE)"},{"$f":"Mobilizacao_Desmobilizacao!D22","v":"un"},{"$f":"Mobilizacao_Desmobilizacao!E22","v":1},{"$f":"Mobilizacao_Desmobilizacao!F22","v":0},{"$f":"ROUND(E19*F19,2)","v":0},{"$error":"#REF!"}]
["1.2.2",{"$f":"Mobilizacao_Desmobilizacao!B21","v":0},{"$f":"Mobilizacao_Desmobilizacao!C23","v":"Desmobilização da Equipe - Canteiro Lote 10 (Custódia/PE)"},{"$f":"Mobilizacao_Desmobilizacao!D23","v":"un"},{"$f":"Mobilizacao_Desmobilizacao!E23","v":1},{"$f":"Mobilizacao_Desmobilizacao!F23","v":0},0,{"$error":"#REF!"}]
["1.2.3",{"$f":"Mobilizacao_Desmobilizacao!B22","v":0},{"$f":"Mobilizacao_Desmobilizacao!C24","v":"Desmobilização da Equipe - Canteiro Lote 12 (Sertânia/PE)"},{"$f":"Mobilizacao_Desmobilizacao!D24","v":"un"},{"$f":"Mobilizacao_Desmobilizacao!E24","v":1},{"$f":"Mobilizacao_Desmobilizacao!F24","v":0},0,{"$error":"#REF!"}]
[]
["2.",null,{"$f":"Reforma_Canteiros!C13","v":"REFORMA DOS CANTEIROS"},null,null,null,{"$f":"SUBTOTAL(109,G24:G52)","v":0},{"$f":"ROUND(G23/G$8,4)","v":{"$error":"#REF!"}}]
["2.1.",null,{"$f":"Reforma_Canteiros!C15","v":"REFORMA DO CANTEIRO DO LOTE 09 (FLOPRESTA/PE)"},null,null,null,{"$f":"SUBTOTAL(109,G25:G32)","v":0},{"$error":"#REF!"}]
["2.1.1",{"$f":"Reforma_Canteiros!B16","v":"93206-SINAPI/PE*"},{"$f":"Reforma_Canteiros!C16","v":"Escritório 1"},{"$f":"Reforma_Canteiros!D16","v":"m²"},{"$f":"Reforma_Canteiros!E16","v":174.06},{"$f":"Reforma_Canteiros!F16","v":0},{"$f":"ROUND(E25*F25,2)","v":0},{"$error":"#REF!"}]
["2.1.2",{"$f":"Reforma_Canteiros!B17","v":"93206-SINAPI/PE*"},{"$f":"Reforma_Canteiros!C17","v":"Escritório 2"},{"$f":"Reforma_Canteiros!D17","v":"m²"},{"$f":"Reforma_Canteiros!E17","v":276.75},{"$f":"Reforma_Canteiros!F17","v":0},0,{"$error":"#REF!"}]
["2.1.3",{"$f":"Reforma_Canteiros!B18","v":"93585-SINAPI/PE*"},{"$f":"Reforma_Canteiros!C18","v":"Guarita"},{"$f":"Reforma_Canteiros!D18","v":"m²"},{"$f":"Reforma_Canteiros!E18","v":57.29},{"$f":"Reforma_Canteiros!F18","v":0},0,{"$error":"#REF!"}]
["2.1.4",{"$f":"Reforma_Canteiros!B19","v":"93213-SINAPI/PE*"},{"$f":"Reforma_Canteiros!C19","v":"Vestiário e sanitário"},{"$f":"Reforma_Canteiros!D19","v":"m²"},{"$f":"Reforma_Canteiros!E19","v":108.24},{"$f":"Reforma_Canteiros!F19","v":0},0,{"$error":"#REF!"}]
["2.1.5",{"$f":"Reforma_Canteiros!B20","v":"93211-SINAPI/PE*"},{"$f":"Reforma_Canteiros!C20","v":"Cozinha e refeitório/Auditório"},{"$f":"Reforma_Canteiros!D20","v":"m²"},{"$f":"Reforma_Canteiros!E20","v":427.68},{"$f":"Reforma_Canteiros!F20","v":0},0,{"$error":"#REF!"}]
["2.1.6",{"$f":"Reforma_Canteiros!B21","v":"93213-SINAPI/PE*"},{"$f":"Reforma_Canteiros!C21","v":"Lazer (área de convivência)"},{"$f":"Reforma_Canteiros!D21","v":"m²"},{"$f":"Reforma_Canteiros!E21","v":142.21},{"$f":"Reforma_Canteiros!F21","v":0},0,{"$error":"#REF!"}]
["2.1.7",{"$f":"Reforma_Canteiros!B22","v":"93209-SINAPI/PE*"},{"$f":"Reforma_Canteiros!C22","v":"Almoxarifado"},{"$f":"Reforma_Canteiros!D22","v":"m²"},{"$f":"Reforma_Canteiros!E22","v":264.95999999999998},{"$f":"Reforma_Canteiros!F22","v":0},0,{"$error":"#REF!"}]
["2.1.8",{"$f":"Reforma_Canteiros!B23","v":"93582-SINAPI/PE*"},{"$f":"Reforma_Canteiros!C23","v":"Central de armação"},{"$f":"Reforma_Canteiros!D23","v":"m²"},{"$f":"Reforma_Canteiros!E23","v":702.74},{"$f":"Reforma_Canteiros!F23","v":0},0,{"$error":"#REF!"}]
["2.2.",null,{"$f":"Reforma_Canteiros!C26","v":"REFORMA DO CANTEIRO DO LOTE 10 (CUSTÓDIA/PE)"},null,null,null,{"$f":"SUBTOTAL(109,G34:G42)","v":0},{"$error":"#REF!"}]
["2.2.1",{"$f":"Reforma_Canteiros!B27","v":"93206-SINAPI/PE"},{"$f":"Reforma_Canteiros!C27","v":"Escritório 1"},{"$f":"Reforma_Canteiros!D27","v":"m²"},{"$f":"Reforma_Canteiros!E27","v":255.16},{"$f":"Reforma_Canteiros!F27","v":0},{"$f":"ROUND(E34*F34,2)","v":0},{"$error":"#REF!"}]
["2.2.2",{"$f":"Reforma_Canteiros!B28","v":"93206-SINAPI/PE"},{"$f":"Reforma_Canteiros!C28","v":"Escritório 2"},{"$f":"Reforma_Canteiros!D28","v":"m²"},{"$f":"Reforma_Canteiros!E28","v":297.08},{"$f":"Reforma_Canteiros!F28","v":0},0,{"$error":"#REF!"}]
["2.2.3",{"$f":"Reforma_Canteiros!B29","v":"93585-SINAPI/PE*"},{"$f":"Reforma_Canteiros!C29","v":"Guarita"},{"$f":"Reforma_Canteiros!D29","v":"m²"},{"$f":"Reforma_Canteiros!E29","v":12.46},{"$f":"Reforma_Canteiros!F29","v":0},0,{"$error":"#REF!"}]
["2.2.4",{"$f":"Reforma_Canteiros!B30","v":"93213-SINAPI/PE"},{"$f":"Reforma_Canteiros!C30","v":"Vestiário e sanitário"},{"$f":"Reforma_Canteiros!D30","v":"m²"},{"$f":"Reforma_Canteiros!E30","v":268.64},{"$f":"Reforma_Canteiros!F30","v":0},0,{"$error":"#REF!"}]
["2.2.5",{"$f":"Reforma_Canteiros!B31","v":"93211-SINAPI/PE"},{"$f":"Reforma_Canteiros!C31","v":"Cozinha e refeitório/Auditório"},{"$f":"Reforma_Canteiros!D31","v":"m²"},{"$f":"Reforma_Canteiros!E31","v":1477.66},{"$f":"Reforma_Canteiros!F31","v":0},0,{"$error":"#REF!"}]
["2.2.6",{"$f":"Reforma_Canteiros!B32","v":"93213-SINAPI/PE*"},{"$f":"Reforma_Canteiros!C32","v":"Lazer (área de convivência)"},{"$f":"Reforma_Canteiros!D32","v":"m²"},{"$f":"Reforma_Canteiros!E32","v":350},{"$f":"Reforma_Canteiros!F32","v":0},0,{"$error":"#REF!"}]
["2.2.7",{"$f":"Reforma_Canteiros!B33","v":"93209-SINAPI/PE*"},{"$f":"Reforma_Canteiros!C33","v":"Almoxarifado"},{"$f":"Reforma_Canteiros!D33","v":"m²"},{"$f":"Reforma_Canteiros!E33","v":456.2},{"$f":"Reforma_Canteiros!F33","v":0},0,{"$error":"#REF!"}]
["2.2.8",{"$f":"Reforma_Canteiros!B34","v":"93582-SINAPI/PE*"},{"$f":"Reforma_Canteiros!C34","v":"Central de armação"},{"$f":"Reforma_Canteiros!D34","v":"m²"},{"$f":"Reforma_Canteiros!E34","v":663.82},{"$f":"Reforma_Canteiros!F34","v":0},0,{"$error":"#REF!"}]
["2.2.9",{"$f":"Reforma_Canteiros!B35","v":"93206-SINAPI/PE"},{"$f":"Reforma_Canteiros!C35","v":"Centro de Saúde"},{"$f":"Reforma_Canteiros!D35","v":"m²"},{"$f":"Reforma_Canteiros!E35","v":53.72},{"$f":"Reforma_Canteiros!F35","v":0},0,{"$error":"#REF!"}]
["2.3.",null,{"$f":"Reforma_Canteiros!C38","v":"REFORMA DO CANTEIRO DO LOTE 12 (SERTÂNIA/PE)"},null,null,null,{"$f":"SUBTOTAL(109,G44:G52)","v":0},{"$error":"#REF!"}]
["2.3.1",{"$f":"Reforma_Canteiros!B39","v":"93206-SINAPI/PE*"},{"$f":"Reforma_Canteiros!C39","v":"Escritório 1"},{"$f":"Reforma_Canteiros!D39","v":"m²"},{"$f":"Reforma_Canteiros!E39","v":285.33},{"$f":"Reforma_Canteiros!F39","v":0},{"$f":"ROUND(E44*F44,2)","v":0},{"$error":"#REF!"}]
["2.3.2",{"$f":"Reforma_Canteiros!B40","v":"93206-SINAPI/PE*"},{"$f":"Reforma_Canteiros!C40","v":"Escritório 2"},{"$f":"Reforma_Canteiros!D40","v":"m²"},{"$f":"Reforma_Canteiros!E40","v":323.2},{"$f":"Reforma_Canteiros!F40","v":0},0,{"$error":"#REF!"}]
["2.3.3",{"$f":"Reforma_Canteiros!B41","v":"93585-SINAPI/PE*"},{"$f":"Reforma_Canteiros!C41","v":"Guarita"},{"$f":"Reforma_Canteiros!D41","v":"m²"},{"$f":"Reforma_Canteiros!E41","v":9.9},{"$f":"Reforma_Canteiros!F41","v":0},0,{"$error":"#REF!"}]
["2.3.4",{"$f":"Reforma_Canteiros!B42","v":"93213-SINAPI/PE*"},{"$f":"Reforma_Canteiros!C42","v":"Vestiário e sanitário"},{"$f":"Reforma_Canteiros!D42","v":"m²"},{"$f":"Reforma_Canteiros!E42","v":616.98},{"$f":"Reforma_Canteiros!F42","v":0},0,{"$error":"#REF!"}]
["2.3.5",{"$f":"Reforma_Canteiros!B43","v":"93211-SINAPI/PE*"},{"$f":"Reforma_Canteiros!C43","v":"Cozinha e refeitório/Auditório"},{"$f":"Reforma_Canteiros!D43","v":"m²"},{"$f":"Reforma_Canteiros!E43","v":690.8},{"$f":"Reforma_Canteiros!F43","v":0},0,{"$error":"#REF!"}]
["2.3.6",{"$f":"Reforma_Canteiros!B44","v":"93213-SINAPI/PE*"},{"$f":"Reforma_Canteiros!C44","v":"Lazer (área de convivência)"},{"$f":"Reforma_Canteiros!D44","v":"m²"},{"$f":"Reforma_Canteiros!E44","v":58.76},{"$f":"Reforma_Canteiros!F44","v":0},0,{"$error":"#REF!"}]
["2.3.7",{"$f":"Reforma_Canteiros!B45","v":"93209-SINAPI/PE*"},{"$f":"Reforma_Canteiros!C45","v":"Almoxarifado"},{"$f":"Reforma_Canteiros!D45","v":"m²"},{"$f":"Reforma_Canteiros!E45","v":229.35},{"$f":"Reforma_Canteiros!F45","v":0},0,{"$error":"#REF!"}]
["2.3.8",{"$f":"Reforma_Canteiros!B46","v":"93582-SINAPI/PE*"},{"$f":"Reforma_Canteiros!C46","v":"Central de armação"},{"$f":"Reforma_Canteiros!D46","v":"m²"},{"$f":"Reforma_Canteiros!E46","v":216.72},{"$f":"Reforma_Canteiros!F46","v":0},0,{"$error":"#REF!"}]
["2.3.9",{"$f":"Reforma_Canteiros!B47","v":"93206-SINAPI/PE*"},{"$f":"Reforma_Canteiros!C47","v":"Centro de Saúde"},{"$f":"Reforma_Canteiros!D47","v":"m²"},{"$f":"Reforma_Canteiros!E47","v":53.72},{"$f":"Reforma_Canteiros!F47","v":0},0,{"$error":"#REF!"}]
[]
["3.",null,{"$f":"Moveis_Equipamentos!C13","v":"MOBILIÁRIO E EQUIPAMENTOS DE ESCRTÓRIO"},null,null,null,{"$f":"SUBTOTAL(109,G55:G106)","v":0},{"$f":"ROUND(G54/G$8,4)","v":{"$error":"#REF!"}}]
["3.1",{"$f":"Moveis_Equipamentos!B14","v":"E209300236-EMBASA/BA"},{"$f":"Moveis_Equipamentos!C14","v":"Aluguel de impressora colorida-Laser com cartuchos-formatos A4 e A3 (inclusive suprimentos)"},{"$f":"Moveis_Equipamentos!D14","v":"un x mês"},{"$f":"Moveis_Equipamentos!E14","v":216},{"$f":"Moveis_Equipamentos!F14","v":0},{"$f":"ROUND(E55*F55,2)","v":0},{"$error":"#REF!"}]
["3.2",{"$f":"Moveis_Equipamentos!B15","v":"I8612-SEINFRA/CE"},{"$f":"Moveis_Equipamentos!C15","v":"Aluguel de Plotter (inclusive suprimentos)"},{"$f":"Moveis_Equipamentos!D15","v":"un x mês"},{"$f":"Moveis_Equipamentos!E15","v":36},{"$f":"Moveis_Equipamentos!F15","v":0},{"$f":"ROUND(E56*F56,2)","v":0},{"$error":"#REF!"}]
["3.3",{"$f":"Moveis_Equipamentos!B16","v":" I2677-SEINFRA/CE"},{"$f":"Moveis_Equipamentos!C16","v":"Servidor para backup"},{"$f":"Moveis_Equipamentos!D16","v":"un"},{"$f":"Moveis_Equipamentos!E16","v":36},{"$f":"Moveis_Equipamentos!F16","v":0},0,{"$error":"#REF!"}]
["3.4",{"$f":"Moveis_Equipamentos!B17","v":"3671-ORSE/SE"},{"$f":"Moveis_Equipamentos!C17","v":"Desktop com software-tipo 1 (i7, 1T, 8GB, monitor 19\", S.O. Windows 10 e Office última versão)"},{"$f":"Moveis_Equipamentos!D17","v":"un"},{"$f":"Moveis_Equipamentos!E17","v":73},{"$f":"Moveis_Equipamentos!F17","v":0},0,{"$error":"#REF!"}]
["3.5",{"$f":"Moveis_Equipamentos!B18","v":"I6395-SEINFRA/CE"},{"$f":"Moveis_Equipamentos!C18","v":"Notebook-tipo 1 (i7, 1T, 8GB, S.O. Windows 10 e Office última versão)"},{"$f":"Moveis_Equipamentos!D18","v":"um"},{"$f":"Moveis_Equipamentos!E18","v":16},{"$f":"Moveis_Equipamentos!F18","v":0},0,{"$error":"#REF!"}]
["3.6",{"$f":"Moveis_Equipamentos!B19","v":"P.17.000.042561-CPOS/SP"},{"$f":"Moveis_Equipamentos!C19","v":"Antena externa"},{"$f":"Moveis_Equipamentos!D19","v":"un"},{"$f":"Moveis_Equipamentos!E19","v":1},{"$f":"Moveis_Equipamentos!F19","v":0},0,{"$error":"#REF!"}]
["3.7",{"$f":"Moveis_Equipamentos!B20","v":"AP_JANTAR"},{"$f":"Moveis_Equipamentos!C20","v":"Aparelho de jantar para 06 pessoas"},{"$f":"Moveis_Equipamentos!D20","v":"un"},{"$f":"Moveis_Equipamentos!E20","v":20},{"$f":"Moveis_Equipamentos!F20","v":0},0,{"$error":"#REF!"}]
["3.8",{"$f":"Moveis_Equipamentos!B21","v":"I0122-SEINFRA/CE"},{"$f":"Moveis_Equipamentos!C21","v":"Armário de cozinha completo"},{"$f":"Moveis_Equipamentos!D21","v":"un"},{"$f":"Moveis_Equipamentos!E21","v":3},{"$f":"Moveis_Equipamentos!F21","v":0},0,{"$error":"#REF!"}]
["3.9",{"$f":"Moveis_Equipamentos!B22","v":"I0123-SEINFRA/CE"},{"$f":"Moveis_Equipamentos!C22","v":"Armário de escritório"},{"$f":"Moveis_Equipamentos!D22","v":"un"},{"$f":"Moveis_Equipamentos!E22","v":11},{"$f":"Moveis_Equipamentos!F22","v":0},0,{"$error":"#REF!"}]
["3.10",{"$f":"Moveis_Equipamentos!B23","v":"11645-ORSE/SE"},{"$f":"Moveis_Equipamentos!C23","v":"Armário para vestiário, em aço, com 12 portas, com cadeado"},{"$f":"Moveis_Equipamentos!D23","v":"un"},{"$f":"Moveis_Equipamentos!E23","v":3},{"$f":"Moveis_Equipamentos!F23","v":0},0,{"$error":"#REF!"}]
["3.11",{"$f":"Moveis_Equipamentos!B24","v":"73.72.07-SUDECAP/MG"},{"$f":"Moveis_Equipamentos!C24","v":"Bebedouro industrial (canteiro)"},{"$f":"Moveis_Equipamentos!D24","v":"un"},{"$f":"Moveis_Equipamentos!E24","v":4},{"$f":"Moveis_Equipamentos!F24","v":0},0,{"$error":"#REF!"}]
["3.12",{"$f":"Moveis_Equipamentos!B25","v":"11534-ORSE/SE"},{"$f":"Moveis_Equipamentos!C25","v":"Cadeira giratória, com braço, tipo executiva"},{"$f":"Moveis_Equipamentos!D25","v":"un"},{"$f":"Moveis_Equipamentos!E25","v":89},{"$f":"Moveis_Equipamentos!F25","v":0},0,{"$error":"#REF!"}]
["3.13",{"$f":"Moveis_Equipamentos!B26","v":"11543-ORSE"},{"$f":"Moveis_Equipamentos!C26","v":"Cadeira de plástico sem braço, cor branca"},{"$f":"Moveis_Equipamentos!D26","v":"un"},{"$f":"Moveis_Equipamentos!E26","v":15},{"$f":"Moveis_Equipamentos!F26","v":0},0,{"$error":"#REF!"}]
["3.14",{"$f":"Moveis_Equipamentos!B27","v":"COT_CAMA_BOX"},{"$f":"Moveis_Equipamentos!C27","v":"Cama box solteiro"},{"$f":"Moveis_Equipamentos!D27","v":"un"},{"$f":"Moveis_Equipamentos!E27","v":25},{"$f":"Moveis_Equipamentos!F27","v":0},0,{"$error":"#REF!"}]
["3.15",{"$f":"Moveis_Equipamentos!B28","v":"COT_CAM_FOTO"},{"$f":"Moveis_Equipamentos!C28","v":"Câmera fotográfica digital"},{"$f":"Moveis_Equipamentos!D28","v":"un"},{"$f":"Moveis_Equipamentos!E28","v":3},{"$f":"Moveis_Equipamentos!F28","v":0},0,{"$error":"#REF!"}]
["3.16",{"$f":"Moveis_Equipamentos!B29","v":"DV_16-CAERN/RN"},{"$f":"Moveis_Equipamentos!C29","v":"Carrinhos de lixo"},{"$f":"Moveis_Equipamentos!D29","v":"un"},{"$f":"Moveis_Equipamentos!E29","v":7},{"$f":"Moveis_Equipamentos!F29","v":0},0,{"$error":"#REF!"}]
["3.17",{"$f":"Moveis_Equipamentos!B30","v":"\t040117-SBC/PE"},{"$f":"Moveis_Equipamentos!C30","v":"Cestos de lixo"},{"$f":"Moveis_Equipamentos!D30","v":"un"},{"$f":"Moveis_Equipamentos!E30","v":12},{"$f":"Moveis_Equipamentos!F30","v":0},0,{"$error":"#REF!"}]
["3.18",{"$f":"Moveis_Equipamentos!B31","v":"COT_CHAP"},{"$f":"Moveis_Equipamentos!C31","v":"Chapa gás para grelhar"},{"$f":"Moveis_Equipamentos!D31","v":"un"},{"$f":"Moveis_Equipamentos!E31","v":4},{"$f":"Moveis_Equipamentos!F31","v":0},0,{"$error":"#REF!"}]
["3.19",{"$f":"Moveis_Equipamentos!B32","v":"621-ORSE/SE"},{"$f":"Moveis_Equipamentos!C32","v":"Coifa"},{"$f":"Moveis_Equipamentos!D32","v":"un"},{"$f":"Moveis_Equipamentos!E32","v":4},{"$f":"Moveis_Equipamentos!F32","v":0},0,{"$error":"#REF!"}]
["3.20",{"$f":"Moveis_Equipamentos!B33","v":"39555-SINAPI/PE"},{"$f":"Moveis_Equipamentos!C33","v":"Condicionador de ar 12.000 BTU"},{"$f":"Moveis_Equipamentos!D33","v":"un"},{"$f":"Moveis_Equipamentos!E33","v":15},{"$f":"Moveis_Equipamentos!F33","v":0},0,{"$error":"#REF!"}]
["3.21",{"$f":"Moveis_Equipamentos!B34","v":"COT_MES_06"},{"$f":"Moveis_Equipamentos!C34","v":"Conjunto de Mesa com 06 lugares (para cozinha)"},{"$f":"Moveis_Equipamentos!D34","v":"un"},{"$f":"Moveis_Equipamentos!E34","v":4},{"$f":"Moveis_Equipamentos!F34","v":0},0,{"$error":"#REF!"}]
["3.22",{"$f":"Moveis_Equipamentos!B35","v":"COT_UTENS"},{"$f":"Moveis_Equipamentos!C35","v":"Conjunto de utensílios para cozinha"},{"$f":"Moveis_Equipamentos!D35","v":"conj."},{"$f":"Moveis_Equipamentos!E35","v":3},{"$f":"Moveis_Equipamentos!F35","v":0},0,{"$error":"#REF!"}]
["3.23",{"$f":"Moveis_Equipamentos!B36","v":"COT_FAQUEI"},{"$f":"Moveis_Equipamentos!C36","v":"Faqueiro com 24 peças"},{"$f":"Moveis_Equipamentos!D36","v":"un"},{"$f":"Moveis_Equipamentos!E36","v":17},{"$f":"Moveis_Equipamentos!F36","v":0},0,{"$error":"#REF!"}]
["3.24",{"$f":"Moveis_Equipamentos!B37","v":"10231-ORSE/SE"},{"$f":"Moveis_Equipamentos!C37","v":"Fogão "},{"$f":"Moveis_Equipamentos!D37","v":"un"},{"$f":"Moveis_Equipamentos!E37","v":3},{"$f":"Moveis_Equipamentos!F37","v":0},0,{"$error":"#REF!"}]
["3.25",{"$f":"Moveis_Equipamentos!B38","v":"78052-SIURB/SP"},{"$f":"Moveis_Equipamentos!C38","v":"Fogão industrial 6 bocas "},{"$f":"Moveis_Equipamentos!D38","v":"un"},{"$f":"Moveis_Equipamentos!E38","v":3},{"$f":"Moveis_Equipamentos!F38","v":0},0,{"$error":"#REF!"}]
["3.26",{"$f":"Moveis_Equipamentos!B39","v":"COT_FORNO"},{"$f":"Moveis_Equipamentos!C39","v":"Forno elétrico"},{"$f":"Moveis_Equipamentos!D39","v":"un"},{"$f":"Moveis_Equipamentos!E39","v":3},{"$f":"Moveis_Equipamentos!F39","v":0},0,{"$error":"#REF!"}]
["3.27",{"$f":"Moveis_Equipamentos!B40","v":"COT_MICROOND"},{"$f":"Moveis_Equipamentos!C40","v":"Forno Microondas"},{"$f":"Moveis_Equipamentos!D40","v":"un"},{"$f":"Moveis_Equipamentos!E40","v":3},{"$f":"Moveis_Equipamentos!F40","v":0},0,{"$error":"#REF!"}]
["3.28",{"$f":"Moveis_Equipamentos!B41","v":"F020000719-EMBASA/BA"},{"$f":"Moveis_Equipamentos!C41","v":"Freezer 246 l"},{"$f":"Moveis_Equipamentos!D41","v":"un"},{"$f":"Moveis_Equipamentos!E41","v":1},{"$f":"Moveis_Equipamentos!F41","v":0},0,{"$error":"#REF!"}]
["3.29",{"$f":"Moveis_Equipamentos!B42","v":"029028-IOPES"},{"$f":"Moveis_Equipamentos!C42","v":"Cilindro de Gás de Cozinha 45 kg"},{"$f":"Moveis_Equipamentos!D42","v":"un"},{"$f":"Moveis_Equipamentos!E42","v":7},{"$f":"Moveis_Equipamentos!F42","v":0},0,{"$error":"#REF!"}]
["3.30",{"$f":"Moveis_Equipamentos!B43","v":"4226-SINAPI/PE"},{"$f":"Moveis_Equipamentos!C43","v":"Gás de cozinha-GLP"},{"$f":"Moveis_Equipamentos!D43","v":"kg"},{"$f":"Moveis_Equipamentos!E43","v":3780},{"$f":"Moveis_Equipamentos!F43","v":0},0,{"$error":"#REF!"}]
["3.31",{"$f":"Moveis_Equipamentos!B44","v":"F020000716-EMBASA/BA"},{"$f":"Moveis_Equipamentos!C44","v":"Geladeira 280 litros"},{"$f":"Moveis_Equipamentos!D44","v":"un"},{"$f":"Moveis_Equipamentos!E44","v":3},{"$f":"Moveis_Equipamentos!F44","v":0},0,{"$error":"#REF!"}]
["3.32",{"$f":"Moveis_Equipamentos!B45","v":"\t10232-ORSE/SE"},{"$f":"Moveis_Equipamentos!C45","v":"Geladeira industrial 300 litros"},{"$f":"Moveis_Equipamentos!D45","v":"un"},{"$f":"Moveis_Equipamentos!E45","v":3},{"$f":"Moveis_Equipamentos!F45","v":0},0,{"$error":"#REF!"}]
["3.33",{"$f":"Moveis_Equipamentos!B46","v":"COT_GPS"},{"$f":"Moveis_Equipamentos!C46","v":"GPS com cabo e software (conforme especificação)"},{"$f":"Moveis_Equipamentos!D46","v":"un"},{"$f":"Moveis_Equipamentos!E46","v":3},{"$f":"Moveis_Equipamentos!F46","v":0},0,{"$error":"#REF!"}]
["3.34",{"$f":"Moveis_Equipamentos!B47","v":"COT_GUARDA_ROUPA"},{"$f":"Moveis_Equipamentos!C47","v":"Guarda-Roupa 4 Portas"},{"$f":"Moveis_Equipamentos!D47","v":"un"},{"$f":"Moveis_Equipamentos!E47","v":2},{"$f":"Moveis_Equipamentos!F47","v":0},0,{"$error":"#REF!"}]
["3.35",{"$f":"Moveis_Equipamentos!B48","v":"COT_COPO"},{"$f":"Moveis_Equipamentos!C48","v":"Conjunto  copos em vidro com 8 unidades"},{"$f":"Moveis_Equipamentos!D48","v":"un"},{"$f":"Moveis_Equipamentos!E48","v":50},{"$f":"Moveis_Equipamentos!F48","v":0},0,{"$error":"#REF!"}]
["3.36",{"$f":"Moveis_Equipamentos!B49","v":"COT_PANEL"},{"$f":"Moveis_Equipamentos!C49","v":"Conjunto de panelas com 7 peças"},{"$f":"Moveis_Equipamentos!D49","v":"un"},{"$f":"Moveis_Equipamentos!E49","v":4},{"$f":"Moveis_Equipamentos!F49","v":0},0,{"$error":"#REF!"}]
["3.37",{"$f":"Moveis_Equipamentos!B50","v":"COT_ROUPA_BANHO"},{"$f":"Moveis_Equipamentos!C50","v":"Jogo de Roupa de banho 5 Peças"},{"$f":"Moveis_Equipamentos!D50","v":"un"},{"$f":"Moveis_Equipamentos!E50","v":25},{"$f":"Moveis_Equipamentos!F50","v":0},0,{"$error":"#REF!"}]
["3.38",{"$f":"Moveis_Equipamentos!B51","v":"COT_ROUPA_CAMA"},{"$f":"Moveis_Equipamentos!C51","v":"Jogo de roupa de cama solteiro"},{"$f":"Moveis_Equipamentos!D51","v":"un"},{"$f":"Moveis_Equipamentos!E51","v":50},{"$f":"Moveis_Equipamentos!F51","v":0},0,{"$error":"#REF!"}]
["3.39",{"$f":"Moveis_Equipamentos!B52","v":"COT_SOFA"},{"$f":"Moveis_Equipamentos!C52","v":"Conjunto de sofá 2 e 3 lugares"},{"$f":"Moveis_Equipamentos!D52","v":"un"},{"$f":"Moveis_Equipamentos!E52","v":5},{"$f":"Moveis_Equipamentos!F52","v":0},0,{"$error":"#REF!"}]
["3.40",{"$f":"Moveis_Equipamentos!B53","v":"COT_LIQUID"},{"$f":"Moveis_Equipamentos!C53","v":"Liquidificadores industriais"},{"$f":"Moveis_Equipamentos!D53","v":"un"},{"$f":"Moveis_Equipamentos!E53","v":4},{"$f":"Moveis_Equipamentos!F53","v":0},0,{"$error":"#REF!"}]
["3.41",{"$f":"Moveis_Equipamentos!B54","v":"COT_MAQ_LAVA_LOUCA"},{"$f":"Moveis_Equipamentos!C54","v":"Máquina de lavar louças industrial"},{"$f":"Moveis_Equipamentos!D54","v":"un"},{"$f":"Moveis_Equipamentos!E54","v":3},{"$f":"Moveis_Equipamentos!F54","v":0},0,{"$error":"#REF!"}]
["3.42",{"$f":"Moveis_Equipamentos!B55","v":"COT_MAQ_LAVA_ROUPA"},{"$f":"Moveis_Equipamentos!C55","v":"Máquina de Lavar roupa 11kg"},{"$f":"Moveis_Equipamentos!D55","v":"un"},{"$f":"Moveis_Equipamentos!E55","v":3},{"$f":"Moveis_Equipamentos!F55","v":0},0,{"$error":"#REF!"}]
["3.43",{"$f":"Moveis_Equipamentos!B56","v":"COT_MESA_BUF"},{"$f":"Moveis_Equipamentos!C56","v":"Mesa buffets"},{"$f":"Moveis_Equipamentos!D56","v":"un"},{"$f":"Moveis_Equipamentos!E56","v":5},{"$f":"Moveis_Equipamentos!F56","v":0},0,{"$error":"#REF!"}]
["3.44",{"$f":"Moveis_Equipamentos!B57","v":"COT_MESA_REFEIT"},{"$f":"Moveis_Equipamentos!C57","v":"Mesa de refeitório 10 lugares com cadeiras"},{"$f":"Moveis_Equipamentos!D57","v":"un"},{"$f":"Moveis_Equipamentos!E57","v":20},{"$f":"Moveis_Equipamentos!F57","v":0},0,{"$error":"#REF!"}]
["3.45",{"$f":"Moveis_Equipamentos!B58","v":"COT_MESA_REUN"},{"$f":"Moveis_Equipamentos!C58","v":"Mesa de reunião 10 lugares com 10 cadeiras"},{"$f":"Moveis_Equipamentos!D58","v":"un"},{"$f":"Moveis_Equipamentos!E58","v":3},{"$f":"Moveis_Equipamentos!F58","v":0},0,{"$error":"#REF!"}]
["3.46",{"$f":"Moveis_Equipamentos!B59","v":"COT_MESA_PVC"},{"$f":"Moveis_Equipamentos!C59","v":"Mesa retangular em PVC"},{"$f":"Moveis_Equipamentos!D59","v":"un"},{"$f":"Moveis_Equipamentos!E59","v":3},{"$f":"Moveis_Equipamentos!F59","v":0},0,{"$error":"#REF!"}]
["3.47",{"$f":"Moveis_Equipamentos!B60","v":"COT_MESA_ESCR"},{"$f":"Moveis_Equipamentos!C60","v":"Mesas de escritório com gavetas (conforme especificação)"},{"$f":"Moveis_Equipamentos!D60","v":"un"},{"$f":"Moveis_Equipamentos!E60","v":89},{"$f":"Moveis_Equipamentos!F60","v":0},0,{"$error":"#REF!"}]
["3.48",{"$f":"Moveis_Equipamentos!B61","v":"COT_PRATO"},{"$f":"Moveis_Equipamentos!C61","v":"Pratos rasos"},{"$f":"Moveis_Equipamentos!D61","v":"un"},{"$f":"Moveis_Equipamentos!E61","v":300},{"$f":"Moveis_Equipamentos!F61","v":0},0,{"$error":"#REF!"}]
["3.49",{"$f":"Moveis_Equipamentos!B62","v":"F030000293-EMBASA/BA"},{"$f":"Moveis_Equipamentos!C62","v":"Projetor multimídia (Datashow)"},{"$f":"Moveis_Equipamentos!D62","v":"un"},{"$f":"Moveis_Equipamentos!E62","v":3},{"$f":"Moveis_Equipamentos!F62","v":0},0,{"$error":"#REF!"}]
["3.50",{"$f":"Moveis_Equipamentos!B63","v":"COT_RACK"},{"$f":"Moveis_Equipamentos!C63","v":"Rack (sala)"},{"$f":"Moveis_Equipamentos!D63","v":"un"},{"$f":"Moveis_Equipamentos!E63","v":3},{"$f":"Moveis_Equipamentos!F63","v":0},0,{"$error":"#REF!"}]
["3.51",{"$f":"Moveis_Equipamentos!B64","v":"COT_REFRESQUEIRA"},{"$f":"Moveis_Equipamentos!C64","v":"Refresqueira"},{"$f":"Moveis_Equipamentos!D64","v":"un"},{"$f":"Moveis_Equipamentos!E64","v":4},{"$f":"Moveis_Equipamentos!F64","v":0},0,{"$error":"#REF!"}]
["3.52",{"$f":"Moveis_Equipamentos!B65","v":"COT_TABUA"},{"$f":"Moveis_Equipamentos!C65","v":"Tábuas para carnes"},{"$f":"Moveis_Equipamentos!D65","v":"un"},{"$f":"Moveis_Equipamentos!E65","v":4},{"$f":"Moveis_Equipamentos!F65","v":0},0,{"$error":"#REF!"}]
["3.53",{"$f":"Moveis_Equipamentos!B66","v":"COT_TELEVISOR"},{"$f":"Moveis_Equipamentos!C66","v":"Televisor LCD com 27,5\""},{"$f":"Moveis_Equipamentos!D66","v":"un"},{"$f":"Moveis_Equipamentos!E66","v":3},{"$f":"Moveis_Equipamentos!F66","v":0},{"$f":"ROUND(E107*F107,2)","v":0},{"$f":"ROUND(G107/G$8,4)","v":{"$error":"#REF!"}}]
[]
["4.",null,{"$f":"Mao_de_Obra!C13","v":"EQUIPE - MÃO DE OBRA"},null,null,null,{"$f":"SUBTOTAL(109,G110:G170)","v":0},{"$f":"ROUND(G109/G$8,4)","v":{"$error":"#REF!"}}]
["4.1",{"$f":"Mao_de_Obra!B14","v":"P0"},{"$f":"Mao_de_Obra!C14","v":"Coordenador - Engenheiro Sênior (Civil / Eletricista / Mecânico) - Esp. Manutenção Sist Abast/Ger"},{"$f":"Mao_de_Obra!D14","v":"homem x mês"},{"$f":"Mao_de_Obra!E14","v":12},{"$f":"Mao_de_Obra!F14","v":0},{"$f":"ROUND(E110*F110,2)","v":0},{"$error":"#REF!"}]
["4.2",{"$f":"Mao_de_Obra!B15","v":"A1"},{"$f":"Mao_de_Obra!C15","v":"Assistente Administrativo"},{"$f":"Mao_de_Obra!D15","v":"homem x mês"},{"$f":"Mao_de_Obra!E15","v":12},{"$f":"Mao_de_Obra!F15","v":0},{"$f":"ROUND(E111*F111,2)","v":0},{"$error":"#REF!"}]
["4.3",{"$f":"Mao_de_Obra!B16","v":"A3"},{"$f":"Mao_de_Obra!C16","v":"Auxiliar Administrativo"},{"$f":"Mao_de_Obra!D16","v":"homem x mês"},{"$f":"Mao_de_Obra!E16","v":48},{"$f":"Mao_de_Obra!F16","v":0},0,{"$error":"#REF!"}]
["4.4",{"$f":"Mao_de_Obra!B17","v":"P1"},{"$f":"Mao_de_Obra!C17","v":"Coordenador Operação - Engenheiro Sênior (Civil / Eletricista / Mecânico) - Esp. Manutenção Sist Abast/Ger"},{"$f":"Mao_de_Obra!D17","v":"homem x mês"},{"$f":"Mao_de_Obra!E17","v":12},{"$f":"Mao_de_Obra!F17","v":0},0,{"$error":"#REF!"}]
["4.5",{"$f":"Mao_de_Obra!B18","v":"P1"},{"$f":"Mao_de_Obra!C18","v":"Coordenador Manutenção - Engenheiro Sênior (Civil / Eletricista / Mecânico) - Esp. Manutenção Sist Abast/Ger"},{"$f":"Mao_de_Obra!D18","v":"homem x mês"},{"$f":"Mao_de_Obra!E18","v":12},{"$f":"Mao_de_Obra!F18","v":0},0,{"$error":"#REF!"}]
["4.6",{"$f":"Mao_de_Obra!B19","v":"AS"},{"$f":"Mao_de_Obra!C19","v":"Coordenador - Chefe de Escritório"},{"$f":"Mao_de_Obra!D19","v":"homem x mês"},{"$f":"Mao_de_Obra!E19","v":12},{"$f":"Mao_de_Obra!F19","v":0},0,{"$error":"#REF!"}]
["4.7",{"$f":"Mao_de_Obra!B20","v":"T1"},{"$f":"Mao_de_Obra!C20","v":"Técnico Pleno - Analista em Tecnologia da Informação"},{"$f":"Mao_de_Obra!D20","v":"homem x mês"},{"$f":"Mao_de_Obra!E20","v":12},{"$f":"Mao_de_Obra!F20","v":0},0,{"$error":"#REF!"}]
["4.8",{"$f":"Mao_de_Obra!B21","v":"A3"},{"$f":"Mao_de_Obra!C21","v":"Motorista"},{"$f":"Mao_de_Obra!D21","v":"homem x mês"},{"$f":"Mao_de_Obra!E21","v":60},{"$f":"Mao_de_Obra!F21","v":0},0,{"$error":"#REF!"}]
["4.9",{"$f":"Mao_de_Obra!B22","v":"A1"},{"$f":"Mao_de_Obra!C22","v":"Almoxarife"},{"$f":"Mao_de_Obra!D22","v":"homem x mês"},{"$f":"Mao_de_Obra!E22","v":12},{"$f":"Mao_de_Obra!F22","v":0},0,{"$error":"#REF!"}]
["4.10",{"$f":"Mao_de_Obra!B23","v":"A3"},{"$f":"Mao_de_Obra!C23","v":"Auxiliar de Almoxarifado"},{"$f":"Mao_de_Obra!D23","v":"homem x mês"},{"$f":"Mao_de_Obra!E23","v":36},{"$f":"Mao_de_Obra!F23","v":0},0,{"$error":"#REF!"}]
["4.11",{"$f":"Mao_de_Obra!B24","v":"A4"},{"$f":"Mao_de_Obra!C24","v":"Servente"},{"$f":"Mao_de_Obra!D24","v":"homem x mês"},{"$f":"Mao_de_Obra!E24","v":144},{"$f":"Mao_de_Obra!F24","v":0},0,{"$error":"#REF!"}]
["4.12",{"$f":"Mao_de_Obra!B25","v":"P1"},{"$f":"Mao_de_Obra!C25","v":"Engenheiro de Segurança e Medicina do Trabalho"},{"$f":"Mao_de_Obra!D25","v":"homem x mês"},{"$f":"Mao_de_Obra!E25","v":12},{"$f":"Mao_de_Obra!F25","v":0},0,{"$error":"#REF!"}]
["4.13",{"$f":"Mao_de_Obra!B26","v":"T2"},{"$f":"Mao_de_Obra!C26","v":"Técnico de Segurança e Medicina do Trabalho"},{"$f":"Mao_de_Obra!D26","v":"homem x mês"},{"$f":"Mao_de_Obra!E26","v":24},{"$f":"Mao_de_Obra!F26","v":0},0,{"$error":"#REF!"}]
["4.14",{"$f":"Mao_de_Obra!B27","v":"P1"},{"$f":"Mao_de_Obra!C27","v":"Médico do Trabalho"},{"$f":"Mao_de_Obra!D27","v":"homem x mês"},{"$f":"Mao_de_Obra!E27","v":12},{"$f":"Mao_de_Obra!F27","v":0},0,{"$error":"#REF!"}]
["4.15",{"$f":"Mao_de_Obra!B28","v":"P1"},{"$f":"Mao_de_Obra!C28","v":"Engenheiro Pleno - Civil - Especialista em Hidráulica"},{"$f":"Mao_de_Obra!D28","v":"homem x mês"},{"$f":"Mao_de_Obra!E28","v":12},{"$f":"Mao_de_Obra!F28","v":0},0,{"$error":"#REF!"}]
["4.16",{"$f":"Mao_de_Obra!B29","v":"P1"},{"$f":"Mao_de_Obra!C29","v":"Engenheiro Pleno - Civil - Especialista em Hidrologia"},{"$f":"Mao_de_Obra!D29","v":"homem x mês"},{"$f":"Mao_de_Obra!E29","v":12},{"$f":"Mao_de_Obra!F29","v":0},0,{"$error":"#REF!"}]
["4.17",{"$f":"Mao_de_Obra!B30","v":"P3"},{"$f":"Mao_de_Obra!C30","v":"Engenheiro Junior - Civil"},{"$f":"Mao_de_Obra!D30","v":"homem x mês"},{"$f":"Mao_de_Obra!E30","v":12},{"$f":"Mao_de_Obra!F30","v":0},0,{"$error":"#REF!"}]
["4.18",{"$f":"Mao_de_Obra!B31","v":"P1"},{"$f":"Mao_de_Obra!C31","v":"Engenheiro Pleno - Eletricista"},{"$f":"Mao_de_Obra!D31","v":"homem x mês"},{"$f":"Mao_de_Obra!E31","v":12},{"$f":"Mao_de_Obra!F31","v":0},0,{"$error":"#REF!"}]
["4.19",{"$f":"Mao_de_Obra!B32","v":"P1"},{"$f":"Mao_de_Obra!C32","v":"Engenheiro Pleno - Eletricista - Especialista em Equipamentos e Sistemas Elétricos"},{"$f":"Mao_de_Obra!D32","v":"homem x mês"},{"$f":"Mao_de_Obra!E32","v":12},{"$f":"Mao_de_Obra!F32","v":0},0,{"$error":"#REF!"}]
["4.20",{"$f":"Mao_de_Obra!B33","v":"P1"},{"$f":"Mao_de_Obra!C33","v":"Engenheiro Pleno - Eletricista - Especialista em Subestação Pátio, L. Transmissão e L. Distribuição"},{"$f":"Mao_de_Obra!D33","v":"homem x mês"},{"$f":"Mao_de_Obra!E33","v":12},{"$f":"Mao_de_Obra!F33","v":0},0,{"$error":"#REF!"}]
["4.21",{"$f":"Mao_de_Obra!B34","v":"P1"},{"$f":"Mao_de_Obra!C34","v":"Engenheiro Pleno - Eletricista - Especialista em Sistema de Proteção, Controle e Supervisão (SPCS)"},{"$f":"Mao_de_Obra!D34","v":"homem x mês"},{"$f":"Mao_de_Obra!E34","v":12},{"$f":"Mao_de_Obra!F34","v":0},0,{"$error":"#REF!"}]
["4.22",{"$f":"Mao_de_Obra!B35","v":"P1"},{"$f":"Mao_de_Obra!C35","v":"Engenheiro Pleno - Mecânico"},{"$f":"Mao_de_Obra!D35","v":"homem x mês"},{"$f":"Mao_de_Obra!E35","v":12},{"$f":"Mao_de_Obra!F35","v":0},0,{"$error":"#REF!"}]
["4.23",{"$f":"Mao_de_Obra!B36","v":"P1"},{"$f":"Mao_de_Obra!C36","v":"Engenheiro Pleno - Civil"},{"$f":"Mao_de_Obra!D36","v":"homem x mês"},{"$f":"Mao_de_Obra!E36","v":12},{"$f":"Mao_de_Obra!F36","v":0},0,{"$error":"#REF!"}]
["4.24",{"$f":"Mao_de_Obra!B37","v":"P1"},{"$f":"Mao_de_Obra!C37","v":"Engenheiro Pleno - Mecatrônica - Especialista em Automação"},{"$f":"Mao_de_Obra!D37","v":"homem x mês"},{"$f":"Mao_de_Obra!E37","v":12},{"$f":"Mao_de_Obra!F37","v":0},0,{"$error":"#REF!"}]
["4.25",{"$f":"Mao_de_Obra!B38","v":"P1"},{"$f":"Mao_de_Obra!C38","v":"Engenheiro Pleno - Telecomunicações"},{"$f":"Mao_de_Obra!D38","v":"homem x mês"},{"$f":"Mao_de_Obra!E38","v":12},{"$f":"Mao_de_Obra!F38","v":0},0,{"$error":"#REF!"}]
["4.26",{"$f":"Mao_de_Obra!B39","v":"T1"},{"$f":"Mao_de_Obra!C39","v":"Técnico Pleno - Manutenção Elétrica -  Especialista em Equipamentos e Sistemas Elétricos"},{"$f":"Mao_de_Obra!D39","v":"homem x mês"},{"$f":"Mao_de_Obra!E39","v":12},{"$f":"Mao_de_Obra!F39","v":0},0,{"$error":"#REF!"}]
["4.27",{"$f":"Mao_de_Obra!B40","v":"T1"},{"$f":"Mao_de_Obra!C40","v":"Técnico Pleno - Manutenção Elétrica -  Especialista em Subestação Pátio, L. Transmissão e L. Distribuição"},{"$f":"Mao_de_Obra!D40","v":"homem x mês"},{"$f":"Mao_de_Obra!E40","v":12},{"$f":"Mao_de_Obra!F40","v":0},0,{"$error":"#REF!"}]
["4.28",{"$f":"Mao_de_Obra!B41","v":"T1"},{"$f":"Mao_de_Obra!C41","v":"Técnico Pleno - Manutenção Elétrica -  Especialista em Sistema de Proteção, Controle e Supervisão (SPCS)"},{"$f":"Mao_de_Obra!D41","v":"homem x mês"},{"$f":"Mao_de_Obra!E41","v":12},{"$f":"Mao_de_Obra!F41","v":0},0,{"$error":"#REF!"}]
["4.29",{"$f":"Mao_de_Obra!B42","v":"T1"},{"$f":"Mao_de_Obra!C42","v":"Técnico Pleno - Manutenção Mecânica"},{"$f":"Mao_de_Obra!D42","v":"homem x mês"},{"$f":"Mao_de_Obra!E42","v":12},{"$f":"Mao_de_Obra!F42","v":0},0,{"$error":"#REF!"}]
["4.30",{"$f":"Mao_de_Obra!B43","v":"T1"},{"$f":"Mao_de_Obra!C43","v":"Técnico Pleno - Manutenção Civil"},{"$f":"Mao_de_Obra!D43","v":"homem x mês"},{"$f":"Mao_de_Obra!E43","v":12},{"$f":"Mao_de_Obra!F43","v":0},0,{"$error":"#REF!"}]
["4.31",{"$f":"Mao_de_Obra!B44","v":"P1"},{"$f":"Mao_de_Obra!C44","v":"Geólogo  (Geotecnia)"},{"$f":"Mao_de_Obra!D44","v":"homem x mês"},{"$f":"Mao_de_Obra!E44","v":12},{"$f":"Mao_de_Obra!F44","v":0},0,{"$error":"#REF!"}]
["4.32",{"$f":"Mao_de_Obra!B45","v":"T1"},{"$f":"Mao_de_Obra!C45","v":"Técnico Pleno - Eletrotécnico - Operador Estação de Bombeamento - Diurno (inclusive adicional de periculosidade)"},{"$f":"Mao_de_Obra!D45","v":"homem x mês"},{"$f":"Mao_de_Obra!E45","v":216},{"$f":"Mao_de_Obra!F45","v":0},0,{"$error":"#REF!"}]
["4.33",{"$f":"Mao_de_Obra!B46","v":"T1"},{"$f":"Mao_de_Obra!C46","v":"Técnico Pleno - Eletrotécnico - Operador Estação de Bombeamento - Noturno (inclusive adicional de periculosidade)"},{"$f":"Mao_de_Obra!D46","v":"homem x mês"},{"$f":"Mao_de_Obra!E46","v":216},{"$f":"Mao_de_Obra!F46","v":0},0,{"$error":"#REF!"}]
["4.34",{"$f":"Mao_de_Obra!B47","v":"T2"},{"$f":"Mao_de_Obra!C47","v":"Técnico Junior - Mecânico - Operador Estação de Bombeamento - Diurno (inclusive adicional de periculosidade)"},{"$f":"Mao_de_Obra!D47","v":"homem x mês"},{"$f":"Mao_de_Obra!E47","v":216},{"$f":"Mao_de_Obra!F47","v":0},0,{"$error":"#REF!"}]
["4.35",{"$f":"Mao_de_Obra!B48","v":"T2"},{"$f":"Mao_de_Obra!C48","v":"Técnico Junior - Mecânico - Operador Estação de Bombeamento - Noturno (inclusive adicional de periculosidade)"},{"$f":"Mao_de_Obra!D48","v":"homem x mês"},{"$f":"Mao_de_Obra!E48","v":216},{"$f":"Mao_de_Obra!F48","v":0},0,{"$error":"#REF!"}]
["4.36",{"$f":"Mao_de_Obra!B49","v":"T1"},{"$f":"Mao_de_Obra!C49","v":"Técnico Pleno - Eletrotécnico - Operador Subestação - Diurno (inclusive adicional de periculosidade)"},{"$f":"Mao_de_Obra!D49","v":"homem x mês"},{"$f":"Mao_de_Obra!E49","v":216},{"$f":"Mao_de_Obra!F49","v":0},0,{"$error":"#REF!"}]
["4.37",{"$f":"Mao_de_Obra!B50","v":"T1"},{"$f":"Mao_de_Obra!C50","v":"Técnico Pleno - Eletrotécnico - Operador Subestação - Noturno (inclusive adicional de periculosidade)"},{"$f":"Mao_de_Obra!D50","v":"homem x mês"},{"$f":"Mao_de_Obra!E50","v":216},{"$f":"Mao_de_Obra!F50","v":0},0,{"$error":"#REF!"}]
["4.38",{"$f":"Mao_de_Obra!B51","v":"T2"},{"$f":"Mao_de_Obra!C51","v":"Técnico Junior - Eletrotécnico - Operador Subestação - Diurno (inclusive adicional de periculosidade)"},{"$f":"Mao_de_Obra!D51","v":"homem x mês"},{"$f":"Mao_de_Obra!E51","v":216},{"$f":"Mao_de_Obra!F51","v":0},0,{"$error":"#REF!"}]
["4.39",{"$f":"Mao_de_Obra!B52","v":"T2"},{"$f":"Mao_de_Obra!C52","v":"Técnico Junior - Eletrotécnico - Operador Subestação - Noturno (inclusive adicional de periculosidade)"},{"$f":"Mao_de_Obra!D52","v":"homem x mês"},{"$f":"Mao_de_Obra!E52","v":216},{"$f":"Mao_de_Obra!F52","v":0},0,{"$error":"#REF!"}]
["4.40",{"$f":"Mao_de_Obra!B53","v":"T3"},{"$f":"Mao_de_Obra!C53","v":"Técnico Auxiliar (inclusive adicional de periculosidade)"},{"$f":"Mao_de_Obra!D53","v":"homem x mês"},{"$f":"Mao_de_Obra!E53","v":204},{"$f":"Mao_de_Obra!F53","v":0},0,{"$error":"#REF!"}]
["4.41",{"$f":"Mao_de_Obra!B54","v":"T3"},{"$f":"Mao_de_Obra!C54","v":"Técnico Auxiliar - Leiturista (inclusive adicional de periculosidade)"},{"$f":"Mao_de_Obra!D54","v":"homem x mês"},{"$f":"Mao_de_Obra!E54","v":48},{"$f":"Mao_de_Obra!F54","v":0},0,{"$error":"#REF!"}]
["4.42",{"$f":"Mao_de_Obra!B55","v":"T1"},{"$f":"Mao_de_Obra!C55","v":"Técnico Pleno - Mecânico (inclusive adicional de periculosidade)"},{"$f":"Mao_de_Obra!D55","v":"homem x mês"},{"$f":"Mao_de_Obra!E55","v":36},{"$f":"Mao_de_Obra!F55","v":0},0,{"$error":"#REF!"}]
["4.43",{"$f":"Mao_de_Obra!B56","v":"T3"},{"$f":"Mao_de_Obra!C56","v":"Técnico Auxiliar - Mecânico (inclusive adicional de periculosidade)"},{"$f":"Mao_de_Obra!D56","v":"homem x mês"},{"$f":"Mao_de_Obra!E56","v":48},{"$f":"Mao_de_Obra!F56","v":0},0,{"$error":"#REF!"}]
["4.44",{"$f":"Mao_de_Obra!B57","v":"T1"},{"$f":"Mao_de_Obra!C57","v":"Técnico Pleno - Eletrotécnico - Especialista em Baixa e Média Tensão (inclusive adicional de periculosidade)"},{"$f":"Mao_de_Obra!D57","v":"homem x mês"},{"$f":"Mao_de_Obra!E57","v":36},{"$f":"Mao_de_Obra!F57","v":0},0,{"$error":"#REF!"}]
["4.45",{"$f":"Mao_de_Obra!B58","v":"T1"},{"$f":"Mao_de_Obra!C58","v":"Eletrotécnico - Especialista Subestação 230 Kv (inclusive adicional de periculosidade)"},{"$f":"Mao_de_Obra!D58","v":"homem x mês"},{"$f":"Mao_de_Obra!E58","v":12},{"$f":"Mao_de_Obra!F58","v":0},0,{"$error":"#REF!"}]
["4.46",{"$f":"Mao_de_Obra!B59","v":"T3"},{"$f":"Mao_de_Obra!C59","v":"Eletricista (inclusive adicional de periculosidade)"},{"$f":"Mao_de_Obra!D59","v":"homem x mês"},{"$f":"Mao_de_Obra!E59","v":60},{"$f":"Mao_de_Obra!F59","v":0},0,{"$error":"#REF!"}]
["4.47",{"$f":"Mao_de_Obra!B60","v":"T1"},{"$f":"Mao_de_Obra!C60","v":"Eletrotécnico - Especialista Inspeção em Linha de Transmissão 230 / 269 Kv (inclusive adicional de periculosidade)"},{"$f":"Mao_de_Obra!D60","v":"homem x mês"},{"$f":"Mao_de_Obra!E60","v":12},{"$f":"Mao_de_Obra!F60","v":0},{"$f":"ROUND(E156*F156,2)","v":0},{"$f":"ROUND(G156/G$8,4)","v":{"$error":"#REF!"}}]
["4.48",{"$f":"Mao_de_Obra!B61","v":"T4"},{"$f":"Mao_de_Obra!C61","v":"Auxiliar Eletrotécnico (inclusive adicional de periculosidade)"},{"$f":"Mao_de_Obra!D61","v":"homem x mês"},{"$f":"Mao_de_Obra!E61","v":12},{"$f":"Mao_de_Obra!F61","v":0},0,{"$error":"#REF!"}]
["4.49",{"$f":"Mao_de_Obra!B62","v":"T1"},{"$f":"Mao_de_Obra!C62","v":"Eletrotécnico - Especialista em Linha de Distribuição 13,8 Kv (inclusive adicional de periculosidade)"},{"$f":"Mao_de_Obra!D62","v":"homem x mês"},{"$f":"Mao_de_Obra!E62","v":12},{"$f":"Mao_de_Obra!F62","v":0},0,{"$error":"#REF!"}]
["4.50",{"$f":"Mao_de_Obra!B63","v":"T1"},{"$f":"Mao_de_Obra!C63","v":"Técnico Automação - Especialista em SDSC (inclusive adicional de periculosidade)"},{"$f":"Mao_de_Obra!D63","v":"homem x mês"},{"$f":"Mao_de_Obra!E63","v":36},{"$f":"Mao_de_Obra!F63","v":0},0,{"$error":"#REF!"}]
["4.51",{"$f":"Mao_de_Obra!B64","v":"T1"},{"$f":"Mao_de_Obra!C64","v":"Eletrotécnico - Especialista em SPCS (inclusive adicional de periculosidade)"},{"$f":"Mao_de_Obra!D64","v":"homem x mês"},{"$f":"Mao_de_Obra!E64","v":12},{"$f":"Mao_de_Obra!F64","v":0},0,{"$error":"#REF!"}]
["4.52",{"$f":"Mao_de_Obra!B65","v":"T1"},{"$f":"Mao_de_Obra!C65","v":"Técnico Telecomunicações/Eletrônica (inclusive adicional de periculosidade)"},{"$f":"Mao_de_Obra!D65","v":"homem x mês"},{"$f":"Mao_de_Obra!E65","v":12},{"$f":"Mao_de_Obra!F65","v":0},0,{"$error":"#REF!"}]
["4.53",{"$f":"Mao_de_Obra!B66","v":"T1"},{"$f":"Mao_de_Obra!C66","v":"Técnico Pleno - Encarregado de Campo (inclusive adicional de periculosidade)"},{"$f":"Mao_de_Obra!D66","v":"homem x mês"},{"$f":"Mao_de_Obra!E66","v":36},{"$f":"Mao_de_Obra!F66","v":0},0,{"$error":"#REF!"}]
["4.54",{"$f":"Mao_de_Obra!B67","v":"T2"},{"$f":"Mao_de_Obra!C67","v":"Tecnico Edificações - Inspeção (inclusive adicional de periculosidade)"},{"$f":"Mao_de_Obra!D67","v":"homem x mês"},{"$f":"Mao_de_Obra!E67","v":36},{"$f":"Mao_de_Obra!F67","v":0},0,{"$error":"#REF!"}]
["4.55",{"$f":"Mao_de_Obra!B68","v":"T2"},{"$f":"Mao_de_Obra!C68","v":"Técnico Junior - Cadista"},{"$f":"Mao_de_Obra!D68","v":"homem x mês"},{"$f":"Mao_de_Obra!E68","v":36},{"$f":"Mao_de_Obra!F68","v":0},0,{"$error":"#REF!"}]
["4.56",{"$f":"Mao_de_Obra!B69","v":"T1"},{"$f":"Mao_de_Obra!C69","v":"Topógrafo (inclusive adicional de periculosidade)"},{"$f":"Mao_de_Obra!D69","v":"homem x mês"},{"$f":"Mao_de_Obra!E69","v":12},{"$f":"Mao_de_Obra!F69","v":0},0,{"$error":"#REF!"}]
["4.57",{"$f":"Mao_de_Obra!B70","v":"T4"},{"$f":"Mao_de_Obra!C70","v":"Auxiliar de Topografia (inclusive adicional de periculosidade)"},{"$f":"Mao_de_Obra!D70","v":"homem x mês"},{"$f":"Mao_de_Obra!E70","v":24},{"$f":"Mao_de_Obra!F70","v":0},0,{"$error":"#REF!"}]
["4.58",{"$f":"Mao_de_Obra!B71","v":"T3"},{"$f":"Mao_de_Obra!C71","v":"Carpinteiro (inclusive adicional de periculosidade)"},{"$f":"Mao_de_Obra!D71","v":"homem x mês"},{"$f":"Mao_de_Obra!E71","v":36},{"$f":"Mao_de_Obra!F71","v":0},0,{"$error":"#REF!"}]
["4.59",{"$f":"Mao_de_Obra!B72","v":"T3"},{"$f":"Mao_de_Obra!C72","v":"Ferreiro (inclusive adicional de periculosidade)"},{"$f":"Mao_de_Obra!D72","v":"homem x mês"},{"$f":"Mao_de_Obra!E72","v":36},{"$f":"Mao_de_Obra!F72","v":0},0,{"$error":"#REF!"}]
["4.60",{"$f":"Mao_de_Obra!B73","v":"T3"},{"$f":"Mao_de_Obra!C73","v":"Pedreiro (inclusive adicional de periculosidade)"},{"$f":"Mao_de_Obra!D73","v":"homem x mês"},{"$f":"Mao_de_Obra!E73","v":84},{"$f":"Mao_de_Obra!F73","v":0},0,{"$error":"#REF!"}]
["4.61",{"$f":"Mao_de_Obra!B74","v":"A4"},{"$f":"Mao_de_Obra!C74","v":"Servente (inclusive adicional de periculosidade)"},{"$f":"Mao_de_Obra!D74","v":"homem x mês"},{"$f":"Mao_de_Obra!E74","v":756},{"$f":"Mao_de_Obra!F74","v":0},0,{"$error":"#REF!"}]
[]
["5.",null,{"$f":"Viagens_Diárias!C13","v":"VIAGENS / DIÁRIAS"},null,null,null,{"$f":"SUBTOTAL(109,G173:G177)","v":0},{"$f":"ROUND(G172/G$8,4)","v":{"$error":"#REF!"}}]
["5.1.",null,{"$f":"Viagens_Diárias!C15","v":"DESPESAS COM VIAGENS COMERCIAIS"},null,null,null,{"$f":"SUBTOTAL(109,G174:G175)","v":0},{"$error":"#REF!"}]
["5.1.1",{"$f":"Viagens_Diárias!B16","v":0},{"$f":"Viagens_Diárias!C16","v":"Viagem por via aerea"},{"$f":"Viagens_Diárias!D16","v":"un"},{"$f":"Viagens_Diárias!E16","v":12},{"$f":"Viagens_Diárias!F16","v":0},{"$f":"ROUND(E174*F174,2)","v":0},{"$error":"#REF!"}]
["5.1.2",{"$f":"Viagens_Diárias!B17","v":0},{"$f":"Viagens_Diárias!C17","v":"Viagem por via terrestre (comercial)"},{"$f":"Viagens_Diárias!D17","v":"un"},{"$f":"Viagens_Diárias!E17","v":24},{"$f":"Viagens_Diárias!F17","v":0},0,{"$error":"#REF!"}]
["5.2.",null,{"$f":"Viagens_Diárias!C20","v":"DESPESAS COM DIÁRIAS"},null,null,null,{"$f":"SUBTOTAL(109,G177:G177)","v":0},{"$error":"#REF!"}]
["5.2.1",{"$f":"Viagens_Diárias!B21","v":0},{"$f":"Viagens_Diárias!C21","v":"Diárias nacionais"},{"$f":"Viagens_Diárias!D21","v":"un"},{"$f":"Viagens_Diárias!E21","v":54},{"$f":"Viagens_Diárias!F21","v":0},0,{"$error":"#REF!"}]
[]
["6.",null,{"$f":"Veiculos!C13","v":"VEÍCULOS AUTOMOTORES"},null,null,null,{"$f":"SUBTOTAL(109,G180:G185)","v":{"$error":"#REF!"}},{"$f":"ROUND(G179/G$8,4)","v":{"$error":"#REF!"}}]
["6.1",{"$f":"Veiculos!B14","v":"B3"},{"$f":"Veiculos!C14","v":"Veículo Leve - Tipo Hatch 1.4 Flex (85 CV)"},{"$f":"Veiculos!D14","v":"un x mês"},{"$f":"Veiculos!E14","v":{"$error":"#REF!"}},{"$f":"Veiculos!F14","v":0},{"$error":"#REF!"},{"$error":"#REF!"}]
["6.2",{"$f":"Veiculos!B15","v":"B4"},{"$f":"Veiculos!C15","v":"Veículo Leve - Tipo Sedan 1.6 Flex (115 CV)"},{"$f":"Veiculos!D15","v":"un x mês"},{"$f":"Veiculos!E15","v":{"$error":"#REF!"}},{"$f":"Veiculos!F15","v":0},{"$error":"#REF!"},{"$error":"#REF!"}]
["6.3",{"$f":"Veiculos!B16","v":"B11"},{"$f":"Veiculos!C16","v":"Veículo Tipo Pick Up Cabine Dupla 4 x 4 (163 CV)"},{"$f":"Veiculos!D16","v":"un x mês"},{"$f":"Veiculos!E16","v":{"$error":"#REF!"}},{"$f":"Veiculos!F16","v":0},{"$error":"#REF!"},{"$error":"#REF!"}]
["6.4",{"$f":"Veiculos!B17","v":"B7"},{"$f":"Veiculos!C17","v":"Veículo - Tipo Microônibus - 28 assentos (150 CV) - COM MOTORISTA"},{"$f":"Veiculos!D17","v":"un x mês"},{"$f":"Veiculos!E17","v":{"$error":"#REF!"}},{"$f":"Veiculos!F17","v":0},{"$error":"#REF!"},{"$error":"#REF!"}]
["6.5",{"$f":"Veiculos!B18","v":"B8"},{"$f":"Veiculos!C18","v":"Veículo - Tipo Ônibus - 45 assentos (218 CV) - COM MOTORISTA"},{"$f":"Veiculos!D18","v":"un x mês"},{"$f":"Veiculos!E18","v":{"$error":"#REF!"}},{"$f":"Veiculos!F18","v":0},{"$error":"#REF!"},{"$error":"#REF!"}]
["6.6",{"$f":"Veiculos!B19","v":"B6"},{"$f":"Veiculos!C19","v":"Veículo Utilitário - Tipo Van - 16 assentos (129 CV) - COM MOTORISTA"},{"$f":"Veiculos!D19","v":"un x mês"},{"$f":"Veiculos!E19","v":{"$error":"#REF!"}},{"$f":"Veiculos!F19","v":0},{"$error":"#REF!"},{"$error":"#REF!"}]
[]
["7.",null,{"$f":"Frentes_Moveis!C13","v":"FRENTES MÓVEIS DE LIMPEZA E CONSERVAÇÃO"},null,null,null,{"$f":"SUBTOTAL(109,G188:G190)","v":0},{"$f":"ROUND(G187/G$8,4)","v":{"$error":"#REF!"}}]
["7.1",{"$f":"Frentes_Moveis!B14","v":"00303 - ORSE (5)"},{"$f":"Frentes_Moveis!C14","v":"Tenda Piramidal 5m x 5m (para refeitório)"},{"$f":"Frentes_Moveis!D14","v":"un x mês"},{"$f":"Frentes_Moveis!E14","v":96},{"$f":"Frentes_Moveis!F14","v":0},0,{"$error":"#REF!"}]
["7.2",{"$f":"Frentes_Moveis!B15","v":"00303 - ORSE (3)"},{"$f":"Frentes_Moveis!C15","v":"Tenda Piramidal 3m x 3m "},{"$f":"Frentes_Moveis!D15","v":"un x mês"},{"$f":"Frentes_Moveis!E15","v":96},{"$f":"Frentes_Moveis!F15","v":0},0,{"$error":"#REF!"}]
["7.3",{"$f":"Frentes_Moveis!B16","v":"10390 - ORSE/SE"},{"$f":"Frentes_Moveis!C16","v":"Banheiro Químico, com 03 limpezas semanais"},{"$f":"Frentes_Moveis!D16","v":"un x mês"},{"$f":"Frentes_Moveis!E16","v":252},{"$f":"Frentes_Moveis!F16","v":0},0,{"$error":"#REF!"}]
[]
["8.",null,{"$f":"Materiais_Consumo!C13","v":"MATERIAL DE CONSUMO - ALMOXARIFADOS"},null,null,null,{"$f":"SUBTOTAL(109,G193:G350)","v":0},{"$f":"ROUND(G192/G$8,4)","v":{"$error":"#REF!"}}]
["8.1.",null,{"$f":"Materiais_Consumo!C15","v":"MATERIAL DE CONSUMO - MECÂNICA"},null,null,null,{"$f":"SUBTOTAL(109,G194:G248)","v":0},{"$error":"#REF!"}]
["8.1.1",{"$f":"Materiais_Consumo!B16","v":"04791 - SINAPI"},{"$f":"Materiais_Consumo!C16","v":"Adesivo Acrílico / Cola de contato"},{"$f":"Materiais_Consumo!D16","v":"un"},{"$f":"Materiais_Consumo!E16","v":480},{"$f":"Materiais_Consumo!F16","v":0},0,{"$error":"#REF!"}]
["8.1.2",{"$f":"Materiais_Consumo!B17","v":"05318 - SINAPI"},{"$f":"Materiais_Consumo!C17","v":"Água Raz - galão  5 l"},{"$f":"Materiais_Consumo!D17","v":"un"},{"$f":"Materiais_Consumo!E17","v":112},{"$f":"Materiais_Consumo!F17","v":0},0,{"$error":"#REF!"}]
["8.1.3",{"$f":"Materiais_Consumo!B18","v":"F030000301 - EMBASA/BA"},{"$f":"Materiais_Consumo!C18","v":"Alcool Comum 90º GL"},{"$f":"Materiais_Consumo!D18","v":"l"},{"$f":"Materiais_Consumo!E18","v":1200},{"$f":"Materiais_Consumo!F18","v":0},0,{"$error":"#REF!"}]
["8.1.4",{"$f":"Materiais_Consumo!B19","v":0},{"$f":"Materiais_Consumo!C19","v":"Antiferrugem aerosol WD-40 - tubo de 300 ml"},{"$f":"Materiais_Consumo!D19","v":"un"},{"$f":"Materiais_Consumo!E19","v":289},{"$f":"Materiais_Consumo!F19","v":0},0,{"$error":"#REF!"}]
["8.1.5",{"$f":"Materiais_Consumo!B20","v":0},{"$f":"Materiais_Consumo!C20","v":"Antiespumante – antiespumante a base de silicone"},{"$f":"Materiais_Consumo!D20","v":"l"},{"$f":"Materiais_Consumo!E20","v":223},{"$f":"Materiais_Consumo!F20","v":0},0,{"$error":"#REF!"}]
["8.1.6",{"$f":"Materiais_Consumo!B21","v":"00337 - SINAPI"},{"$f":"Materiais_Consumo!C21","v":"Arame recozido n.º 18"},{"$f":"Materiais_Consumo!D21","v":"kg"},{"$f":"Materiais_Consumo!E21","v":2400},{"$f":"Materiais_Consumo!F21","v":0},0,{"$error":"#REF!"}]
["8.1.7",{"$f":"Materiais_Consumo!B22","v":"00122 - SINAPI"},{"$f":"Materiais_Consumo!C22","v":"Cola de PVC com 850 g"},{"$f":"Materiais_Consumo!D22","v":"un"},{"$f":"Materiais_Consumo!E22","v":144},{"$f":"Materiais_Consumo!F22","v":0},0,{"$error":"#REF!"}]
["8.1.8",{"$f":"Materiais_Consumo!B23","v":0},{"$f":"Materiais_Consumo!C23","v":"Cola Ultra Gray 70g"},{"$f":"Materiais_Consumo!D23","v":"un"},{"$f":"Materiais_Consumo!E23","v":144},{"$f":"Materiais_Consumo!F23","v":0},0,{"$error":"#REF!"}]
["8.1.9",{"$f":"Materiais_Consumo!B24","v":0},{"$f":"Materiais_Consumo!C24","v":"Cola para junta de motores com 73g"},{"$f":"Materiais_Consumo!D24","v":"un"},{"$f":"Materiais_Consumo!E24","v":1200},{"$f":"Materiais_Consumo!F24","v":0},0,{"$error":"#REF!"}]
["8.1.10",{"$f":"Materiais_Consumo!B25","v":0},{"$f":"Materiais_Consumo!C25","v":"Convertedor de ferrugem"},{"$f":"Materiais_Consumo!D25","v":"un"},{"$f":"Materiais_Consumo!E25","v":445},{"$f":"Materiais_Consumo!F25","v":0},0,{"$error":"#REF!"}]
["8.1.11",{"$f":"Materiais_Consumo!B26","v":"038200 - SINAPI"},{"$f":"Materiais_Consumo!C26","v":"Corda de bombeiro 12mm em nylon trançado (rolo de 100,00m)"},{"$f":"Materiais_Consumo!D26","v":"m"},{"$f":"Materiais_Consumo!E26","v":3200},{"$f":"Materiais_Consumo!F26","v":0},0,{"$error":"#REF!"}]
["8.1.12",{"$f":"Materiais_Consumo!B27","v":"004221 - SINAPI"},{"$f":"Materiais_Consumo!C27","v":"Diesel comum (l)"},{"$f":"Materiais_Consumo!D27","v":"l"},{"$f":"Materiais_Consumo!E27","v":4800},{"$f":"Materiais_Consumo!F27","v":0},0,{"$error":"#REF!"}]
["8.1.13",{"$f":"Materiais_Consumo!B28","v":"026019 - SINAPI"},{"$f":"Materiais_Consumo!C28","v":"Disco corte abrasivo 7\" x 1/8\" x 7/8\""},{"$f":"Materiais_Consumo!D28","v":"un"},{"$f":"Materiais_Consumo!E28","v":434},{"$f":"Materiais_Consumo!F28","v":0},{"$f":"ROUND(E206*F206,2)","v":0},{"$error":"#REF!"}]
["8.1.14",{"$f":"Materiais_Consumo!B29","v":"025931 - SINAPI"},{"$f":"Materiais_Consumo!C29","v":"Disco de corte diamantado - 7\", para esmerilhadeira, segmentado, para concreto"},{"$f":"Materiais_Consumo!D29","v":"un"},{"$f":"Materiais_Consumo!E29","v":434},{"$f":"Materiais_Consumo!F29","v":0},0,{"$error":"#REF!"}]
["8.1.15",{"$f":"Materiais_Consumo!B30","v":"026018 - SINAPI"},{"$f":"Materiais_Consumo!C30","v":"Disco de corte para estrutura metálica 300 x 3,2 x 19,05 mm"},{"$f":"Materiais_Consumo!D30","v":"un"},{"$f":"Materiais_Consumo!E30","v":434},{"$f":"Materiais_Consumo!F30","v":0},0,{"$error":"#REF!"}]
["8.1.16",{"$f":"Materiais_Consumo!B31","v":"026019 - SINAPI"},{"$f":"Materiais_Consumo!C31","v":"Disco de desbaste para estrutura metálica de 9\" x 1/4\" x 7/8\" ( 225 x 6,25 x 21,87 mm)"},{"$f":"Materiais_Consumo!D31","v":"un"},{"$f":"Materiais_Consumo!E31","v":434},{"$f":"Materiais_Consumo!F31","v":0},0,{"$error":"#REF!"}]
["8.1.17",{"$f":"Materiais_Consumo!B32","v":"010997 - SINAPI"},{"$f":"Materiais_Consumo!C32","v":"Eletrodos Revestido AWS-E7018, DN 4 mm"},{"$f":"Materiais_Consumo!D32","v":"kg"},{"$f":"Materiais_Consumo!E32","v":320},{"$f":"Materiais_Consumo!F32","v":0},0,{"$error":"#REF!"}]
["8.1.18",{"$f":"Materiais_Consumo!B33","v":"10997 - SINAPI/PE"},{"$f":"Materiais_Consumo!C33","v":"Eletrodos Revestido AWS-E7018, DN 6 mm"},{"$f":"Materiais_Consumo!D33","v":"kg"},{"$f":"Materiais_Consumo!E33","v":320},{"$f":"Materiais_Consumo!F33","v":0},0,{"$error":"#REF!"}]
["8.1.19",{"$f":"Materiais_Consumo!B34","v":"000012 - SINAPI"},{"$f":"Materiais_Consumo!C34","v":"Escova de aço para remoção da graxa envelhecida dos cabos de aço"},{"$f":"Materiais_Consumo!D34","v":"un"},{"$f":"Materiais_Consumo!E34","v":160},{"$f":"Materiais_Consumo!F34","v":0},0,{"$error":"#REF!"}]
["8.1.20",{"$f":"Materiais_Consumo!B35","v":"000013 - SINAPI"},{"$f":"Materiais_Consumo!C35","v":"Estopa - embalagem 20 kg"},{"$f":"Materiais_Consumo!D35","v":"kg"},{"$f":"Materiais_Consumo!E35","v":294},{"$f":"Materiais_Consumo!F35","v":0},0,{"$error":"#REF!"}]
["8.1.21",{"$f":"Materiais_Consumo!B36","v":"000404 - SINAPI"},{"$f":"Materiais_Consumo!C36","v":"Fita auto fusão 19 mm x 10 m"},{"$f":"Materiais_Consumo!D36","v":"un"},{"$f":"Materiais_Consumo!E36","v":194},{"$f":"Materiais_Consumo!F36","v":0},0,{"$error":"#REF!"}]
["8.1.22",{"$f":"Materiais_Consumo!B37","v":"012815 - SINAPI"},{"$f":"Materiais_Consumo!C37","v":"Fita crepe adesiva 25mm x 50mm "},{"$f":"Materiais_Consumo!D37","v":"un"},{"$f":"Materiais_Consumo!E37","v":194},{"$f":"Materiais_Consumo!F37","v":0},0,{"$error":"#REF!"}]
["8.1.23",{"$f":"Materiais_Consumo!B38","v":"020111 - SINAPI"},{"$f":"Materiais_Consumo!C38","v":"Fita isolante 19 mm x 20 m"},{"$f":"Materiais_Consumo!D38","v":"un"},{"$f":"Materiais_Consumo!E38","v":194},{"$f":"Materiais_Consumo!F38","v":0},0,{"$error":"#REF!"}]
["8.1.24",{"$f":"Materiais_Consumo!B39","v":"004222 - SINAPI"},{"$f":"Materiais_Consumo!C39","v":"Gasolina Comum"},{"$f":"Materiais_Consumo!D39","v":"l"},{"$f":"Materiais_Consumo!E39","v":2400},{"$f":"Materiais_Consumo!F39","v":0},0,{"$error":"#REF!"}]
["8.1.25",{"$f":"Materiais_Consumo!B40","v":0},{"$f":"Materiais_Consumo!C40","v":"Graxa a base de lítio NGLI 2"},{"$f":"Materiais_Consumo!D40","v":"kg"},{"$f":"Materiais_Consumo!E40","v":478},{"$f":"Materiais_Consumo!F40","v":0},0,{"$error":"#REF!"}]
["8.1.26",{"$f":"Materiais_Consumo!B41","v":0},{"$f":"Materiais_Consumo!C41","v":"Graxa a base de lítio NGLI 3"},{"$f":"Materiais_Consumo!D41","v":"kg"},{"$f":"Materiais_Consumo!E41","v":478},{"$f":"Materiais_Consumo!F41","v":0},0,{"$error":"#REF!"}]
["8.1.27",{"$f":"Materiais_Consumo!B42","v":0},{"$f":"Materiais_Consumo!C42","v":"Graxa com dissulfeto de molibidênio (MoS2) - Lata 500 g"},{"$f":"Materiais_Consumo!D42","v":"un"},{"$f":"Materiais_Consumo!E42","v":478},{"$f":"Materiais_Consumo!F42","v":0},0,{"$error":"#REF!"}]
["8.1.28",{"$f":"Materiais_Consumo!B43","v":0},{"$f":"Materiais_Consumo!C43","v":"Graxa GMA - 2"},{"$f":"Materiais_Consumo!D43","v":"kg"},{"$f":"Materiais_Consumo!E43","v":478},{"$f":"Materiais_Consumo!F43","v":0},0,{"$error":"#REF!"}]
["8.1.29",{"$f":"Materiais_Consumo!B44","v":0},{"$f":"Materiais_Consumo!C44","v":"Graxa de Alta Resistência a Carga, Pressão LGEP 2/1. Aplicação: graxa para motor e bomba"},{"$f":"Materiais_Consumo!D44","v":"kg"},{"$f":"Materiais_Consumo!E44","v":478},{"$f":"Materiais_Consumo!F44","v":0},0,{"$error":"#REF!"}]
["8.1.30",{"$f":"Materiais_Consumo!B45","v":0},{"$f":"Materiais_Consumo!C45","v":"Graxa de Alta Resistência a Carga, Pressão LGEP 2/1. Aplicação: Engrenagens de roda e engrenagens expostas"},{"$f":"Materiais_Consumo!D45","v":"kg"},{"$f":"Materiais_Consumo!E45","v":478},{"$f":"Materiais_Consumo!F45","v":0},0,{"$error":"#REF!"}]
["8.1.31",{"$f":"Materiais_Consumo!B46","v":0},{"$f":"Materiais_Consumo!C46","v":"Hidróxido de cálcio "},{"$f":"Materiais_Consumo!D46","v":"kg"},{"$f":"Materiais_Consumo!E46","v":600},{"$f":"Materiais_Consumo!F46","v":0},0,{"$error":"#REF!"}]
["8.1.32",{"$f":"Materiais_Consumo!B47","v":0},{"$f":"Materiais_Consumo!C47","v":"Hipoclorito de sódio"},{"$f":"Materiais_Consumo!D47","v":"kg"},{"$f":"Materiais_Consumo!E47","v":1200},{"$f":"Materiais_Consumo!F47","v":0},0,{"$error":"#REF!"}]
["8.1.33",{"$f":"Materiais_Consumo!B48","v":"8216 - ORSE"},{"$f":"Materiais_Consumo!C48","v":"Lâmina de serra para metal  Starret ou similar"},{"$f":"Materiais_Consumo!D48","v":"un"},{"$f":"Materiais_Consumo!E48","v":667},{"$f":"Materiais_Consumo!F48","v":0},0,{"$error":"#REF!"}]
["8.1.34",{"$f":"Materiais_Consumo!B49","v":"I1660 - SEINFRA/CE"},{"$f":"Materiais_Consumo!C49","v":"Lençol de borracha manta 3/16” 4,8mm"},{"$f":"Materiais_Consumo!D49","v":"m²"},{"$f":"Materiais_Consumo!E49","v":400},{"$f":"Materiais_Consumo!F49","v":0},0,{"$error":"#REF!"}]
["8.1.35",{"$f":"Materiais_Consumo!B50","v":0},{"$f":"Materiais_Consumo!C50","v":"Líquido penetrante visível lavável à água (Ensaios de Líquido Penetrante)"},{"$f":"Materiais_Consumo!D50","v":"un"},{"$f":"Materiais_Consumo!E50","v":98},{"$f":"Materiais_Consumo!F50","v":0},0,{"$error":"#REF!"}]
["8.1.36",{"$f":"Materiais_Consumo!B51","v":"003767 - SINAPI"},{"$f":"Materiais_Consumo!C51","v":"Lixa nº120"},{"$f":"Materiais_Consumo!D51","v":"un"},{"$f":"Materiais_Consumo!E51","v":2400},{"$f":"Materiais_Consumo!F51","v":0},0,{"$error":"#REF!"}]
["8.1.37",{"$f":"Materiais_Consumo!B52","v":0},{"$f":"Materiais_Consumo!C52","v":"Lona de borracha com alma 1,0 – 4,8 mm esp."},{"$f":"Materiais_Consumo!D52","v":"m"},{"$f":"Materiais_Consumo!E52","v":45},{"$f":"Materiais_Consumo!F52","v":0},0,{"$error":"#REF!"}]
["8.1.38",{"$f":"Materiais_Consumo!B53","v":"003777 - SINAPI/PE"},{"$f":"Materiais_Consumo!C53","v":"Lona plástica - 4 x 100 m - 12 kg"},{"$f":"Materiais_Consumo!D53","v":"m²"},{"$f":"Materiais_Consumo!E53","v":3200},{"$f":"Materiais_Consumo!F53","v":0},0,{"$error":"#REF!"}]
["8.1.39",{"$f":"Materiais_Consumo!B54","v":"037459 - SINAPI"},{"$f":"Materiais_Consumo!C54","v":"Mangueira Cristal, Lisa PVC transparente, 3/4\" x 2 mm"},{"$f":"Materiais_Consumo!D54","v":"m"},{"$f":"Materiais_Consumo!E54","v":1600},{"$f":"Materiais_Consumo!F54","v":0},0,{"$error":"#REF!"}]
["8.1.40",{"$f":"Materiais_Consumo!B55","v":0},{"$f":"Materiais_Consumo!C55","v":"Mangueira FLG-62/1 0 - 150 PSI 1/4\" NPT"},{"$f":"Materiais_Consumo!D55","v":"m"},{"$f":"Materiais_Consumo!E55","v":800},{"$f":"Materiais_Consumo!F55","v":0},0,{"$error":"#REF!"}]
["8.1.41",{"$f":"Materiais_Consumo!B56","v":"7696 - ORSE"},{"$f":"Materiais_Consumo!C56","v":"Massa calafetar cinza-Durepox ou similiar"},{"$f":"Materiais_Consumo!D56","v":"kg"},{"$f":"Materiais_Consumo!E56","v":334},{"$f":"Materiais_Consumo!F56","v":0},0,{"$error":"#REF!"}]
["8.1.42",{"$f":"Materiais_Consumo!B57","v":0},{"$f":"Materiais_Consumo!C57","v":"Óleo - Translação pórtico e ponte e direção do carro - 20 l -  Óleo EP 220"},{"$f":"Materiais_Consumo!D57","v":"l"},{"$f":"Materiais_Consumo!E57","v":334},{"$f":"Materiais_Consumo!F57","v":0},0,{"$error":"#REF!"}]
["8.1.43",{"$f":"Materiais_Consumo!B58","v":0},{"$f":"Materiais_Consumo!C58","v":"Óleo Hidràulico para os componentes não protegido dos Servomotor Hidráulico - Óleo EP 320"},{"$f":"Materiais_Consumo!D58","v":"l"},{"$f":"Materiais_Consumo!E58","v":334},{"$f":"Materiais_Consumo!F58","v":0},0,{"$error":"#REF!"}]
["8.1.44",{"$f":"Materiais_Consumo!B59","v":0},{"$f":"Materiais_Consumo!C59","v":"Óleo Lubrificante Redutor - Óleo SAE 90"},{"$f":"Materiais_Consumo!D59","v":"l"},{"$f":"Materiais_Consumo!E59","v":334},{"$f":"Materiais_Consumo!F59","v":0},0,{"$error":"#REF!"}]
["8.1.45",{"$f":"Materiais_Consumo!B60","v":0},{"$f":"Materiais_Consumo!C60","v":"Óleo lubrificante, para engrenagem., EP-5, viscosidade (CSt) ( - 40ºC) = 22 - tambor 20 l"},{"$f":"Materiais_Consumo!D60","v":"l"},{"$f":"Materiais_Consumo!E60","v":334},{"$f":"Materiais_Consumo!F60","v":0},0,{"$error":"#REF!"}]
["8.1.46",{"$f":"Materiais_Consumo!B61","v":0},{"$f":"Materiais_Consumo!C61","v":"PAC – Policloreto de alumínio (5 l)"},{"$f":"Materiais_Consumo!D61","v":"l"},{"$f":"Materiais_Consumo!E61","v":967},{"$f":"Materiais_Consumo!F61","v":0},0,{"$error":"#REF!"}]
["8.1.47",{"$f":"Materiais_Consumo!B62","v":0},{"$f":"Materiais_Consumo!C62","v":"Papelão grafitado 1,50 m x 1,60 m Esp 2.4"},{"$f":"Materiais_Consumo!D62","v":"m"},{"$f":"Materiais_Consumo!E62","v":45},{"$f":"Materiais_Consumo!F62","v":0},{"$f":"ROUND(E240*F240,2)","v":0},{"$error":"#REF!"}]
["8.1.48",{"$f":"Materiais_Consumo!B63","v":0},{"$f":"Materiais_Consumo!C63","v":"Pasta de Limpeza"},{"$f":"Materiais_Consumo!D63","v":"kg"},{"$f":"Materiais_Consumo!E63","v":967},{"$f":"Materiais_Consumo!F63","v":0},0,{"$error":"#REF!"}]
["8.1.49",{"$f":"Materiais_Consumo!B64","v":0},{"$f":"Materiais_Consumo!C64","v":"Polímero aniônico"},{"$f":"Materiais_Consumo!D64","v":"kg"},{"$f":"Materiais_Consumo!E64","v":967},{"$f":"Materiais_Consumo!F64","v":0},0,{"$error":"#REF!"}]
["8.1.50",{"$f":"Materiais_Consumo!B65","v":"004224 - SINAPI"},{"$f":"Materiais_Consumo!C65","v":"Querosene para limpeza "},{"$f":"Materiais_Consumo!D65","v":"l"},{"$f":"Materiais_Consumo!E65","v":967},{"$f":"Materiais_Consumo!F65","v":0},{"$f":"ROUND(E243*F243,2)","v":0},{"$error":"#REF!"}]
["8.1.51",{"$f":"Materiais_Consumo!B66","v":0},{"$f":"Materiais_Consumo!C66","v":"Revelador não aquoso D70 (Ensaios de Líquido Penetrante)"},{"$f":"Materiais_Consumo!D66","v":"un"},{"$f":"Materiais_Consumo!E66","v":98},{"$f":"Materiais_Consumo!F66","v":0},0,{"$error":"#REF!"}]
["8.1.52",{"$f":"Materiais_Consumo!B67","v":0},{"$f":"Materiais_Consumo!C67","v":"Sílica Gel"},{"$f":"Materiais_Consumo!D67","v":"kg"},{"$f":"Materiais_Consumo!E67","v":98},{"$f":"Materiais_Consumo!F67","v":0},0,{"$error":"#REF!"}]
["8.1.53",{"$f":"Materiais_Consumo!B68","v":"039961 - SINAPI"},{"$f":"Materiais_Consumo!C68","v":"Silicone (acético branca) - Tubo de 280g"},{"$f":"Materiais_Consumo!D68","v":"un"},{"$f":"Materiais_Consumo!E68","v":480},{"$f":"Materiais_Consumo!F68","v":0},0,{"$error":"#REF!"}]
["8.1.54",{"$f":"Materiais_Consumo!B69","v":0},{"$f":"Materiais_Consumo!C69","v":"Trava química"},{"$f":"Materiais_Consumo!D69","v":"un"},{"$f":"Materiais_Consumo!E69","v":192},{"$f":"Materiais_Consumo!F69","v":0},0,{"$error":"#REF!"}]
["8.1.55",{"$f":"Materiais_Consumo!B70","v":"004869 - SBC"},{"$f":"Materiais_Consumo!C70","v":"Vaselina sólida anti-inflamável"},{"$f":"Materiais_Consumo!D70","v":"kg"},{"$f":"Materiais_Consumo!E70","v":480},{"$f":"Materiais_Consumo!F70","v":0},0,{"$error":"#REF!"}]
["8.2.",null,{"$f":"Materiais_Consumo!C74","v":"MATERIAL DE CONSUMO - ELÉTRICA"},null,null,null,{"$f":"SUBTOTAL(109,G250:G303)","v":0},{"$error":"#REF!"}]
["8.2.1",{"$f":"Materiais_Consumo!B75","v":"00181 - ORSE"},{"$f":"Materiais_Consumo!C75","v":"Anilha Identificação - 0,5 a 6mm² (pacote com 100 unidades)"},{"$f":"Materiais_Consumo!D75","v":"un"},{"$f":"Materiais_Consumo!E75","v":10},{"$f":"Materiais_Consumo!F75","v":0},0,{"$error":"#REF!"}]
["8.2.2",{"$f":"Materiais_Consumo!B76","v":"00181 - ORSE"},{"$f":"Materiais_Consumo!C76","v":"Anilha Identificação - 10 a 16mm² (pacote com 100 unidades)"},{"$f":"Materiais_Consumo!D76","v":"un"},{"$f":"Materiais_Consumo!E76","v":10},{"$f":"Materiais_Consumo!F76","v":0},0,{"$error":"#REF!"}]
["8.2.3",{"$f":"Materiais_Consumo!B77","v":"03875 - ORSE"},{"$f":"Materiais_Consumo!C77","v":"Anilha Identificação - 25 a 70mm² (pacote com 100 unidades)"},{"$f":"Materiais_Consumo!D77","v":"un"},{"$f":"Materiais_Consumo!E77","v":10},{"$f":"Materiais_Consumo!F77","v":0},0,{"$error":"#REF!"}]
["8.2.4",{"$f":"Materiais_Consumo!B78","v":"03875 - ORSE"},{"$f":"Materiais_Consumo!C78","v":"Anilha Identificação - 95 a 120mm² (pacote com 100 unidades)"},{"$f":"Materiais_Consumo!D78","v":"un"},{"$f":"Materiais_Consumo!E78","v":10},{"$f":"Materiais_Consumo!F78","v":0},0,{"$error":"#REF!"}]
["8.2.5",{"$f":"Materiais_Consumo!B79","v":"03531 - ORSE"},{"$f":"Materiais_Consumo!C79","v":"Ar comprimido seco  Aerossol 300ml"},{"$f":"Materiais_Consumo!D79","v":"un"},{"$f":"Materiais_Consumo!E79","v":400},{"$f":"Materiais_Consumo!F79","v":0},0,{"$error":"#REF!"}]
["8.2.6",{"$f":"Materiais_Consumo!B80","v":"00993 - SINAPI"},{"$f":"Materiais_Consumo!C80","v":"Cabo cobre flexível classe 4 ou 5 isolação PVC/A M 1,68 e cobertura PVC-ST1 antichama BWF-B 0,6/1 kV 1,5mm²"},{"$f":"Materiais_Consumo!D80","v":"m"},{"$f":"Materiais_Consumo!E80","v":6000},{"$f":"Materiais_Consumo!F80","v":0},0,{"$error":"#REF!"}]
["8.2.7",{"$f":"Materiais_Consumo!B81","v":"01022 - SINAPI"},{"$f":"Materiais_Consumo!C81","v":"Cabo cobre flexível classe 4 ou 5 isolação PVC/A M 1,68 e cobertura PVC-ST1 antichama BWF-B 0,6/1 kV 2,5mm²"},{"$f":"Materiais_Consumo!D81","v":"m"},{"$f":"Materiais_Consumo!E81","v":6000},{"$f":"Materiais_Consumo!F81","v":0},0,{"$f":"ROUND(G256/G$8,4)","v":{"$error":"#REF!"}}]
["8.2.8",{"$f":"Materiais_Consumo!B82","v":"01003 - SINAPI"},{"$f":"Materiais_Consumo!C82","v":"Cabo cobre flexível classe 4 ou 5 isolação PVC/A M 1,68 e cobertura PVC-ST1 antichama BWF-B 0,6/1 kV 4mm²"},{"$f":"Materiais_Consumo!D82","v":"m"},{"$f":"Materiais_Consumo!E82","v":2000},{"$f":"Materiais_Consumo!F82","v":0},0,{"$error":"#REF!"}]
["8.2.9",{"$f":"Materiais_Consumo!B83","v":"00994 - SINAPI"},{"$f":"Materiais_Consumo!C83","v":"Cabo cobre flexível classe 4 ou 5 isolação PVC/A M 1,68 e cobertura PVC-ST1 antichama BWF-B 0,6/1 kV 6mm²"},{"$f":"Materiais_Consumo!D83","v":"m"},{"$f":"Materiais_Consumo!E83","v":2000},{"$f":"Materiais_Consumo!F83","v":0},0,{"$error":"#REF!"}]
["8.2.10",{"$f":"Materiais_Consumo!B84","v":"01020 - SINAPI"},{"$f":"Materiais_Consumo!C84","v":"Cabo cobre flexível classe 4 ou 5 isolação PVC/A M 1,68 e cobertura PVC-ST1 antichama BWF-B 0,6/1 kV 10mm²"},{"$f":"Materiais_Consumo!D84","v":"m"},{"$f":"Materiais_Consumo!E84","v":1000},{"$f":"Materiais_Consumo!F84","v":0},0,{"$error":"#REF!"}]
["8.2.11",{"$f":"Materiais_Consumo!B85","v":"00995 - SINAPI"},{"$f":"Materiais_Consumo!C85","v":"Cabo cobre flexível classe 4 ou 5 isolação PVC/A M 1,68 e cobertura PVC-ST1 antichama BWF-B 0,6/1 kV 16mm²"},{"$f":"Materiais_Consumo!D85","v":"m"},{"$f":"Materiais_Consumo!E85","v":1000},{"$f":"Materiais_Consumo!F85","v":0},0,{"$error":"#REF!"}]
["8.2.12",{"$f":"Materiais_Consumo!B86","v":"00996 - SINAPI"},{"$f":"Materiais_Consumo!C86","v":"Cabo cobre flexível classe 4 ou 5 isolação PVC/A M 1,68 e cobertura PVC-ST1 antichama BWF-B 0,6/1 kV 25mm²"},{"$f":"Materiais_Consumo!D86","v":"m"},{"$f":"Materiais_Consumo!E86","v":600},{"$f":"Materiais_Consumo!F86","v":0},0,{"$error":"#REF!"}]
["8.2.13",{"$f":"Materiais_Consumo!B87","v":"01019 - SINAPI"},{"$f":"Materiais_Consumo!C87","v":"Cabo cobre flexível classe 4 ou 5 isolação PVC/A M 1,68 e cobertura PVC-ST1 antichama BWF-B 0,6/1 kV 35mm²"},{"$f":"Materiais_Consumo!D87","v":"m"},{"$f":"Materiais_Consumo!E87","v":500},{"$f":"Materiais_Consumo!F87","v":0},0,{"$error":"#REF!"}]
["8.2.14",{"$f":"Materiais_Consumo!B88","v":"01018 - SINAPI"},{"$f":"Materiais_Consumo!C88","v":"Cabo cobre flexível classe 4 ou 5 isolação PVC/A M 1,68 e cobertura PVC-ST1 antichama BWF-B 0,6/1 kV 50mm²"},{"$f":"Materiais_Consumo!D88","v":"m"},{"$f":"Materiais_Consumo!E88","v":500},{"$f":"Materiais_Consumo!F88","v":0},0,{"$error":"#REF!"}]
["8.2.15",{"$f":"Materiais_Consumo!B89","v":"00977 - SINAPI"},{"$f":"Materiais_Consumo!C89","v":"Cabo cobre flexível classe 4 ou 5 isolação PVC/A M 1,68 e cobertura PVC-ST1 antichama BWF-B 0,6/1 kV 70mm²"},{"$f":"Materiais_Consumo!D89","v":"m"},{"$f":"Materiais_Consumo!E89","v":500},{"$f":"Materiais_Consumo!F89","v":0},0,{"$error":"#REF!"}]
["8.2.16",{"$f":"Materiais_Consumo!B90","v":"00998 - SINAPI"},{"$f":"Materiais_Consumo!C90","v":"Cabo cobre flexível classe 4 ou 5 isolação PVC/A M 1,68 e cobertura PVC-ST1 antichama BWF-B 0,6/1 kV 95mm²"},{"$f":"Materiais_Consumo!D90","v":"m"},{"$f":"Materiais_Consumo!E90","v":200},{"$f":"Materiais_Consumo!F90","v":0},0,{"$error":"#REF!"}]
["8.2.17",{"$f":"Materiais_Consumo!B91","v":"01017 - SINAPI"},{"$f":"Materiais_Consumo!C91","v":"Cabo cobre flexível classe 4 ou 5 isolação PVC/A M 1,68 e cobertura PVC-ST1 antichama BWF-B 0,6/1 kV 120mm²"},{"$f":"Materiais_Consumo!D91","v":"m"},{"$f":"Materiais_Consumo!E91","v":200},{"$f":"Materiais_Consumo!F91","v":0},0,{"$error":"#REF!"}]
["8.2.18",{"$f":"Materiais_Consumo!B92","v":"25005 - SINAPI"},{"$f":"Materiais_Consumo!C92","v":"Cabo de alumínio nu bitola 1/0 AWG (kg)"},{"$f":"Materiais_Consumo!D92","v":"kg"},{"$f":"Materiais_Consumo!E92","v":600},{"$f":"Materiais_Consumo!F92","v":0},0,{"$error":"#REF!"}]
["8.2.19",{"$f":"Materiais_Consumo!B93","v":"00842 - SINAPI"},{"$f":"Materiais_Consumo!C93","v":"Cabo de alumínio nu bitola 4/0 AWG (kg)"},{"$f":"Materiais_Consumo!D93","v":"kg"},{"$f":"Materiais_Consumo!E93","v":1200},{"$f":"Materiais_Consumo!F93","v":0},0,{"$error":"#REF!"}]
["8.2.20",{"$f":"Materiais_Consumo!B94","v":"00863 - SINAPI"},{"$f":"Materiais_Consumo!C94","v":"Cabo de cobre nu, eletrolítico, têmpera meio duro, #35mm² (m)"},{"$f":"Materiais_Consumo!D94","v":"m"},{"$f":"Materiais_Consumo!E94","v":500},{"$f":"Materiais_Consumo!F94","v":0},0,{"$error":"#REF!"}]
["8.2.21",{"$f":"Materiais_Consumo!B95","v":"00867 - SINAPI"},{"$f":"Materiais_Consumo!C95","v":"Cabo de cobre nu, eletrolítico, têmpera meio duro, #50mm² (m)"},{"$f":"Materiais_Consumo!D95","v":"m"},{"$f":"Materiais_Consumo!E95","v":500},{"$f":"Materiais_Consumo!F95","v":0},0,{"$error":"#REF!"}]
["8.2.22",{"$f":"Materiais_Consumo!B96","v":"00864 - SINAPI"},{"$f":"Materiais_Consumo!C96","v":"Cabo de cobre nu, eletrolítico, têmpera meio duro, #70mm² (m)"},{"$f":"Materiais_Consumo!D96","v":"m"},{"$f":"Materiais_Consumo!E96","v":500},{"$f":"Materiais_Consumo!F96","v":0},0,{"$error":"#REF!"}]
["8.2.23",{"$f":"Materiais_Consumo!B97","v":"09720 - ORSE"},{"$f":"Materiais_Consumo!C97","v":"Conector para haste aterramento #35mm² GTDU"},{"$f":"Materiais_Consumo!D97","v":"un"},{"$f":"Materiais_Consumo!E97","v":50},{"$f":"Materiais_Consumo!F97","v":0},0,{"$error":"#REF!"}]
["8.2.24",{"$f":"Materiais_Consumo!B98","v":"09720 - ORSE"},{"$f":"Materiais_Consumo!C98","v":"Conector para haste aterramento #50mm² GTDU"},{"$f":"Materiais_Consumo!D98","v":"un"},{"$f":"Materiais_Consumo!E98","v":40},{"$f":"Materiais_Consumo!F98","v":0},0,{"$error":"#REF!"}]
["8.2.25",{"$f":"Materiais_Consumo!B99","v":"09720 - ORSE"},{"$f":"Materiais_Consumo!C99","v":"Conector para haste aterramento #70mm² GTDU"},{"$f":"Materiais_Consumo!D99","v":"un"},{"$f":"Materiais_Consumo!E99","v":40},{"$f":"Materiais_Consumo!F99","v":0},0,{"$error":"#REF!"}]
["8.2.26",{"$f":"Materiais_Consumo!B100","v":"11602 - ORSE"},{"$f":"Materiais_Consumo!C100","v":"Filtro de ventiladores de painéis"},{"$f":"Materiais_Consumo!D100","v":"un"},{"$f":"Materiais_Consumo!E100","v":180},{"$f":"Materiais_Consumo!F100","v":0},0,{"$error":"#REF!"}]
["8.2.27",{"$f":"Materiais_Consumo!B101","v":0},{"$f":"Materiais_Consumo!C101","v":"Filtro dos motores do eixo leste EBV4, 5 e 6 (fabricante Aeroglass-ref 11140737)"},{"$f":"Materiais_Consumo!D101","v":"un"},{"$f":"Materiais_Consumo!E101","v":48},{"$f":"Materiais_Consumo!F101","v":0},0,{"$error":"#REF!"}]
["8.2.28",{"$f":"Materiais_Consumo!B102","v":0},{"$f":"Materiais_Consumo!C102","v":"Filtro dos motores do eixo leste EBV1, 2 e 3 (fabricante Aeroglass-modelo FMT_C2015 inox - 345x925x25mm)"},{"$f":"Materiais_Consumo!D102","v":"un"},{"$f":"Materiais_Consumo!E102","v":64},{"$f":"Materiais_Consumo!F102","v":0},0,{"$error":"#REF!"}]
["8.2.29",{"$f":"Materiais_Consumo!B103","v":"02643 - ORSE"},{"$f":"Materiais_Consumo!C103","v":"Fita isolante de borracha autofusão impermeável à prova dágua , até 69 kV (alta tensão)- 19mm x 10m"},{"$f":"Materiais_Consumo!D103","v":"un"},{"$f":"Materiais_Consumo!E103","v":756},{"$f":"Materiais_Consumo!F103","v":0},0,{"$error":"#REF!"}]
["8.2.30",{"$f":"Materiais_Consumo!B104","v":"020111 - SINAPI"},{"$f":"Materiais_Consumo!C104","v":"Fita isolante adesiva antichama 19mm x 20m"},{"$f":"Materiais_Consumo!D104","v":"un"},{"$f":"Materiais_Consumo!E104","v":1512},{"$f":"Materiais_Consumo!F104","v":0},0,{"$error":"#REF!"}]
["8.2.31",{"$f":"Materiais_Consumo!B105","v":"01118 - ORSE"},{"$f":"Materiais_Consumo!C105","v":"Interruptor simples com 01 tecla"},{"$f":"Materiais_Consumo!D105","v":"un"},{"$f":"Materiais_Consumo!E105","v":4},{"$f":"Materiais_Consumo!F105","v":0},0,{"$error":"#REF!"}]
["8.2.32",{"$f":"Materiais_Consumo!B106","v":"01119 - ORSE"},{"$f":"Materiais_Consumo!C106","v":"Interruptor simples com 02 teclas"},{"$f":"Materiais_Consumo!D106","v":"un"},{"$f":"Materiais_Consumo!E106","v":4},{"$f":"Materiais_Consumo!F106","v":0},0,{"$error":"#REF!"}]
["8.2.33",{"$f":"Materiais_Consumo!B107","v":"38070 - SINAPI"},{"$f":"Materiais_Consumo!C107","v":"Interruptor tipo three-way (paralelos) com 02 teclas"},{"$f":"Materiais_Consumo!D107","v":"un"},{"$f":"Materiais_Consumo!E107","v":4},{"$f":"Materiais_Consumo!F107","v":0},0,{"$error":"#REF!"}]
["8.2.34",{"$f":"Materiais_Consumo!B108","v":0},{"$f":"Materiais_Consumo!C108","v":"Limpador de contatos elétricos 300ml"},{"$f":"Materiais_Consumo!D108","v":"un"},{"$f":"Materiais_Consumo!E108","v":200},{"$f":"Materiais_Consumo!F108","v":0},0,{"$error":"#REF!"}]
["8.2.35",{"$f":"Materiais_Consumo!B109","v":"004221 - SINAPI"},{"$f":"Materiais_Consumo!C109","v":"Diesel comum (l)"},{"$f":"Materiais_Consumo!D109","v":"l"},{"$f":"Materiais_Consumo!E109","v":9720},{"$f":"Materiais_Consumo!F109","v":0},0,{"$error":"#REF!"}]
["8.2.36",{"$f":"Materiais_Consumo!B110","v":0},{"$f":"Materiais_Consumo!C110","v":"Pano para limpeza"},{"$f":"Materiais_Consumo!D110","v":" kg "},{"$f":"Materiais_Consumo!E110","v":50},{"$f":"Materiais_Consumo!F110","v":0},0,{"$error":"#REF!"}]
["8.2.37",{"$f":"Materiais_Consumo!B111","v":"11443 - ORSE"},{"$f":"Materiais_Consumo!C111","v":"Pincel - kit 03 pincéis 1/2\" 1\" 1.1/2\""},{"$f":"Materiais_Consumo!D111","v":"un"},{"$f":"Materiais_Consumo!E111","v":76},{"$f":"Materiais_Consumo!F111","v":0},0,{"$error":"#REF!"}]
["8.2.38",{"$f":"Materiais_Consumo!B112","v":0},{"$f":"Materiais_Consumo!C112","v":"Recarga de gás SF6 (hexafluoreto de enxofre) -52,16 kg"},{"$f":"Materiais_Consumo!D112","v":"un"},{"$f":"Materiais_Consumo!E112","v":2},{"$f":"Materiais_Consumo!F112","v":0},0,{"$error":"#REF!"}]
["8.2.39",{"$f":"Materiais_Consumo!B113","v":0},{"$f":"Materiais_Consumo!C113","v":"Sabão líquido neutro (5 l)"},{"$f":"Materiais_Consumo!D113","v":"un"},{"$f":"Materiais_Consumo!E113","v":54},{"$f":"Materiais_Consumo!F113","v":0},0,{"$error":"#REF!"}]
["8.2.40",{"$f":"Materiais_Consumo!B114","v":"02922 - ORSE"},{"$f":"Materiais_Consumo!C114","v":"Solvente/Desengraxante de alta rigidez dielétrica  1l"},{"$f":"Materiais_Consumo!D114","v":"un"},{"$f":"Materiais_Consumo!E114","v":36},{"$f":"Materiais_Consumo!F114","v":0},0,{"$error":"#REF!"}]
["8.2.41",{"$f":"Materiais_Consumo!B115","v":"12377 - ORSE*"},{"$f":"Materiais_Consumo!C115","v":"Terminal isolado tipo agulha para condutores de 0,5 a 1,5mm² (pct c/ 100)"},{"$f":"Materiais_Consumo!D115","v":"un"},{"$f":"Materiais_Consumo!E115","v":300},{"$f":"Materiais_Consumo!F115","v":0},0,{"$error":"#REF!"}]
["8.2.42",{"$f":"Materiais_Consumo!B116","v":"12377 - ORSE*"},{"$f":"Materiais_Consumo!C116","v":"Terminal isolado tipo agulha para condutores de 1,5 a 2,5 mm² (pct c/ 100)"},{"$f":"Materiais_Consumo!D116","v":"un"},{"$f":"Materiais_Consumo!E116","v":300},{"$f":"Materiais_Consumo!F116","v":0},0,{"$error":"#REF!"}]
["8.2.43",{"$f":"Materiais_Consumo!B117","v":"07948 - ORSE*"},{"$f":"Materiais_Consumo!C117","v":"Terminal isolado tipo agulha para condutores de 4 a 6 mm² (pct c/ 100)"},{"$f":"Materiais_Consumo!D117","v":"un"},{"$f":"Materiais_Consumo!E117","v":300},{"$f":"Materiais_Consumo!F117","v":0},0,{"$error":"#REF!"}]
["8.2.44",{"$f":"Materiais_Consumo!B118","v":"04669 - ORSE"},{"$f":"Materiais_Consumo!C118","v":"Terminal de compressão – 10mm²"},{"$f":"Materiais_Consumo!D118","v":"un"},{"$f":"Materiais_Consumo!E118","v":400},{"$f":"Materiais_Consumo!F118","v":0},0,{"$error":"#REF!"}]
["8.2.45",{"$f":"Materiais_Consumo!B119","v":"04670 - ORSE"},{"$f":"Materiais_Consumo!C119","v":"Terminal de compressão – 16mm²"},{"$f":"Materiais_Consumo!D119","v":"un"},{"$f":"Materiais_Consumo!E119","v":400},{"$f":"Materiais_Consumo!F119","v":0},0,{"$error":"#REF!"}]
["8.2.46",{"$f":"Materiais_Consumo!B120","v":"02676 - ORSE"},{"$f":"Materiais_Consumo!C120","v":"Terminal de compressão – 25mm²"},{"$f":"Materiais_Consumo!D120","v":"un"},{"$f":"Materiais_Consumo!E120","v":200},{"$f":"Materiais_Consumo!F120","v":0},0,{"$error":"#REF!"}]
["8.2.47",{"$f":"Materiais_Consumo!B121","v":"02677 - ORSE"},{"$f":"Materiais_Consumo!C121","v":"Terminal de compressão – 35mm²"},{"$f":"Materiais_Consumo!D121","v":"un"},{"$f":"Materiais_Consumo!E121","v":200},{"$f":"Materiais_Consumo!F121","v":0},0,{"$error":"#REF!"}]
["8.2.48",{"$f":"Materiais_Consumo!B122","v":"03559 - ORSE"},{"$f":"Materiais_Consumo!C122","v":"Terminal de compressão – 50mm²"},{"$f":"Materiais_Consumo!D122","v":"un"},{"$f":"Materiais_Consumo!E122","v":100},{"$f":"Materiais_Consumo!F122","v":0},0,{"$error":"#REF!"}]
["8.2.49",{"$f":"Materiais_Consumo!B123","v":"06911 - ORSE"},{"$f":"Materiais_Consumo!C123","v":"Terminal de compressão – 70mm²"},{"$f":"Materiais_Consumo!D123","v":"un"},{"$f":"Materiais_Consumo!E123","v":100},{"$f":"Materiais_Consumo!F123","v":0},0,{"$error":"#REF!"}]
["8.2.50",{"$f":"Materiais_Consumo!B124","v":"03153 - ORSE"},{"$f":"Materiais_Consumo!C124","v":"Terminal de compressão – 95mm²"},{"$f":"Materiais_Consumo!D124","v":"un"},{"$f":"Materiais_Consumo!E124","v":50},{"$f":"Materiais_Consumo!F124","v":0},0,{"$error":"#REF!"}]
["8.2.51",{"$f":"Materiais_Consumo!B125","v":"04673 - ORSE"},{"$f":"Materiais_Consumo!C125","v":"Terminal de compressão – 120mm²"},{"$f":"Materiais_Consumo!D125","v":"un"},{"$f":"Materiais_Consumo!E125","v":50},{"$f":"Materiais_Consumo!F125","v":0},0,{"$error":"#REF!"}]
["8.2.52",{"$f":"Materiais_Consumo!B126","v":"01587 - SINAPI"},{"$f":"Materiais_Consumo!C126","v":"Terminal de pressão – 35mm²"},{"$f":"Materiais_Consumo!D126","v":"un"},{"$f":"Materiais_Consumo!E126","v":50},{"$f":"Materiais_Consumo!F126","v":0},0,{"$error":"#REF!"}]
["8.2.53",{"$f":"Materiais_Consumo!B127","v":"01588 - SINAPI"},{"$f":"Materiais_Consumo!C127","v":"Terminal de pressão – 50mm²"},{"$f":"Materiais_Consumo!D127","v":"un"},{"$f":"Materiais_Consumo!E127","v":40},{"$f":"Materiais_Consumo!F127","v":0},0,{"$error":"#REF!"}]
["8.2.54",{"$f":"Materiais_Consumo!B128","v":"01589 - SINAPI"},{"$f":"Materiais_Consumo!C128","v":"Terminal de pressão – 70mm²"},{"$f":"Materiais_Consumo!D128","v":"un"},{"$f":"Materiais_Consumo!E128","v":40},{"$f":"Materiais_Consumo!F128","v":0},0,{"$error":"#REF!"}]
["8.3.",null,{"$f":"Materiais_Consumo!C132","v":"MATERIAL DE CONSUMO - CIVIL"},null,null,null,{"$f":"SUBTOTAL(109,G305:G348)","v":0},{"$error":"#REF!"}]
["8.3.1",{"$f":"Materiais_Consumo!B133","v":"00034 - SINAPI"},{"$f":"Materiais_Consumo!C133","v":"Aço D=10 mm CA 50"},{"$f":"Materiais_Consumo!D133","v":"kg"},{"$f":"Materiais_Consumo!E133","v":3112},{"$f":"Materiais_Consumo!F133","v":0},{"$f":"ROUND(E305*F305,2)","v":0},{"$error":"#REF!"}]
["8.3.2",{"$f":"Materiais_Consumo!B134","v":"00031 - SINAPI"},{"$f":"Materiais_Consumo!C134","v":"Aço D=12 mm CA 50"},{"$f":"Materiais_Consumo!D134","v":"kg"},{"$f":"Materiais_Consumo!E134","v":3112},{"$f":"Materiais_Consumo!F134","v":0},0,{"$error":"#REF!"}]
["8.3.3",{"$f":"Materiais_Consumo!B135","v":"00039 - SINAPI"},{"$f":"Materiais_Consumo!C135","v":"Aço D=5.0 mm CA 60"},{"$f":"Materiais_Consumo!D135","v":"kg"},{"$f":"Materiais_Consumo!E135","v":3112},{"$f":"Materiais_Consumo!F135","v":0},0,{"$error":"#REF!"}]
["8.3.4",{"$f":"Materiais_Consumo!B136","v":"00032 - SINAPI"},{"$f":"Materiais_Consumo!C136","v":"Aço D=6.3 mm CA 50"},{"$f":"Materiais_Consumo!D136","v":"kg"},{"$f":"Materiais_Consumo!E136","v":3112},{"$f":"Materiais_Consumo!F136","v":0},0,{"$error":"#REF!"}]
["8.3.5",{"$f":"Materiais_Consumo!B137","v":"00033 - SINAPI"},{"$f":"Materiais_Consumo!C137","v":"Aço D=8.0 mm CA 50"},{"$f":"Materiais_Consumo!D137","v":"kg"},{"$f":"Materiais_Consumo!E137","v":3112},{"$f":"Materiais_Consumo!F137","v":0},0,{"$error":"#REF!"}]
["8.3.6",{"$f":"Materiais_Consumo!B138","v":"00340 - SINAPI"},{"$f":"Materiais_Consumo!C138","v":"Arame farpado nº. 16 galvanizado Simples"},{"$f":"Materiais_Consumo!D138","v":"m"},{"$f":"Materiais_Consumo!E138","v":2223},{"$f":"Materiais_Consumo!F138","v":0},0,{"$error":"#REF!"}]
["8.3.7",{"$f":"Materiais_Consumo!B139","v":"00334 - SINAPI"},{"$f":"Materiais_Consumo!C139","v":"Arame galvanizado 8BWG, d=4,19mm"},{"$f":"Materiais_Consumo!D139","v":"kg"},{"$f":"Materiais_Consumo!E139","v":240},{"$f":"Materiais_Consumo!F139","v":0},0,{"$error":"#REF!"}]
["8.3.8",{"$f":"Materiais_Consumo!B140","v":"00337 - SINAPI"},{"$f":"Materiais_Consumo!C140","v":"Arame recozido n.º 18"},{"$f":"Materiais_Consumo!D140","v":"kg"},{"$f":"Materiais_Consumo!E140","v":134},{"$f":"Materiais_Consumo!F140","v":0},0,{"$error":"#REF!"}]
["8.3.9",{"$f":"Materiais_Consumo!B141","v":"00367 - SINAPI"},{"$f":"Materiais_Consumo!C141","v":"Areia grossa comercial, posto em obra"},{"$f":"Materiais_Consumo!D141","v":"m³"},{"$f":"Materiais_Consumo!E141","v":178},{"$f":"Materiais_Consumo!F141","v":0},0,{"$error":"#REF!"}]
["8.3.10",{"$f":"Materiais_Consumo!B142","v":"6884 - ORSE"},{"$f":"Materiais_Consumo!C142","v":"Argamassa para grouteamento "},{"$f":"Materiais_Consumo!D142","v":"kg"},{"$f":"Materiais_Consumo!E142","v":1112},{"$f":"Materiais_Consumo!F142","v":0},0,{"$error":"#REF!"}]
["8.3.11",{"$f":"Materiais_Consumo!B143","v":"004729 - SINAPI"},{"$f":"Materiais_Consumo!C143","v":"Pedra britada comercial (n.º 0 a 5)"},{"$f":"Materiais_Consumo!D143","v":"m³"},{"$f":"Materiais_Consumo!E143","v":223},{"$f":"Materiais_Consumo!F143","v":0},0,{"$error":"#REF!"}]
["8.3.12",{"$f":"Materiais_Consumo!B144","v":"04513 - SINAPI"},{"$f":"Materiais_Consumo!C144","v":"Caibro de 5x5cm "},{"$f":"Materiais_Consumo!D144","v":"m"},{"$f":"Materiais_Consumo!E144","v":1334},{"$f":"Materiais_Consumo!F144","v":0},0,{"$error":"#REF!"}]
["8.3.13",{"$f":"Materiais_Consumo!B145","v":"001106 - SINAPI"},{"$f":"Materiais_Consumo!C145","v":"Cal hidratada"},{"$f":"Materiais_Consumo!D145","v":"kg"},{"$f":"Materiais_Consumo!E145","v":889},{"$f":"Materiais_Consumo!F145","v":0},0,{"$error":"#REF!"}]
["8.3.14",{"$f":"Materiais_Consumo!B146","v":"001379 - SINAPI"},{"$f":"Materiais_Consumo!C146","v":"Cimento CPII-32"},{"$f":"Materiais_Consumo!D146","v":"kg"},{"$f":"Materiais_Consumo!E146","v":111112},{"$f":"Materiais_Consumo!F146","v":0},0,{"$error":"#REF!"}]
["8.3.15",{"$f":"Materiais_Consumo!B147","v":"001358 - SINAPI"},{"$f":"Materiais_Consumo!C147","v":"Compensado resinado 17mm"},{"$f":"Materiais_Consumo!D147","v":"m²"},{"$f":"Materiais_Consumo!E147","v":96},{"$f":"Materiais_Consumo!F147","v":0},0,{"$error":"#REF!"}]
["8.3.16",{"$f":"Materiais_Consumo!B148","v":"002692 - SINAPI"},{"$f":"Materiais_Consumo!C148","v":"Desmoldante"},{"$f":"Materiais_Consumo!D148","v":"l"},{"$f":"Materiais_Consumo!E148","v":86},{"$f":"Materiais_Consumo!F148","v":0},0,{"$f":"ROUND(G320/G$8,4)","v":{"$error":"#REF!"}}]
["8.3.17",{"$f":"Materiais_Consumo!B149","v":"004221 - SINAPI"},{"$f":"Materiais_Consumo!C149","v":"Diesel comum (l)"},{"$f":"Materiais_Consumo!D149","v":"l"},{"$f":"Materiais_Consumo!E149","v":56000},{"$f":"Materiais_Consumo!F149","v":0},0,{"$error":"#REF!"}]
["8.3.18",{"$f":"Materiais_Consumo!B150","v":"020111 - SINAPI"},{"$f":"Materiais_Consumo!C150","v":"Fita isolante adesiva antichama 19mm x 20m"},{"$f":"Materiais_Consumo!D150","v":"un"},{"$f":"Materiais_Consumo!E150","v":16},{"$f":"Materiais_Consumo!F150","v":0},0,{"$error":"#REF!"}]
["8.3.19",{"$f":"Materiais_Consumo!B151","v":" M2018 - SICRO3/PE"},{"$f":"Materiais_Consumo!C151","v":"Gastalho 10x2,5cm"},{"$f":"Materiais_Consumo!D151","v":"m"},{"$f":"Materiais_Consumo!E151","v":1334},{"$f":"Materiais_Consumo!F151","v":0},0,{"$error":"#REF!"}]
["8.3.20",{"$f":"Materiais_Consumo!B152","v":"005076 - SINAPI"},{"$f":"Materiais_Consumo!C152","v":"Grampo para cerca galvanizado 1 x 9"},{"$f":"Materiais_Consumo!D152","v":"kg"},{"$f":"Materiais_Consumo!E152","v":96},{"$f":"Materiais_Consumo!F152","v":0},0,{"$error":"#REF!"}]
["8.3.21",{"$f":"Materiais_Consumo!B153","v":"003681 - SINAPI"},{"$f":"Materiais_Consumo!C153","v":"Junta de dilatação (O-22 ou similar)"},{"$f":"Materiais_Consumo!D153","v":"m"},{"$f":"Materiais_Consumo!E153","v":134},{"$f":"Materiais_Consumo!F153","v":0},0,{"$error":"#REF!"}]
["8.3.22",{"$f":"Materiais_Consumo!B154","v":"014077 - SINAPI"},{"$f":"Materiais_Consumo!C154","v":"Junta de dilatação - Perfil elastomerico pre-formado em epmd, para junta de dilatacao de pisos com pouca solicitacao, 15 mm de largura, movimentacao de 11 a 19 mm"},{"$f":"Materiais_Consumo!D154","v":"m"},{"$f":"Materiais_Consumo!E154","v":134},{"$f":"Materiais_Consumo!F154","v":0},0,{"$error":"#REF!"}]
["8.3.23",{"$f":"Materiais_Consumo!B155","v":"38780 - SINAPI/PE"},{"$f":"Materiais_Consumo!C155","v":"Lâmpada fluorescente compacta, branca 20 W, base E27 (127/220 V)"},{"$f":"Materiais_Consumo!D155","v":"un"},{"$f":"Materiais_Consumo!E155","v":134},{"$f":"Materiais_Consumo!F155","v":0},0,{"$error":"#REF!"}]
["8.3.24",{"$f":"Materiais_Consumo!B156","v":"038780 - SINAPI"},{"$f":"Materiais_Consumo!C156","v":"Lâmpada fluorecente de 20W"},{"$f":"Materiais_Consumo!D156","v":"un"},{"$f":"Materiais_Consumo!E156","v":134},{"$f":"Materiais_Consumo!F156","v":0},0,{"$error":"#REF!"}]
["8.3.25",{"$f":"Materiais_Consumo!B157","v":"003751 - SINAPI"},{"$f":"Materiais_Consumo!C157","v":"Lâmpada vapor mercúrio 400 W (base E40)"},{"$f":"Materiais_Consumo!D157","v":"un"},{"$f":"Materiais_Consumo!E157","v":16},{"$f":"Materiais_Consumo!F157","v":0},0,{"$error":"#REF!"}]
["8.3.26",{"$f":"Materiais_Consumo!B158","v":"003767 - SINAPI"},{"$f":"Materiais_Consumo!C158","v":"Lixa nº120"},{"$f":"Materiais_Consumo!D158","v":"un"},{"$f":"Materiais_Consumo!E158","v":40},{"$f":"Materiais_Consumo!F158","v":0},0,{"$error":"#REF!"}]
["8.3.27",{"$f":"Materiais_Consumo!B159","v":"003777 - SINAPI"},{"$f":"Materiais_Consumo!C159","v":"Lona plástica - 4 x 100m - 12kg"},{"$f":"Materiais_Consumo!D159","v":"m²"},{"$f":"Materiais_Consumo!E159","v":8},{"$f":"Materiais_Consumo!F159","v":0},0,{"$error":"#REF!"}]
["8.3.28",{"$f":"Materiais_Consumo!B160","v":"025865 - SINAPI"},{"$f":"Materiais_Consumo!C160","v":"Manta termoplástica PEAD, geomembrana lisa, e=2 mm"},{"$f":"Materiais_Consumo!D160","v":"m²"},{"$f":"Materiais_Consumo!E160","v":734},{"$f":"Materiais_Consumo!F160","v":0},0,{"$error":"#REF!"}]
["8.3.29",{"$f":"Materiais_Consumo!B161","v":"004051 - SINAPI"},{"$f":"Materiais_Consumo!C161","v":"Massa corrida - latão 18 l"},{"$f":"Materiais_Consumo!D161","v":"un"},{"$f":"Materiais_Consumo!E161","v":23},{"$f":"Materiais_Consumo!F161","v":0},0,{"$error":"#REF!"}]
["8.3.30",{"$f":"Materiais_Consumo!B162","v":"2866 - ORSE"},{"$f":"Materiais_Consumo!C162","v":"Mastique elástico base silicone"},{"$f":"Materiais_Consumo!D162","v":"l"},{"$f":"Materiais_Consumo!E162","v":67},{"$f":"Materiais_Consumo!F162","v":0},0,{"$error":"#REF!"}]
["8.3.31",{"$f":"Materiais_Consumo!B163","v":"004108 - SINAPI"},{"$f":"Materiais_Consumo!C163","v":"Mourão de concreto reto para cercas"},{"$f":"Materiais_Consumo!D163","v":"un"},{"$f":"Materiais_Consumo!E163","v":224},{"$f":"Materiais_Consumo!F163","v":0},0,{"$error":"#REF!"}]
["8.3.32",{"$f":"Materiais_Consumo!B164","v":0},{"$f":"Materiais_Consumo!C164","v":"Perfil para fixação das geomembrana Barra de 6m "},{"$f":"Materiais_Consumo!D164","v":"m"},{"$f":"Materiais_Consumo!E164","v":134},{"$f":"Materiais_Consumo!F164","v":0},0,{"$error":"#REF!"}]
["8.3.33",{"$f":"Materiais_Consumo!B165","v":"11442 - ORSE"},{"$f":"Materiais_Consumo!C165","v":"Pincel 1\""},{"$f":"Materiais_Consumo!D165","v":"un"},{"$f":"Materiais_Consumo!E165","v":89},{"$f":"Materiais_Consumo!F165","v":0},0,{"$error":"#REF!"}]
["8.3.34",{"$f":"Materiais_Consumo!B166","v":"005075 - SINAPI"},{"$f":"Materiais_Consumo!C166","v":"Prego 18x30"},{"$f":"Materiais_Consumo!D166","v":"kg"},{"$f":"Materiais_Consumo!E166","v":214},{"$f":"Materiais_Consumo!F166","v":0},0,{"$error":"#REF!"}]
["8.3.35",{"$f":"Materiais_Consumo!B167","v":"038390 - SINAPI"},{"$f":"Materiais_Consumo!C167","v":"Rolo de lã de carneiro - 20cm "},{"$f":"Materiais_Consumo!D167","v":"un"},{"$f":"Materiais_Consumo!E167","v":89},{"$f":"Materiais_Consumo!F167","v":0},0,{"$error":"#REF!"}]
["8.3.36",{"$f":"Materiais_Consumo!B168","v":"038393 - SINAPI"},{"$f":"Materiais_Consumo!C168","v":"Rolo de espuma poliéster 23 cm com cabo"},{"$f":"Materiais_Consumo!D168","v":"un"},{"$f":"Materiais_Consumo!E168","v":89},{"$f":"Materiais_Consumo!F168","v":0},0,{"$error":"#REF!"}]
["8.3.37",{"$f":"Materiais_Consumo!B169","v":"012296 - SINAPI"},{"$f":"Materiais_Consumo!C169","v":"Soquete de porcelana base E27, para uso ao tempo, para lâmpadas"},{"$f":"Materiais_Consumo!D169","v":"un"},{"$f":"Materiais_Consumo!E169","v":16},{"$f":"Materiais_Consumo!F169","v":0},0,{"$error":"#REF!"}]
["8.3.38",{"$f":"Materiais_Consumo!B170","v":"0093 - SINAPI"},{"$f":"Materiais_Consumo!C170","v":"Tábua de madeira de lei, 2,5x15cm (1x6) não aparelhada"},{"$f":"Materiais_Consumo!D170","v":"m"},{"$f":"Materiais_Consumo!E170","v":223},{"$f":"Materiais_Consumo!F170","v":0},0,{"$error":"#REF!"}]
["8.3.39",{"$f":"Materiais_Consumo!B171","v":"005318 - SINAPI*"},{"$f":"Materiais_Consumo!C171","v":"Thinner/águarras - 5 l"},{"$f":"Materiais_Consumo!D171","v":"un"},{"$f":"Materiais_Consumo!E171","v":9},{"$f":"Materiais_Consumo!F171","v":0},0,{"$error":"#REF!"}]
["8.3.40",{"$f":"Materiais_Consumo!B172","v":"07258 - SINAPI"},{"$f":"Materiais_Consumo!C172","v":"Tijolo comum (5,5x10x20) cm"},{"$f":"Materiais_Consumo!D172","v":"un"},{"$f":"Materiais_Consumo!E172","v":10667},{"$f":"Materiais_Consumo!F172","v":0},0,{"$error":"#REF!"}]
["8.3.41",{"$f":"Materiais_Consumo!B173","v":"00154 - SINAPI"},{"$f":"Materiais_Consumo!C173","v":"Tinta Alcatrão de Hulha -  galão de 3,6 litros"},{"$f":"Materiais_Consumo!D173","v":"l"},{"$f":"Materiais_Consumo!E173","v":9},{"$f":"Materiais_Consumo!F173","v":0},0,{"$error":"#REF!"}]
["8.3.42",{"$f":"Materiais_Consumo!B174","v":"35691 - SINAPI"},{"$f":"Materiais_Consumo!C174","v":"Tinta Latex  PVA"},{"$f":"Materiais_Consumo!D174","v":"l"},{"$f":"Materiais_Consumo!E174","v":221},{"$f":"Materiais_Consumo!F174","v":0},0,{"$error":"#REF!"}]
["8.3.43",{"$f":"Materiais_Consumo!B175","v":"38386 - SINAPI"},{"$f":"Materiais_Consumo!C175","v":"Trincha de 2 \""},{"$f":"Materiais_Consumo!D175","v":"un"},{"$f":"Materiais_Consumo!E175","v":89},{"$f":"Materiais_Consumo!F175","v":0},0,{"$error":"#REF!"}]
["8.3.44",{"$f":"Materiais_Consumo!B176","v":"38400 - SINAPI"},{"$f":"Materiais_Consumo!C176","v":"Vassourão 40cm com cabo"},{"$f":"Materiais_Consumo!D176","v":"un"},{"$f":"Materiais_Consumo!E176","v":110},{"$f":"Materiais_Consumo!F176","v":0},0,{"$error":"#REF!"}]
["8.4.",null,{"$f":"Materiais_Consumo!C180","v":"MANUTENÇÃO DE CANTEIRO - ESCRITÓRIO"},null,null,null,{"$f":"SUBTOTAL(109,G350)","v":0},{"$error":"#REF!"}]
["8.4.1",{"$f":"Materiais_Consumo!B181","v":0},{"$f":"Materiais_Consumo!C181","v":"Taxa de manutenção de canteiro, incluindo despesas com material de expediente, material de limpeza, água, energia, comunicação, entre outras"},{"$f":"Materiais_Consumo!D181","v":"un x mês"},{"$f":"Materiais_Consumo!E181","v":36},{"$f":"Materiais_Consumo!F181","v":0},0,{"$error":"#REF!"}]
[]
["9.",null,{"$f":"Ferramentas!C13","v":"FERRAMENTAS"},null,null,null,{"$f":"SUBTOTAL(109,G353:G602)","v":0},{"$f":"ROUND(G352/G$8,4)","v":{"$error":"#REF!"}}]
["9.1.",null,{"$f":"Ferramentas!C15","v":"FERRAMENTAS - MECÂNICA"},null,null,null,{"$f":"SUBTOTAL(109,G354:G435)","v":0},{"$error":"#REF!"}]
["9.1.1",{"$f":"Ferramentas!B16","v":0},{"$f":"Ferramentas!C16","v":"Alavanca para mecânico 38,4 cm "},{"$f":"Ferramentas!D16","v":"un"},{"$f":"Ferramentas!E16","v":4},{"$f":"Ferramentas!F16","v":0},0,{"$error":"#REF!"}]
["9.1.2",{"$f":"Ferramentas!B17","v":"11240 - ORSE"},{"$f":"Ferramentas!C17","v":"Alicate de bico com isolamento para 1000V"},{"$f":"Ferramentas!D17","v":"un"},{"$f":"Ferramentas!E17","v":7},{"$f":"Ferramentas!F17","v":0},0,{"$error":"#REF!"}]
["9.1.3",{"$f":"Ferramentas!B18","v":"38470 - SINAPI"},{"$f":"Ferramentas!C18","v":"Alicate de corte diagonal"},{"$f":"Ferramentas!D18","v":"un"},{"$f":"Ferramentas!E18","v":7},{"$f":"Ferramentas!F18","v":0},0,{"$error":"#REF!"}]
["9.1.4",{"$f":"Ferramentas!B19","v":"38471 - SINAPI"},{"$f":"Ferramentas!C19","v":"Alicate para anéis externo pontas retas"},{"$f":"Ferramentas!D19","v":"un"},{"$f":"Ferramentas!E19","v":7},{"$f":"Ferramentas!F19","v":0},0,{"$error":"#REF!"}]
["9.1.5",{"$f":"Ferramentas!B20","v":"38471 - SINAPI"},{"$f":"Ferramentas!C20","v":"Alicate para anéis externos ponta curva 90°"},{"$f":"Ferramentas!D20","v":"un"},{"$f":"Ferramentas!E20","v":7},{"$f":"Ferramentas!F20","v":0},0,{"$error":"#REF!"}]
["9.1.6",{"$f":"Ferramentas!B21","v":"38471 - SINAPI"},{"$f":"Ferramentas!C21","v":"Alicate para anéis internos"},{"$f":"Ferramentas!D21","v":"un"},{"$f":"Ferramentas!E21","v":7},{"$f":"Ferramentas!F21","v":0},0,{"$error":"#REF!"}]
["9.1.7",{"$f":"Ferramentas!B22","v":"11275 - ORSE"},{"$f":"Ferramentas!C22","v":"Alicate de pressão, 10\", 250mm"},{"$f":"Ferramentas!D22","v":"un"},{"$f":"Ferramentas!E22","v":7},{"$f":"Ferramentas!F22","v":0},0,{"$error":"#REF!"}]
["9.1.8",{"$f":"Ferramentas!B23","v":"11240 - ORSE"},{"$f":"Ferramentas!C23","v":"Alicate universal, 8\", com isolação 1000 V"},{"$f":"Ferramentas!D23","v":"un"},{"$f":"Ferramentas!E23","v":7},{"$f":"Ferramentas!F23","v":0},0,{"$error":"#REF!"}]
["9.1.9",{"$f":"Ferramentas!B24","v":"10585 - ORSE"},{"$f":"Ferramentas!C24","v":"Arco de Serra manual (com serra)"},{"$f":"Ferramentas!D24","v":"un"},{"$f":"Ferramentas!E24","v":4},{"$f":"Ferramentas!F24","v":0},0,{"$error":"#REF!"}]
["9.1.10",{"$f":"Ferramentas!B25","v":0},{"$f":"Ferramentas!C25","v":"Cabo de força com encaixe de ½”, ¾” e 1”"},{"$f":"Ferramentas!D25","v":"un"},{"$f":"Ferramentas!E25","v":4},{"$f":"Ferramentas!F25","v":0},0,{"$error":"#REF!"}]
["9.1.11",{"$f":"Ferramentas!B26","v":"5090 - SINAPI"},{"$f":"Ferramentas!C26","v":"Cadeado 30mm"},{"$f":"Ferramentas!D26","v":"un"},{"$f":"Ferramentas!E26","v":7},{"$f":"Ferramentas!F26","v":0},0,{"$error":"#REF!"}]
["9.1.12",{"$f":"Ferramentas!B27","v":"00425 - ORSE"},{"$f":"Ferramentas!C27","v":"Cadeado 40mm"},{"$f":"Ferramentas!D27","v":"un"},{"$f":"Ferramentas!E27","v":7},{"$f":"Ferramentas!F27","v":0},0,{"$error":"#REF!"}]
["9.1.13",{"$f":"Ferramentas!B28","v":0},{"$f":"Ferramentas!C28","v":"Calibrador de folgas de 0,03 mm - 0,50 mm"},{"$f":"Ferramentas!D28","v":"un"},{"$f":"Ferramentas!E28","v":4},{"$f":"Ferramentas!F28","v":0},0,{"$error":"#REF!"}]
["9.1.14",{"$f":"Ferramentas!B29","v":0},{"$f":"Ferramentas!C29","v":"Canivete sem ponta"},{"$f":"Ferramentas!D29","v":"un"},{"$f":"Ferramentas!E29","v":7},{"$f":"Ferramentas!F29","v":0},0,{"$error":"#REF!"}]
["9.1.15",{"$f":"Ferramentas!B30","v":0},{"$f":"Ferramentas!C30","v":"Chave ajustável n.º 08"},{"$f":"Ferramentas!D30","v":"un"},{"$f":"Ferramentas!E30","v":7},{"$f":"Ferramentas!F30","v":0},0,{"$error":"#REF!"}]
["9.1.16",{"$f":"Ferramentas!B31","v":0},{"$f":"Ferramentas!C31","v":"Chave combinada 1\" x 5/16\""},{"$f":"Ferramentas!D31","v":"un"},{"$f":"Ferramentas!E31","v":7},{"$f":"Ferramentas!F31","v":0},0,{"$error":"#REF!"}]
["9.1.17",{"$f":"Ferramentas!B32","v":0},{"$f":"Ferramentas!C32","v":"Chave combinada 22 mm"},{"$f":"Ferramentas!D32","v":"un"},{"$f":"Ferramentas!E32","v":7},{"$f":"Ferramentas!F32","v":0},0,{"$error":"#REF!"}]
["9.1.18",{"$f":"Ferramentas!B33","v":0},{"$f":"Ferramentas!C33","v":"Chave combinada n.º 5/16\""},{"$f":"Ferramentas!D33","v":"un"},{"$f":"Ferramentas!E33","v":7},{"$f":"Ferramentas!F33","v":0},0,{"$error":"#REF!"}]
["9.1.19",{"$f":"Ferramentas!B34","v":0},{"$f":"Ferramentas!C34","v":"Chave cruzada 8 x 150"},{"$f":"Ferramentas!D34","v":"un"},{"$f":"Ferramentas!E34","v":7},{"$f":"Ferramentas!F34","v":0},0,{"$error":"#REF!"}]
["9.1.20",{"$f":"Ferramentas!B35","v":0},{"$f":"Ferramentas!C35","v":"Chave de boca 3/4\" x 25/32\""},{"$f":"Ferramentas!D35","v":"un"},{"$f":"Ferramentas!E35","v":7},{"$f":"Ferramentas!F35","v":0},0,{"$error":"#REF!"}]
["9.1.21",{"$f":"Ferramentas!B36","v":0},{"$f":"Ferramentas!C36","v":"Chave de boca 5/16\" x 1/4\""},{"$f":"Ferramentas!D36","v":"un"},{"$f":"Ferramentas!E36","v":7},{"$f":"Ferramentas!F36","v":0},0,{"$error":"#REF!"}]
["9.1.22",{"$f":"Ferramentas!B37","v":0},{"$f":"Ferramentas!C37","v":"Chave de fenda 1/4x10"},{"$f":"Ferramentas!D37","v":"un"},{"$f":"Ferramentas!E37","v":7},{"$f":"Ferramentas!F37","v":0},0,{"$error":"#REF!"}]
["9.1.23",{"$f":"Ferramentas!B38","v":0},{"$f":"Ferramentas!C38","v":"Chave de fenda 1/8x3"},{"$f":"Ferramentas!D38","v":"un"},{"$f":"Ferramentas!E38","v":7},{"$f":"Ferramentas!F38","v":0},0,{"$error":"#REF!"}]
["9.1.24",{"$f":"Ferramentas!B39","v":0},{"$f":"Ferramentas!C39","v":"Chave de fenda 3/16x6"},{"$f":"Ferramentas!D39","v":"un"},{"$f":"Ferramentas!E39","v":7},{"$f":"Ferramentas!F39","v":0},0,{"$error":"#REF!"}]
["9.1.25",{"$f":"Ferramentas!B40","v":0},{"$f":"Ferramentas!C40","v":"Chave de fenda 3/8x10"},{"$f":"Ferramentas!D40","v":"un"},{"$f":"Ferramentas!E40","v":7},{"$f":"Ferramentas!F40","v":0},0,{"$error":"#REF!"}]
["9.1.26",{"$f":"Ferramentas!B41","v":0},{"$f":"Ferramentas!C41","v":"Chave de fenda 8x150"},{"$f":"Ferramentas!D41","v":"un"},{"$f":"Ferramentas!E41","v":7},{"$f":"Ferramentas!F41","v":0},0,{"$error":"#REF!"}]
["9.1.27",{"$f":"Ferramentas!B42","v":0},{"$f":"Ferramentas!C42","v":"Chave de fenda cruzada (Philips) 1/4\" x 1. 1/2\""},{"$f":"Ferramentas!D42","v":"un"},{"$f":"Ferramentas!E42","v":7},{"$f":"Ferramentas!F42","v":0},0,{"$error":"#REF!"}]
["9.1.28",{"$f":"Ferramentas!B43","v":0},{"$f":"Ferramentas!C43","v":"Chave de fenda tipo toco 1/4\" x 1. 1/2\""},{"$f":"Ferramentas!D43","v":"un"},{"$f":"Ferramentas!E43","v":7},{"$f":"Ferramentas!F43","v":0},0,{"$error":"#REF!"}]
["9.1.29",{"$f":"Ferramentas!B44","v":0},{"$f":"Ferramentas!C44","v":"Chave grifo n.º 8"},{"$f":"Ferramentas!D44","v":"un"},{"$f":"Ferramentas!E44","v":4},{"$f":"Ferramentas!F44","v":0},0,{"$error":"#REF!"}]
["9.1.30",{"$f":"Ferramentas!B45","v":0},{"$f":"Ferramentas!C45","v":"Chave grifo n.º 18"},{"$f":"Ferramentas!D45","v":"un"},{"$f":"Ferramentas!E45","v":4},{"$f":"Ferramentas!F45","v":0},0,{"$error":"#REF!"}]
["9.1.31",{"$f":"Ferramentas!B46","v":0},{"$f":"Ferramentas!C46","v":"Chave Philips"},{"$f":"Ferramentas!D46","v":"un"},{"$f":"Ferramentas!E46","v":7},{"$f":"Ferramentas!F46","v":0},0,{"$error":"#REF!"}]
["9.1.32",{"$f":"Ferramentas!B47","v":0},{"$f":"Ferramentas!C47","v":"Chave soquete tipo canhão 1/2\""},{"$f":"Ferramentas!D47","v":"un"},{"$f":"Ferramentas!E47","v":3},{"$f":"Ferramentas!F47","v":0},0,{"$error":"#REF!"}]
["9.1.33",{"$f":"Ferramentas!B48","v":0},{"$f":"Ferramentas!C48","v":"Chave soquete tipo canhão 1/4\""},{"$f":"Ferramentas!D48","v":"un"},{"$f":"Ferramentas!E48","v":3},{"$f":"Ferramentas!F48","v":0},0,{"$error":"#REF!"}]
["9.1.34",{"$f":"Ferramentas!B49","v":0},{"$f":"Ferramentas!C49","v":"Chave soquete tipo canhão 11/32\""},{"$f":"Ferramentas!D49","v":"un"},{"$f":"Ferramentas!E49","v":3},{"$f":"Ferramentas!F49","v":0},0,{"$error":"#REF!"}]
["9.1.35",{"$f":"Ferramentas!B50","v":0},{"$f":"Ferramentas!C50","v":"Chave soquete tipo canhão 3/8\""},{"$f":"Ferramentas!D50","v":"un"},{"$f":"Ferramentas!E50","v":3},{"$f":"Ferramentas!F50","v":0},0,{"$error":"#REF!"}]
["9.1.36",{"$f":"Ferramentas!B51","v":0},{"$f":"Ferramentas!C51","v":"Chave soquete tipo canhão 7/16\""},{"$f":"Ferramentas!D51","v":"un"},{"$f":"Ferramentas!E51","v":3},{"$f":"Ferramentas!F51","v":0},0,{"$error":"#REF!"}]
["9.1.37",{"$f":"Ferramentas!B52","v":0},{"$f":"Ferramentas!C52","v":"Chave soquete tipo canhão 9/16\""},{"$f":"Ferramentas!D52","v":"un"},{"$f":"Ferramentas!E52","v":3},{"$f":"Ferramentas!F52","v":0},0,{"$error":"#REF!"}]
["9.1.38",{"$f":"Ferramentas!B53","v":"12 - SINAPI"},{"$f":"Ferramentas!C53","v":"Escova de aço, com cabo, *4 X 15* fileiras de cerdas"},{"$f":"Ferramentas!D53","v":"un"},{"$f":"Ferramentas!E53","v":3},{"$f":"Ferramentas!F53","v":0},0,{"$error":"#REF!"}]
["9.1.39",{"$f":"Ferramentas!B54","v":0},{"$f":"Ferramentas!C54","v":"Espátula n.º 38A-23"},{"$f":"Ferramentas!D54","v":"un"},{"$f":"Ferramentas!E54","v":7},{"$f":"Ferramentas!F54","v":0},0,{"$error":"#REF!"}]
["9.1.40",{"$f":"Ferramentas!B55","v":"38380 - SINAPI"},{"$f":"Ferramentas!C55","v":"Esquadro Profissional 12\" (em aço)"},{"$f":"Ferramentas!D55","v":"un"},{"$f":"Ferramentas!E55","v":4},{"$f":"Ferramentas!F55","v":0},0,{"$error":"#REF!"}]
["9.1.41",{"$f":"Ferramentas!B56","v":0},{"$f":"Ferramentas!C56","v":"Extensão 20m"},{"$f":"Ferramentas!D56","v":"un"},{"$f":"Ferramentas!E56","v":4},{"$f":"Ferramentas!F56","v":0},0,{"$error":"#REF!"}]
["9.1.42",{"$f":"Ferramentas!B57","v":0},{"$f":"Ferramentas!C57","v":"Faca reta desencapadora com isolamento para 1000V"},{"$f":"Ferramentas!D57","v":"un"},{"$f":"Ferramentas!E57","v":7},{"$f":"Ferramentas!F57","v":0},0,{"$error":"#REF!"}]
["9.1.43",{"$f":"Ferramentas!B58","v":0},{"$f":"Ferramentas!C58","v":"Funil para troca de óleo"},{"$f":"Ferramentas!D58","v":"un"},{"$f":"Ferramentas!E58","v":4},{"$f":"Ferramentas!F58","v":0},0,{"$error":"#REF!"}]
["9.1.44",{"$f":"Ferramentas!B59","v":0},{"$f":"Ferramentas!C59","v":"Jogo de broca de aço de 6 a 19mm (concreto parede)"},{"$f":"Ferramentas!D59","v":"un"},{"$f":"Ferramentas!E59","v":7},{"$f":"Ferramentas!F59","v":0},0,{"$error":"#REF!"}]
["9.1.45",{"$f":"Ferramentas!B60","v":0},{"$f":"Ferramentas!C60","v":"Jogo de chave catraca"},{"$f":"Ferramentas!D60","v":"un"},{"$f":"Ferramentas!E60","v":4},{"$f":"Ferramentas!F60","v":0},0,{"$error":"#REF!"}]
["9.1.46",{"$f":"Ferramentas!B61","v":0},{"$f":"Ferramentas!C61","v":"Jogo de chave combinada de nº 6 a nº 50"},{"$f":"Ferramentas!D61","v":"un"},{"$f":"Ferramentas!E61","v":7},{"$f":"Ferramentas!F61","v":0},0,{"$error":"#REF!"}]
["9.1.47",{"$f":"Ferramentas!B62","v":0},{"$f":"Ferramentas!C62","v":"Jogo de chave hexagonal (Allen) em polegada"},{"$f":"Ferramentas!D62","v":"un"},{"$f":"Ferramentas!E62","v":7},{"$f":"Ferramentas!F62","v":0},0,{"$error":"#REF!"}]
["9.1.48",{"$f":"Ferramentas!B63","v":0},{"$f":"Ferramentas!C63","v":"Jogo de chave hexagonal (Allen) nº 03 a 17mm"},{"$f":"Ferramentas!D63","v":"un"},{"$f":"Ferramentas!E63","v":7},{"$f":"Ferramentas!F63","v":0},0,{"$error":"#REF!"}]
["9.1.49",{"$f":"Ferramentas!B64","v":0},{"$f":"Ferramentas!C64","v":"Jogo de chave Phillips com isolamento para 1000V"},{"$f":"Ferramentas!D64","v":"un"},{"$f":"Ferramentas!E64","v":7},{"$f":"Ferramentas!F64","v":0},0,{"$error":"#REF!"}]
["9.1.50",{"$f":"Ferramentas!B65","v":0},{"$f":"Ferramentas!C65","v":"Jogo de chave soquete 22 mm a 50 mm"},{"$f":"Ferramentas!D65","v":"un"},{"$f":"Ferramentas!E65","v":4},{"$f":"Ferramentas!F65","v":0},0,{"$error":"#REF!"}]
["9.1.51",{"$f":"Ferramentas!B66","v":0},{"$f":"Ferramentas!C66","v":"Jogo de chaves de fenda com isolamento para 1000V"},{"$f":"Ferramentas!D66","v":"un"},{"$f":"Ferramentas!E66","v":7},{"$f":"Ferramentas!F66","v":0},0,{"$error":"#REF!"}]
["9.1.52",{"$f":"Ferramentas!B67","v":0},{"$f":"Ferramentas!C67","v":"Jogo de macho para reparo de roscas"},{"$f":"Ferramentas!D67","v":"un"},{"$f":"Ferramentas!E67","v":4},{"$f":"Ferramentas!F67","v":0},0,{"$error":"#REF!"}]
["9.1.53",{"$f":"Ferramentas!B68","v":0},{"$f":"Ferramentas!C68","v":"Lanterna grande - 10 Million"},{"$f":"Ferramentas!D68","v":"un"},{"$f":"Ferramentas!E68","v":4},{"$f":"Ferramentas!F68","v":0},0,{"$error":"#REF!"}]
["9.1.54",{"$f":"Ferramentas!B69","v":0},{"$f":"Ferramentas!C69","v":"Lima chata paralela murça 6\""},{"$f":"Ferramentas!D69","v":"un"},{"$f":"Ferramentas!E69","v":7},{"$f":"Ferramentas!F69","v":0},0,{"$error":"#REF!"}]
["9.1.55",{"$f":"Ferramentas!B70","v":0},{"$f":"Ferramentas!C70","v":"Lima paralela bastarda 6\""},{"$f":"Ferramentas!D70","v":"un"},{"$f":"Ferramentas!E70","v":7},{"$f":"Ferramentas!F70","v":0},0,{"$error":"#REF!"}]
["9.1.56",{"$f":"Ferramentas!B71","v":0},{"$f":"Ferramentas!C71","v":"Lima redonda murça 6\""},{"$f":"Ferramentas!D71","v":"un"},{"$f":"Ferramentas!E71","v":7},{"$f":"Ferramentas!F71","v":0},0,{"$error":"#REF!"}]
["9.1.57",{"$f":"Ferramentas!B72","v":0},{"$f":"Ferramentas!C72","v":"Limas diversas"},{"$f":"Ferramentas!D72","v":"un"},{"$f":"Ferramentas!E72","v":7},{"$f":"Ferramentas!F72","v":0},0,{"$error":"#REF!"}]
["9.1.58",{"$f":"Ferramentas!B73","v":0},{"$f":"Ferramentas!C73","v":"Mala de ferramenta com 05 gavetas"},{"$f":"Ferramentas!D73","v":"un"},{"$f":"Ferramentas!E73","v":7},{"$f":"Ferramentas!F73","v":0},0,{"$error":"#REF!"}]
["9.1.59",{"$f":"Ferramentas!B74","v":"4729 - ORSE"},{"$f":"Ferramentas!C74","v":"Marreta 1kg"},{"$f":"Ferramentas!D74","v":"un"},{"$f":"Ferramentas!E74","v":7},{"$f":"Ferramentas!F74","v":0},0,{"$error":"#REF!"}]
["9.1.60",{"$f":"Ferramentas!B75","v":0},{"$f":"Ferramentas!C75","v":"Marreta 2 kg"},{"$f":"Ferramentas!D75","v":"un"},{"$f":"Ferramentas!E75","v":4},{"$f":"Ferramentas!F75","v":0},0,{"$error":"#REF!"}]
["9.1.61",{"$f":"Ferramentas!B76","v":0},{"$f":"Ferramentas!C76","v":"Marreta de 5kg com cabo de madeira"},{"$f":"Ferramentas!D76","v":"un"},{"$f":"Ferramentas!E76","v":4},{"$f":"Ferramentas!F76","v":0},0,{"$error":"#REF!"}]
["9.1.62",{"$f":"Ferramentas!B77","v":0},{"$f":"Ferramentas!C77","v":"Martelo bola  1kg"},{"$f":"Ferramentas!D77","v":"un"},{"$f":"Ferramentas!E77","v":7},{"$f":"Ferramentas!F77","v":0},0,{"$error":"#REF!"}]
["9.1.63",{"$f":"Ferramentas!B78","v":0},{"$f":"Ferramentas!C78","v":"Martelo de borracha 32 Cm"},{"$f":"Ferramentas!D78","v":"un"},{"$f":"Ferramentas!E78","v":7},{"$f":"Ferramentas!F78","v":0},0,{"$f":"ROUND(G416/G$8,4)","v":{"$error":"#REF!"}}]
["9.1.64",{"$f":"Ferramentas!B79","v":0},{"$f":"Ferramentas!C79","v":"Nível a laser com base magnética e tripé"},{"$f":"Ferramentas!D79","v":"un"},{"$f":"Ferramentas!E79","v":4},{"$f":"Ferramentas!F79","v":0},0,{"$error":"#REF!"}]
["9.1.65",{"$f":"Ferramentas!B80","v":0},{"$f":"Ferramentas!C80","v":"Nível de mão – metálico e magnético"},{"$f":"Ferramentas!D80","v":"un"},{"$f":"Ferramentas!E80","v":4},{"$f":"Ferramentas!F80","v":0},0,{"$error":"#REF!"}]
["9.1.66",{"$f":"Ferramentas!B81","v":0},{"$f":"Ferramentas!C81","v":"Pé-de-cabra"},{"$f":"Ferramentas!D81","v":"un"},{"$f":"Ferramentas!E81","v":4},{"$f":"Ferramentas!F81","v":0},0,{"$error":"#REF!"}]
["9.1.67",{"$f":"Ferramentas!B82","v":"38377 - SINAPI"},{"$f":"Ferramentas!C82","v":"Prumo de centro"},{"$f":"Ferramentas!D82","v":"un"},{"$f":"Ferramentas!E82","v":4},{"$f":"Ferramentas!F82","v":0},0,{"$error":"#REF!"}]
["9.1.68",{"$f":"Ferramentas!B83","v":0},{"$f":"Ferramentas!C83","v":"Punção de centro 100 x 4 mm"},{"$f":"Ferramentas!D83","v":"un"},{"$f":"Ferramentas!E83","v":7},{"$f":"Ferramentas!F83","v":0},0,{"$error":"#REF!"}]
["9.1.69",{"$f":"Ferramentas!B84","v":0},{"$f":"Ferramentas!C84","v":"Punção de centro 150 x 6 mm"},{"$f":"Ferramentas!D84","v":"un"},{"$f":"Ferramentas!E84","v":7},{"$f":"Ferramentas!F84","v":0},0,{"$error":"#REF!"}]
["9.1.70",{"$f":"Ferramentas!B85","v":0},{"$f":"Ferramentas!C85","v":"Saca pino 03 mm"},{"$f":"Ferramentas!D85","v":"un"},{"$f":"Ferramentas!E85","v":7},{"$f":"Ferramentas!F85","v":0},0,{"$error":"#REF!"}]
["9.1.71",{"$f":"Ferramentas!B86","v":0},{"$f":"Ferramentas!C86","v":"Saca pino 08mm"},{"$f":"Ferramentas!D86","v":"un"},{"$f":"Ferramentas!E86","v":7},{"$f":"Ferramentas!F86","v":0},0,{"$error":"#REF!"}]
["9.1.72",{"$f":"Ferramentas!B87","v":0},{"$f":"Ferramentas!C87","v":"Saca pino 17 mm"},{"$f":"Ferramentas!D87","v":"un"},{"$f":"Ferramentas!E87","v":7},{"$f":"Ferramentas!F87","v":0},0,{"$error":"#REF!"}]
["9.1.73",{"$f":"Ferramentas!B88","v":0},{"$f":"Ferramentas!C88","v":"Saca pino paralelo 150x4"},{"$f":"Ferramentas!D88","v":"un"},{"$f":"Ferramentas!E88","v":7},{"$f":"Ferramentas!F88","v":0},0,{"$error":"#REF!"}]
["9.1.74",{"$f":"Ferramentas!B89","v":0},{"$f":"Ferramentas!C89","v":"Saca pino paralelo 150x6"},{"$f":"Ferramentas!D89","v":"un"},{"$f":"Ferramentas!E89","v":7},{"$f":"Ferramentas!F89","v":0},0,{"$error":"#REF!"}]
["9.1.75",{"$f":"Ferramentas!B90","v":0},{"$f":"Ferramentas!C90","v":"Saca pino paralelo 150x8"},{"$f":"Ferramentas!D90","v":"un"},{"$f":"Ferramentas!E90","v":7},{"$f":"Ferramentas!F90","v":0},0,{"$error":"#REF!"}]
["9.1.76",{"$f":"Ferramentas!B91","v":0},{"$f":"Ferramentas!C91","v":"Saca polia 10\""},{"$f":"Ferramentas!D91","v":"un"},{"$f":"Ferramentas!E91","v":3},{"$f":"Ferramentas!F91","v":0},0,{"$error":"#REF!"}]
["9.1.77",{"$f":"Ferramentas!B92","v":0},{"$f":"Ferramentas!C92","v":"Soquete 65"},{"$f":"Ferramentas!D92","v":"un"},{"$f":"Ferramentas!E92","v":3},{"$f":"Ferramentas!F92","v":0},0,{"$error":"#REF!"}]
["9.1.78",{"$f":"Ferramentas!B93","v":0},{"$f":"Ferramentas!C93","v":"Soquete 70"},{"$f":"Ferramentas!D93","v":"un"},{"$f":"Ferramentas!E93","v":3},{"$f":"Ferramentas!F93","v":0},0,{"$error":"#REF!"}]
["9.1.79",{"$f":"Ferramentas!B94","v":0},{"$f":"Ferramentas!C94","v":"Soquete 75/55"},{"$f":"Ferramentas!D94","v":"un"},{"$f":"Ferramentas!E94","v":3},{"$f":"Ferramentas!F94","v":0},0,{"$error":"#REF!"}]
["9.1.80",{"$f":"Ferramentas!B95","v":0},{"$f":"Ferramentas!C95","v":"Talhadeira para mecânica"},{"$f":"Ferramentas!D95","v":"un"},{"$f":"Ferramentas!E95","v":7},{"$f":"Ferramentas!F95","v":0},0,{"$error":"#REF!"}]
["9.1.81",{"$f":"Ferramentas!B96","v":0},{"$f":"Ferramentas!C96","v":"Torquímetro de estalo 50 - 400 N.m"},{"$f":"Ferramentas!D96","v":"un"},{"$f":"Ferramentas!E96","v":3},{"$f":"Ferramentas!F96","v":0},0,{"$error":"#REF!"}]
["9.1.82",{"$f":"Ferramentas!B97","v":0},{"$f":"Ferramentas!C97","v":"Trena Metálica 8 m"},{"$f":"Ferramentas!D97","v":"un"},{"$f":"Ferramentas!E97","v":4},{"$f":"Ferramentas!F97","v":0},0,{"$error":"#REF!"}]
["9.2.",null,{"$f":"Ferramentas!C100","v":"FERRAMENTAS - ELÉTRICA"},null,null,null,{"$f":"SUBTOTAL(109,G437:G546)","v":0},{"$error":"#REF!"}]
["9.2.1",{"$f":"Ferramentas!B101","v":0},{"$f":"Ferramentas!C101","v":"Adaptador universal de tomadas"},{"$f":"Ferramentas!D101","v":"un"},{"$f":"Ferramentas!E101","v":46},{"$f":"Ferramentas!F101","v":0},0,{"$error":"#REF!"}]
["9.2.2",{"$f":"Ferramentas!B102","v":0},{"$f":"Ferramentas!C102","v":"Alavanca reta, 1,75 m"},{"$f":"Ferramentas!D102","v":"un"},{"$f":"Ferramentas!E102","v":10},{"$f":"Ferramentas!F102","v":0},0,{"$error":"#REF!"}]
["9.2.3",{"$f":"Ferramentas!B103","v":0},{"$f":"Ferramentas!C103","v":"Alicate bico chato/pato, 6\""},{"$f":"Ferramentas!D103","v":"un"},{"$f":"Ferramentas!E103","v":13},{"$f":"Ferramentas!F103","v":0},0,{"$error":"#REF!"}]
["9.2.4",{"$f":"Ferramentas!B104","v":"38470 - SINAPI"},{"$f":"Ferramentas!C104","v":"Alicate cortador de cabos diagonal, 6\""},{"$f":"Ferramentas!D104","v":"un"},{"$f":"Ferramentas!E104","v":23},{"$f":"Ferramentas!F104","v":0},0,{"$error":"#REF!"}]
["9.2.5",{"$f":"Ferramentas!B105","v":0},{"$f":"Ferramentas!C105","v":"Alicate cortador de cabos frontal, 6\""},{"$f":"Ferramentas!D105","v":"un"},{"$f":"Ferramentas!E105","v":13},{"$f":"Ferramentas!F105","v":0},0,{"$error":"#REF!"}]
["9.2.6",{"$f":"Ferramentas!B106","v":0},{"$f":"Ferramentas!C106","v":"Alicate/Tesoura cortador manual de cabos de até 300mm², 225mm"},{"$f":"Ferramentas!D106","v":"un"},{"$f":"Ferramentas!E106","v":13},{"$f":"Ferramentas!F106","v":0},0,{"$error":"#REF!"}]
["9.2.7",{"$f":"Ferramentas!B107","v":"38547 - SINAPI"},{"$f":"Ferramentas!C107","v":"Alicate crimpador, RJ-11/RJ-45, 200mm"},{"$f":"Ferramentas!D107","v":"un"},{"$f":"Ferramentas!E107","v":2},{"$f":"Ferramentas!F107","v":0},0,{"$error":"#REF!"}]
["9.2.8",{"$f":"Ferramentas!B108","v":"38547 - SINAPI"},{"$f":"Ferramentas!C108","v":"Alicate crimpador,  RG-59 e RG-6, 130mm"},{"$f":"Ferramentas!D108","v":"un"},{"$f":"Ferramentas!E108","v":2},{"$f":"Ferramentas!F108","v":0},0,{"$error":"#REF!"}]
["9.2.9",{"$f":"Ferramentas!B109","v":"11272 - ORSE"},{"$f":"Ferramentas!C109","v":"Alicate crimpador para terminais 1,0 a 10mm², 220mm"},{"$f":"Ferramentas!D109","v":"un"},{"$f":"Ferramentas!E109","v":13},{"$f":"Ferramentas!F109","v":0},0,{"$error":"#REF!"}]
["9.2.10",{"$f":"Ferramentas!B110","v":"11272 - ORSE"},{"$f":"Ferramentas!C110","v":"Alicate crimpador para terminais 10 a 120mm², 620mm"},{"$f":"Ferramentas!D110","v":"un"},{"$f":"Ferramentas!E110","v":1},{"$f":"Ferramentas!F110","v":0},0,{"$error":"#REF!"}]
["9.2.11",{"$f":"Ferramentas!B111","v":"11272 - ORSE"},{"$f":"Ferramentas!C111","v":"Alicate crimpador 11\", 280mm"},{"$f":"Ferramentas!D111","v":"un"},{"$f":"Ferramentas!E111","v":2},{"$f":"Ferramentas!F111","v":0},0,{"$error":"#REF!"}]
["9.2.12",{"$f":"Ferramentas!B112","v":0},{"$f":"Ferramentas!C112","v":"Alicate crimpador, hidráulico, prensa terminal,  com matriz de 10 a 300mm²"},{"$f":"Ferramentas!D112","v":"un"},{"$f":"Ferramentas!E112","v":1},{"$f":"Ferramentas!F112","v":0},0,{"$error":"#REF!"}]
["9.2.13",{"$f":"Ferramentas!B113","v":"11275 - ORSE"},{"$f":"Ferramentas!C113","v":"Alicate de pressão, 10\", 250mm"},{"$f":"Ferramentas!D113","v":"un"},{"$f":"Ferramentas!E113","v":13},{"$f":"Ferramentas!F113","v":0},0,{"$error":"#REF!"}]
["9.2.14",{"$f":"Ferramentas!B114","v":"11240 - ORSE"},{"$f":"Ferramentas!C114","v":"Alicate profissional universal, 8\". Material: Cromo Vanadium"},{"$f":"Ferramentas!D114","v":"un"},{"$f":"Ferramentas!E114","v":13},{"$f":"Ferramentas!F114","v":0},0,{"$error":"#REF!"}]
["9.2.15",{"$f":"Ferramentas!B115","v":"11240 - ORSE"},{"$f":"Ferramentas!C115","v":"Alicate universal, 8\", com isolação 1000 V"},{"$f":"Ferramentas!D115","v":"un"},{"$f":"Ferramentas!E115","v":10},{"$f":"Ferramentas!F115","v":0},0,{"$error":"#REF!"}]
["9.2.16",{"$f":"Ferramentas!B116","v":0},{"$f":"Ferramentas!C116","v":"Aluguel Notebook - tipo 1 (i7, 1T, 8GB, S.O. 10 e Office última versão)"},{"$f":"Ferramentas!D116","v":"un"},{"$f":"Ferramentas!E116","v":2},{"$f":"Ferramentas!F116","v":0},0,{"$error":"#REF!"}]
["9.2.17",{"$f":"Ferramentas!B117","v":0},{"$f":"Ferramentas!C117","v":"Andaime modular isolante 2x1m, com conexões em aluminio fundido - Altura de 15 m."},{"$f":"Ferramentas!D117","v":"un"},{"$f":"Ferramentas!E117","v":1},{"$f":"Ferramentas!F117","v":0},0,{"$error":"#REF!"}]
["9.2.18",{"$f":"Ferramentas!B118","v":"10585 - ORSE"},{"$f":"Ferramentas!C118","v":"Arco de Serra manual (com serra)"},{"$f":"Ferramentas!D118","v":"un"},{"$f":"Ferramentas!E118","v":23},{"$f":"Ferramentas!F118","v":0},0,{"$error":"#REF!"}]
["9.2.19",{"$f":"Ferramentas!B119","v":0},{"$f":"Ferramentas!C119","v":"Bastão/Vara de manobra 35 kV, Ø 32 mm, 3,0 m, 2 m isolante"},{"$f":"Ferramentas!D119","v":"un"},{"$f":"Ferramentas!E119","v":2},{"$f":"Ferramentas!F119","v":0},0,{"$error":"#REF!"}]
["9.2.20",{"$f":"Ferramentas!B120","v":0},{"$f":"Ferramentas!C120","v":"Bastão isolante universal Ø 38 mm, 6 m, com 2 cabeçotes"},{"$f":"Ferramentas!D120","v":"un"},{"$f":"Ferramentas!E120","v":2},{"$f":"Ferramentas!F120","v":0},0,{"$error":"#REF!"}]
["9.2.21",{"$f":"Ferramentas!B121","v":0},{"$f":"Ferramentas!C121","v":"Bastão de resgate - 35 kV, 220 mm"},{"$f":"Ferramentas!D121","v":"un"},{"$f":"Ferramentas!E121","v":2},{"$f":"Ferramentas!F121","v":0},0,{"$error":"#REF!"}]
["9.2.22",{"$f":"Ferramentas!B122","v":0},{"$f":"Ferramentas!C122","v":"Bastão-garra comprimento do isolante 3 m"},{"$f":"Ferramentas!D122","v":"un"},{"$f":"Ferramentas!E122","v":2},{"$f":"Ferramentas!F122","v":0},0,{"$error":"#REF!"}]
["9.2.23",{"$f":"Ferramentas!B123","v":0},{"$f":"Ferramentas!C123","v":"Bastão tensor com luva ajustável Ø 51 mm, 72,5 kV, 2,30 m"},{"$f":"Ferramentas!D123","v":"un"},{"$f":"Ferramentas!E123","v":2},{"$f":"Ferramentas!F123","v":0},0,{"$error":"#REF!"}]
["9.2.24",{"$f":"Ferramentas!B124","v":0},{"$f":"Ferramentas!C124","v":"Bastão com gancho tipo \"J\" 90cm"},{"$f":"Ferramentas!D124","v":"un"},{"$f":"Ferramentas!E124","v":2},{"$f":"Ferramentas!F124","v":0},0,{"$error":"#REF!"}]
["9.2.25",{"$f":"Ferramentas!B125","v":0},{"$f":"Ferramentas!C125","v":"Banqueta isolante, 500x500x300 mm, 40 kV"},{"$f":"Ferramentas!D125","v":"un"},{"$f":"Ferramentas!E125","v":2},{"$f":"Ferramentas!F125","v":0},0,{"$error":"#REF!"}]
["9.2.26",{"$f":"Ferramentas!B126","v":0},{"$f":"Ferramentas!C126","v":"Berço simples para cadeia de isoladores 230 kV para até 6 isoladores de até Ø 254 mm"},{"$f":"Ferramentas!D126","v":"un"},{"$f":"Ferramentas!E126","v":2},{"$f":"Ferramentas!F126","v":0},0,{"$error":"#REF!"}]
["9.2.27",{"$f":"Ferramentas!B127","v":"38374 - SINAPI"},{"$f":"Ferramentas!C127","v":"Balancim (Ref. RE402-0099 ou similar) para escada perfil de fibra de vidro extensiva"},{"$f":"Ferramentas!D127","v":"un"},{"$f":"Ferramentas!E127","v":2},{"$f":"Ferramentas!F127","v":0},0,{"$error":"#REF!"}]
["9.2.28",{"$f":"Ferramentas!B128","v":0},{"$f":"Ferramentas!C128","v":"Binóculo Profissional Ampliação 8 à 24x 50mm"},{"$f":"Ferramentas!D128","v":"un"},{"$f":"Ferramentas!E128","v":2},{"$f":"Ferramentas!F128","v":0},0,{"$error":"#REF!"}]
["9.2.29",{"$f":"Ferramentas!B129","v":0},{"$f":"Ferramentas!C129","v":"Chave de boca ajustável 8\""},{"$f":"Ferramentas!D129","v":"un"},{"$f":"Ferramentas!E129","v":10},{"$f":"Ferramentas!F129","v":0},0,{"$error":"#REF!"}]
["9.2.30",{"$f":"Ferramentas!B130","v":0},{"$f":"Ferramentas!C130","v":"Chave de boca ajustável 12\""},{"$f":"Ferramentas!D130","v":"un"},{"$f":"Ferramentas!E130","v":10},{"$f":"Ferramentas!F130","v":0},0,{"$error":"#REF!"}]
["9.2.31",{"$f":"Ferramentas!B131","v":0},{"$f":"Ferramentas!C131","v":"Chave de boca ajustável 18\""},{"$f":"Ferramentas!D131","v":"un"},{"$f":"Ferramentas!E131","v":10},{"$f":"Ferramentas!F131","v":0},0,{"$error":"#REF!"}]
["9.2.32",{"$f":"Ferramentas!B132","v":"00425 - ORSE"},{"$f":"Ferramentas!C132","v":"Cadeado 40mm"},{"$f":"Ferramentas!D132","v":"un"},{"$f":"Ferramentas!E132","v":27},{"$f":"Ferramentas!F132","v":0},0,{"$error":"#REF!"}]
["9.2.33",{"$f":"Ferramentas!B133","v":0},{"$f":"Ferramentas!C133","v":"Caixa de ferramentas para eletricista NR10 com 34 peças - Equipes de Manutenção"},{"$f":"Ferramentas!D133","v":"un"},{"$f":"Ferramentas!E133","v":6},{"$f":"Ferramentas!F133","v":0},0,{"$error":"#REF!"}]
["9.2.34",{"$f":"Ferramentas!B134","v":0},{"$f":"Ferramentas!C134","v":"Caixa de ferramentas para eletricista NR10 com 34 peças para operadores EB"},{"$f":"Ferramentas!D134","v":"un"},{"$f":"Ferramentas!E134","v":6},{"$f":"Ferramentas!F134","v":0},0,{"$error":"#REF!"}]
["9.2.35",{"$f":"Ferramentas!B135","v":0},{"$f":"Ferramentas!C135","v":"Caixa de ferramentas com 40 peças (Para técnicos de automação e telecom)"},{"$f":"Ferramentas!D135","v":"un"},{"$f":"Ferramentas!E135","v":2},{"$f":"Ferramentas!F135","v":0},0,{"$error":"#REF!"}]
["9.2.36",{"$f":"Ferramentas!B136","v":0},{"$f":"Ferramentas!C136","v":"Caixa de ferramentas tipo sanfonada, confeccionada  em chapa de aço, com rodas e puxador"},{"$f":"Ferramentas!D136","v":"un"},{"$f":"Ferramentas!E136","v":13},{"$f":"Ferramentas!F136","v":0},0,{"$error":"#REF!"}]
["9.2.37",{"$f":"Ferramentas!B137","v":0},{"$f":"Ferramentas!C137","v":"Câmera fotográfica digital 20MP, 5x Zoom Óptico"},{"$f":"Ferramentas!D137","v":"un"},{"$f":"Ferramentas!E137","v":2},{"$f":"Ferramentas!F137","v":0},0,{"$error":"#REF!"}]
["9.2.38",{"$f":"Ferramentas!B138","v":0},{"$f":"Ferramentas!C138","v":"Chave com catraca 4 bocas 8x9x10x11 mm (Ref. 44637101 ou similar)"},{"$f":"Ferramentas!D138","v":"un"},{"$f":"Ferramentas!E138","v":10},{"$f":"Ferramentas!F138","v":0},0,{"$error":"#REF!"}]
["9.2.39",{"$f":"Ferramentas!B139","v":0},{"$f":"Ferramentas!C139","v":"Conjunto de aterramento rápido e temporário para cubículos até 35kV"},{"$f":"Ferramentas!D139","v":"un"},{"$f":"Ferramentas!E139","v":2},{"$f":"Ferramentas!F139","v":0},0,{"$error":"#REF!"}]
["9.2.40",{"$f":"Ferramentas!B140","v":0},{"$f":"Ferramentas!C140","v":"Conjunto de aterramento rápido e temporário para redes isoladas até 1kV"},{"$f":"Ferramentas!D140","v":"un"},{"$f":"Ferramentas!E140","v":2},{"$f":"Ferramentas!F140","v":0},0,{"$error":"#REF!"}]
["9.2.41",{"$f":"Ferramentas!B141","v":0},{"$f":"Ferramentas!C141","v":"Conjunto de aterramento temporário para subestações até 36kV"},{"$f":"Ferramentas!D141","v":"un"},{"$f":"Ferramentas!E141","v":2},{"$f":"Ferramentas!F141","v":0},0,{"$error":"#REF!"}]
["9.2.42",{"$f":"Ferramentas!B142","v":0},{"$f":"Ferramentas!C142","v":"Conjunto de chaves básicas para eletricista com 06 peças"},{"$f":"Ferramentas!D142","v":"un"},{"$f":"Ferramentas!E142","v":10},{"$f":"Ferramentas!F142","v":0},0,{"$error":"#REF!"}]
["9.2.43",{"$f":"Ferramentas!B143","v":0},{"$f":"Ferramentas!C143","v":"Detector de Tensão por contato 1kV"},{"$f":"Ferramentas!D143","v":"un"},{"$f":"Ferramentas!E143","v":23},{"$f":"Ferramentas!F143","v":0},0,{"$error":"#REF!"}]
["9.2.44",{"$f":"Ferramentas!B144","v":0},{"$f":"Ferramentas!C144","v":"Detector unipolar de tensão por aproximação - 10 a 40KV"},{"$f":"Ferramentas!D144","v":"un"},{"$f":"Ferramentas!E144","v":13},{"$f":"Ferramentas!F144","v":0},0,{"$f":"ROUND(G480/G$8,4)","v":{"$error":"#REF!"}}]
["9.2.45",{"$f":"Ferramentas!B145","v":0},{"$f":"Ferramentas!C145","v":"Encerado de lona (3x2 m)"},{"$f":"Ferramentas!D145","v":"un"},{"$f":"Ferramentas!E145","v":10},{"$f":"Ferramentas!F145","v":0},0,{"$error":"#REF!"}]
["9.2.46",{"$f":"Ferramentas!B146","v":0},{"$f":"Ferramentas!C146","v":"Escada perfil \"U\" de fibra de vidro extensiva - altura esticada 8,40 m - 15 kV"},{"$f":"Ferramentas!D146","v":"un"},{"$f":"Ferramentas!E146","v":10},{"$f":"Ferramentas!F146","v":0},0,{"$error":"#REF!"}]
["9.2.47",{"$f":"Ferramentas!B147","v":0},{"$f":"Ferramentas!C147","v":"Escada de fibra de vidro tipo \"A\" (subestações) - 10 degraus"},{"$f":"Ferramentas!D147","v":"un"},{"$f":"Ferramentas!E147","v":2},{"$f":"Ferramentas!F147","v":0},0,{"$error":"#REF!"}]
["9.2.48",{"$f":"Ferramentas!B148","v":"12 - SINAPI"},{"$f":"Ferramentas!C148","v":"Escova com cerdas de aço para condutores"},{"$f":"Ferramentas!D148","v":"un"},{"$f":"Ferramentas!E148","v":10},{"$f":"Ferramentas!F148","v":0},0,{"$error":"#REF!"}]
["9.2.49",{"$f":"Ferramentas!B149","v":0},{"$f":"Ferramentas!C149","v":"Facão para mato, 18 pol"},{"$f":"Ferramentas!D149","v":"un"},{"$f":"Ferramentas!E149","v":10},{"$f":"Ferramentas!F149","v":0},0,{"$error":"#REF!"}]
["9.2.50",{"$f":"Ferramentas!B150","v":0},{"$f":"Ferramentas!C150","v":"Farol de punho"},{"$f":"Ferramentas!D150","v":"un"},{"$f":"Ferramentas!E150","v":10},{"$f":"Ferramentas!F150","v":0},0,{"$error":"#REF!"}]
["9.2.51",{"$f":"Ferramentas!B151","v":0},{"$f":"Ferramentas!C151","v":"Ferramenta universal para bastão de manobra - Adaptador de ferramentas"},{"$f":"Ferramentas!D151","v":"un"},{"$f":"Ferramentas!E151","v":2},{"$f":"Ferramentas!F151","v":0},0,{"$error":"#REF!"}]
["9.2.52",{"$f":"Ferramentas!B152","v":0},{"$f":"Ferramentas!C152","v":"Ferramenta universal para bastão de manobra - Adaptador de peças"},{"$f":"Ferramentas!D152","v":"un"},{"$f":"Ferramentas!E152","v":2},{"$f":"Ferramentas!F152","v":0},0,{"$error":"#REF!"}]
["9.2.53",{"$f":"Ferramentas!B153","v":0},{"$f":"Ferramentas!C153","v":"Ferramenta universal para bastão de manobra - Adaptador universal"},{"$f":"Ferramentas!D153","v":"un"},{"$f":"Ferramentas!E153","v":2},{"$f":"Ferramentas!F153","v":0},0,{"$error":"#REF!"}]
["9.2.54",{"$f":"Ferramentas!B154","v":0},{"$f":"Ferramentas!C154","v":"Ferramenta universal para bastão de manobra - Cabeçote com gancho duplo"},{"$f":"Ferramentas!D154","v":"un"},{"$f":"Ferramentas!E154","v":2},{"$f":"Ferramentas!F154","v":0},0,{"$error":"#REF!"}]
["9.2.55",{"$f":"Ferramentas!B155","v":0},{"$f":"Ferramentas!C155","v":"Ferramenta universal para bastão de manobra - Cabeçote multi-uso"},{"$f":"Ferramentas!D155","v":"un"},{"$f":"Ferramentas!E155","v":2},{"$f":"Ferramentas!F155","v":0},0,{"$error":"#REF!"}]
["9.2.56",{"$f":"Ferramentas!B156","v":0},{"$f":"Ferramentas!C156","v":"Ferramenta universal para bastão de manobra - Cabeçote para grampo de aterramento"},{"$f":"Ferramentas!D156","v":"un"},{"$f":"Ferramentas!E156","v":2},{"$f":"Ferramentas!F156","v":0},0,{"$error":"#REF!"}]
["9.2.57",{"$f":"Ferramentas!B157","v":0},{"$f":"Ferramentas!C157","v":"Ferramenta universal para bastão de manobra - Chave com catraca"},{"$f":"Ferramentas!D157","v":"un"},{"$f":"Ferramentas!E157","v":2},{"$f":"Ferramentas!F157","v":0},0,{"$error":"#REF!"}]
["9.2.58",{"$f":"Ferramentas!B158","v":0},{"$f":"Ferramentas!C158","v":"Ferramenta universal para bastão de manobra - Desconector para chave fusível"},{"$f":"Ferramentas!D158","v":"un"},{"$f":"Ferramentas!E158","v":2},{"$f":"Ferramentas!F158","v":0},0,{"$error":"#REF!"}]
["9.2.59",{"$f":"Ferramentas!B159","v":0},{"$f":"Ferramentas!C159","v":"Ferramenta universal para bastão de manobra - Escova em \"V\" para limpeza de condutor"},{"$f":"Ferramentas!D159","v":"un"},{"$f":"Ferramentas!E159","v":2},{"$f":"Ferramentas!F159","v":0},0,{"$error":"#REF!"}]
["9.2.60",{"$f":"Ferramentas!B160","v":0},{"$f":"Ferramentas!C160","v":"Ferramenta universal para bastão de manobra - Extrator de cartucho"},{"$f":"Ferramentas!D160","v":"un"},{"$f":"Ferramentas!E160","v":2},{"$f":"Ferramentas!F160","v":0},0,{"$error":"#REF!"}]
["9.2.61",{"$f":"Ferramentas!B161","v":0},{"$f":"Ferramentas!C161","v":"Ferramenta universal para bastão de manobra - Extrator de contrapino por impulso"},{"$f":"Ferramentas!D161","v":"un"},{"$f":"Ferramentas!E161","v":2},{"$f":"Ferramentas!F161","v":0},0,{"$error":"#REF!"}]
["9.2.62",{"$f":"Ferramentas!B162","v":0},{"$f":"Ferramentas!C162","v":"Ferramenta universal para bastão de manobra - Gancho tração espiral"},{"$f":"Ferramentas!D162","v":"un"},{"$f":"Ferramentas!E162","v":2},{"$f":"Ferramentas!F162","v":0},0,{"$error":"#REF!"}]
["9.2.63",{"$f":"Ferramentas!B163","v":0},{"$f":"Ferramentas!C163","v":"Ferramenta universal para bastão de manobra - Garfo ajustador de concha"},{"$f":"Ferramentas!D163","v":"un"},{"$f":"Ferramentas!E163","v":2},{"$f":"Ferramentas!F163","v":0},0,{"$error":"#REF!"}]
["9.2.64",{"$f":"Ferramentas!B164","v":0},{"$f":"Ferramentas!C164","v":"Ferramenta universal para bastão de manobra - Garra de amarração"},{"$f":"Ferramentas!D164","v":"un"},{"$f":"Ferramentas!E164","v":2},{"$f":"Ferramentas!F164","v":0},0,{"$error":"#REF!"}]
["9.2.65",{"$f":"Ferramentas!B165","v":0},{"$f":"Ferramentas!C165","v":"Ferramenta universal para bastão de manobra - Instalador de Contrapino"},{"$f":"Ferramentas!D165","v":"un"},{"$f":"Ferramentas!E165","v":2},{"$f":"Ferramentas!F165","v":0},0,{"$error":"#REF!"}]
["9.2.66",{"$f":"Ferramentas!B166","v":0},{"$f":"Ferramentas!C166","v":"Ferramenta universal para bastão de manobra - Jogo para Tensionadores Duplos - jugo duplo com corrente lado morto"},{"$f":"Ferramentas!D166","v":"un"},{"$f":"Ferramentas!E166","v":2},{"$f":"Ferramentas!F166","v":0},0,{"$error":"#REF!"}]
["9.2.67",{"$f":"Ferramentas!B167","v":0},{"$f":"Ferramentas!C167","v":"Ferramenta universal para bastão de manobra - Jogo para Tensionadores Duplos -jugo duplo lado vivo"},{"$f":"Ferramentas!D167","v":"un"},{"$f":"Ferramentas!E167","v":2},{"$f":"Ferramentas!F167","v":0},0,{"$error":"#REF!"}]
["9.2.68",{"$f":"Ferramentas!B168","v":0},{"$f":"Ferramentas!C168","v":"Ferramenta universal para bastão de manobra - Jogo para Tensionadores Simples - balancim trinangular chapa dupla"},{"$f":"Ferramentas!D168","v":"un"},{"$f":"Ferramentas!E168","v":2},{"$f":"Ferramentas!F168","v":0},0,{"$error":"#REF!"}]
["9.2.69",{"$f":"Ferramentas!B169","v":0},{"$f":"Ferramentas!C169","v":"Ferramenta universal para bastão de manobra - Sacador de contrapino em alavanca"},{"$f":"Ferramentas!D169","v":"un"},{"$f":"Ferramentas!E169","v":2},{"$f":"Ferramentas!F169","v":0},0,{"$error":"#REF!"}]
["9.2.70",{"$f":"Ferramentas!B170","v":0},{"$f":"Ferramentas!C170","v":"Ferramenta universal para bastão de manobra - Suporte de concha"},{"$f":"Ferramentas!D170","v":"un"},{"$f":"Ferramentas!E170","v":2},{"$f":"Ferramentas!F170","v":0},0,{"$error":"#REF!"}]
["9.2.71",{"$f":"Ferramentas!B171","v":0},{"$f":"Ferramentas!C171","v":"Ferramenta universal para bastão de manobra - Suporte flexível para soquete hexagonal"},{"$f":"Ferramentas!D171","v":"un"},{"$f":"Ferramentas!E171","v":2},{"$f":"Ferramentas!F171","v":0},0,{"$error":"#REF!"}]
["9.2.72",{"$f":"Ferramentas!B172","v":0},{"$f":"Ferramentas!C172","v":"Ferramenta universal para bastão de manobra - Tenaz multi-angular"},{"$f":"Ferramentas!D172","v":"un"},{"$f":"Ferramentas!E172","v":2},{"$f":"Ferramentas!F172","v":0},0,{"$error":"#REF!"}]
["9.2.73",{"$f":"Ferramentas!B173","v":0},{"$f":"Ferramentas!C173","v":"Ferramenta universal para bastão de manobra - Tenaz para isolador"},{"$f":"Ferramentas!D173","v":"un"},{"$f":"Ferramentas!E173","v":2},{"$f":"Ferramentas!F173","v":0},0,{"$error":"#REF!"}]
["9.2.74",{"$f":"Ferramentas!B174","v":0},{"$f":"Ferramentas!C174","v":"Foice 33mm (Com Cabo 110cm)"},{"$f":"Ferramentas!D174","v":"un"},{"$f":"Ferramentas!E174","v":10},{"$f":"Ferramentas!F174","v":0},0,{"$error":"#REF!"}]
["9.2.75",{"$f":"Ferramentas!B175","v":0},{"$f":"Ferramentas!C175","v":"Fumigador para apicultura"},{"$f":"Ferramentas!D175","v":"un"},{"$f":"Ferramentas!E175","v":10},{"$f":"Ferramentas!F175","v":0},0,{"$error":"#REF!"}]
["9.2.76",{"$f":"Ferramentas!B176","v":0},{"$f":"Ferramentas!C176","v":"Furadeira elétrica de impacto 1/2\" Ø 13mm, 800W, 1050 A, 2800 rpm e 220V"},{"$f":"Ferramentas!D176","v":"un"},{"$f":"Ferramentas!E176","v":10},{"$f":"Ferramentas!F176","v":0},0,{"$error":"#REF!"}]
["9.2.77",{"$f":"Ferramentas!B177","v":0},{"$f":"Ferramentas!C177","v":"Grampo de aterramento com parafuso olhal T (linhas)"},{"$f":"Ferramentas!D177","v":"un"},{"$f":"Ferramentas!E177","v":3},{"$f":"Ferramentas!F177","v":0},0,{"$error":"#REF!"}]
["9.2.78",{"$f":"Ferramentas!B178","v":0},{"$f":"Ferramentas!C178","v":"Jogo de chave canhão com 12 unidades"},{"$f":"Ferramentas!D178","v":"un"},{"$f":"Ferramentas!E178","v":10},{"$f":"Ferramentas!F178","v":0},0,{"$error":"#REF!"}]
["9.2.79",{"$f":"Ferramentas!B179","v":0},{"$f":"Ferramentas!C179","v":"Jogo de chave combinada com 16 unidades (sextavado/boca fixa) de 1/4\" a 1.1/4\" (6,35 mm a 31,75 mm)"},{"$f":"Ferramentas!D179","v":"un"},{"$f":"Ferramentas!E179","v":10},{"$f":"Ferramentas!F179","v":0},0,{"$error":"#REF!"}]
["9.2.80",{"$f":"Ferramentas!B180","v":0},{"$f":"Ferramentas!C180","v":"Jogo de soquetes estriado com encaixe 1/2\" com 38 soquetes - 10-32mmn"},{"$f":"Ferramentas!D180","v":"un"},{"$f":"Ferramentas!E180","v":10},{"$f":"Ferramentas!F180","v":0},0,{"$error":"#REF!"}]
["9.2.81",{"$f":"Ferramentas!B181","v":0},{"$f":"Ferramentas!C181","v":"Jogo tensionador simples com munhão"},{"$f":"Ferramentas!D181","v":"un"},{"$f":"Ferramentas!E181","v":2},{"$f":"Ferramentas!F181","v":0},0,{"$error":"#REF!"}]
["9.2.82",{"$f":"Ferramentas!B182","v":0},{"$f":"Ferramentas!C182","v":"Jogo de chaves biela 12 peças tipo L 8 a 19mm"},{"$f":"Ferramentas!D182","v":"un"},{"$f":"Ferramentas!E182","v":10},{"$f":"Ferramentas!F182","v":0},0,{"$error":"#REF!"}]
["9.2.83",{"$f":"Ferramentas!B183","v":0},{"$f":"Ferramentas!C183","v":"Jogo de chave de fenda e philips com haste protegida para eletricista com 07 peças"},{"$f":"Ferramentas!D183","v":"un"},{"$f":"Ferramentas!E183","v":10},{"$f":"Ferramentas!F183","v":0},0,{"$error":"#REF!"}]
["9.2.84",{"$f":"Ferramentas!B184","v":0},{"$f":"Ferramentas!C184","v":"Jogo de chave de fenda para bastão"},{"$f":"Ferramentas!D184","v":"un"},{"$f":"Ferramentas!E184","v":2},{"$f":"Ferramentas!F184","v":0},0,{"$error":"#REF!"}]
["9.2.85",{"$f":"Ferramentas!B185","v":0},{"$f":"Ferramentas!C185","v":"Kit de reparo eletrônico (ferro de solda, sugador de placa de circuito impresso, componentes sobressalentes)"},{"$f":"Ferramentas!D185","v":"un"},{"$f":"Ferramentas!E185","v":2},{"$f":"Ferramentas!F185","v":0},0,{"$error":"#REF!"}]
["9.2.86",{"$f":"Ferramentas!B186","v":0},{"$f":"Ferramentas!C186","v":"Kit ferramenta fibra óptica (clivador +alicate decapador + alicate stripper + bolsa + 2 chaves allen + recipiente para álcool + guia) + Medidor de potência para fibra óptica (Power Meter Medidor Potência Fibra Óptica + Caneta Laser 10W)"},{"$f":"Ferramentas!D186","v":"un"},{"$f":"Ferramentas!E186","v":2},{"$f":"Ferramentas!F186","v":0},0,{"$error":"#REF!"}]
["9.2.87",{"$f":"Ferramentas!B187","v":0},{"$f":"Ferramentas!C187","v":"Kit ferramentas telecom ( tipo TRAMONTINA PRO 44970053 ou similar)"},{"$f":"Ferramentas!D187","v":"un"},{"$f":"Ferramentas!E187","v":2},{"$f":"Ferramentas!F187","v":0},0,{"$error":"#REF!"}]
["9.2.88",{"$f":"Ferramentas!B188","v":"11396 - ORSE"},{"$f":"Ferramentas!C188","v":"Lanterna tática grande - 5.500.000 lumens"},{"$f":"Ferramentas!D188","v":"un"},{"$f":"Ferramentas!E188","v":10},{"$f":"Ferramentas!F188","v":0},0,{"$error":"#REF!"}]
["9.2.89",{"$f":"Ferramentas!B189","v":0},{"$f":"Ferramentas!C189","v":"Lima chata murça 8\" com cabo"},{"$f":"Ferramentas!D189","v":"un"},{"$f":"Ferramentas!E189","v":1},{"$f":"Ferramentas!F189","v":0},0,{"$error":"#REF!"}]
["9.2.90",{"$f":"Ferramentas!B190","v":0},{"$f":"Ferramentas!C190","v":"Lima chata bastarda 10\""},{"$f":"Ferramentas!D190","v":"un"},{"$f":"Ferramentas!E190","v":1},{"$f":"Ferramentas!F190","v":0},0,{"$error":"#REF!"}]
["9.2.91",{"$f":"Ferramentas!B191","v":0},{"$f":"Ferramentas!C191","v":"Luva de cobertura punho 15cm"},{"$f":"Ferramentas!D191","v":"un"},{"$f":"Ferramentas!E191","v":13},{"$f":"Ferramentas!F191","v":0},0,{"$error":"#REF!"}]
["9.2.92",{"$f":"Ferramentas!B192","v":0},{"$f":"Ferramentas!C192","v":"Luva isolante classe 00 - 2,5kV"},{"$f":"Ferramentas!D192","v":"un"},{"$f":"Ferramentas!E192","v":13},{"$f":"Ferramentas!F192","v":0},0,{"$error":"#REF!"}]
["9.2.93",{"$f":"Ferramentas!B193","v":0},{"$f":"Ferramentas!C193","v":"Luva isolante classe 0 - 5kV"},{"$f":"Ferramentas!D193","v":"un"},{"$f":"Ferramentas!E193","v":13},{"$f":"Ferramentas!F193","v":0},0,{"$error":"#REF!"}]
["9.2.94",{"$f":"Ferramentas!B194","v":0},{"$f":"Ferramentas!C194","v":"Luva isolante classe 3 - 30kV"},{"$f":"Ferramentas!D194","v":"un"},{"$f":"Ferramentas!E194","v":13},{"$f":"Ferramentas!F194","v":0},0,{"$error":"#REF!"}]
["9.2.95",{"$f":"Ferramentas!B195","v":0},{"$f":"Ferramentas!C195","v":"Marreta de 5kg com cabo de madeira"},{"$f":"Ferramentas!D195","v":"un"},{"$f":"Ferramentas!E195","v":10},{"$f":"Ferramentas!F195","v":0},0,{"$error":"#REF!"}]
["9.2.96",{"$f":"Ferramentas!B196","v":0},{"$f":"Ferramentas!C196","v":"Martelete Perfurador/Rompedor Profissional 220V, 800W, 870 RPM"},{"$f":"Ferramentas!D196","v":"un"},{"$f":"Ferramentas!E196","v":1},{"$f":"Ferramentas!F196","v":0},0,{"$error":"#REF!"}]
["9.2.97",{"$f":"Ferramentas!B197","v":0},{"$f":"Ferramentas!C197","v":"Martelo-bola 1kg"},{"$f":"Ferramentas!D197","v":"un"},{"$f":"Ferramentas!E197","v":10},{"$f":"Ferramentas!F197","v":0},0,{"$error":"#REF!"}]
["9.2.98",{"$f":"Ferramentas!B198","v":0},{"$f":"Ferramentas!C198","v":"Martelo universal (de unha) 25mm"},{"$f":"Ferramentas!D198","v":"un"},{"$f":"Ferramentas!E198","v":10},{"$f":"Ferramentas!F198","v":0},0,{"$error":"#REF!"}]
["9.2.99",{"$f":"Ferramentas!B199","v":0},{"$f":"Ferramentas!C199","v":"Kit para enchimento e complementação de gás SF6, composto de adaptador, mangueira, regulador e manômetro padrão"},{"$f":"Ferramentas!D199","v":"un"},{"$f":"Ferramentas!E199","v":1},{"$f":"Ferramentas!F199","v":0},0,{"$error":"#REF!"}]
["9.2.100",{"$f":"Ferramentas!B200","v":0},{"$f":"Ferramentas!C200","v":"Pá-de-bico com cabo de madeira"},{"$f":"Ferramentas!D200","v":"un"},{"$f":"Ferramentas!E200","v":10},{"$f":"Ferramentas!F200","v":0},0,{"$error":"#REF!"}]
["9.2.101",{"$f":"Ferramentas!B201","v":0},{"$f":"Ferramentas!C201","v":"Parafusadeira/Furadeira elétrica com fio - 220V, 400W"},{"$f":"Ferramentas!D201","v":"un"},{"$f":"Ferramentas!E201","v":10},{"$f":"Ferramentas!F201","v":0},0,{"$error":"#REF!"}]
["9.2.102",{"$f":"Ferramentas!B202","v":0},{"$f":"Ferramentas!C202","v":"Plataforma de fibra de vidro antiderrapente  para andaime modular isolante, com conexoes em aluminio fundido 2x1m"},{"$f":"Ferramentas!D202","v":"un"},{"$f":"Ferramentas!E202","v":2},{"$f":"Ferramentas!F202","v":0},0,{"$error":"#REF!"}]
["9.2.103",{"$f":"Ferramentas!B203","v":0},{"$f":"Ferramentas!C203","v":"Punho saca fusível NH tamanho 000 a 4, 1kV"},{"$f":"Ferramentas!D203","v":"un"},{"$f":"Ferramentas!E203","v":10},{"$f":"Ferramentas!F203","v":0},0,{"$error":"#REF!"}]
["9.2.104",{"$f":"Ferramentas!B204","v":0},{"$f":"Ferramentas!C204","v":"Sela com extensor colar de 38mm"},{"$f":"Ferramentas!D204","v":"un"},{"$f":"Ferramentas!E204","v":2},{"$f":"Ferramentas!F204","v":0},0,{"$error":"#REF!"}]
["9.2.105",{"$f":"Ferramentas!B205","v":0},{"$f":"Ferramentas!C205","v":"Separador de fases horizontal 15kV  polietileno de alta densidade na cor cinza (cx 110-690 mm ; cx 66-850 mm)"},{"$f":"Ferramentas!D205","v":"un"},{"$f":"Ferramentas!E205","v":4},{"$f":"Ferramentas!F205","v":0},0,{"$error":"#REF!"}]
["9.2.106",{"$f":"Ferramentas!B206","v":0},{"$f":"Ferramentas!C206","v":"Soprador térmico 2000W, 220V"},{"$f":"Ferramentas!D206","v":"un"},{"$f":"Ferramentas!E206","v":1},{"$f":"Ferramentas!F206","v":0},0,{"$error":"#REF!"}]
["9.2.107",{"$f":"Ferramentas!B207","v":0},{"$f":"Ferramentas!C207","v":"Talha manual Tirfor 1.600kgf/cm² com alavanca"},{"$f":"Ferramentas!D207","v":"un"},{"$f":"Ferramentas!E207","v":1},{"$f":"Ferramentas!F207","v":0},0,{"$error":"#REF!"}]
["9.2.108",{"$f":"Ferramentas!B208","v":0},{"$f":"Ferramentas!C208","v":"Testador de bastão de manobra para isolador"},{"$f":"Ferramentas!D208","v":"un"},{"$f":"Ferramentas!E208","v":1},{"$f":"Ferramentas!F208","v":0},0,{"$f":"ROUND(G544/G$8,4)","v":{"$error":"#REF!"}}]
["9.2.109",{"$f":"Ferramentas!B209","v":0},{"$f":"Ferramentas!C209","v":"Teste de Bateria Digital com Impressora Térmica Embutida"},{"$f":"Ferramentas!D209","v":"un"},{"$f":"Ferramentas!E209","v":6},{"$f":"Ferramentas!F209","v":0},0,{"$error":"#REF!"}]
["9.2.110",{"$f":"Ferramentas!B210","v":0},{"$f":"Ferramentas!C210","v":"Testador Teste Crimpagem Cabo Rede Lan Rj45 Rj11"},{"$f":"Ferramentas!D210","v":"un"},{"$f":"Ferramentas!E210","v":2},{"$f":"Ferramentas!F210","v":0},0,{"$error":"#REF!"}]
["9.3.",null,{"$f":"Ferramentas!C213","v":"FERRAMENTAS - CIVIL"},null,null,null,{"$f":"SUBTOTAL(109,G548:G602)","v":0},{"$error":"#REF!"}]
["9.3.1",{"$f":"Ferramentas!B214","v":0},{"$f":"Ferramentas!C214","v":" Alavanca para construção civil"},{"$f":"Ferramentas!D214","v":"un"},{"$f":"Ferramentas!E214","v":30},{"$f":"Ferramentas!F214","v":0},{"$f":"ROUND(E548*F548,2)","v":0},{"$error":"#REF!"}]
["9.3.2",{"$f":"Ferramentas!B215","v":0},{"$f":"Ferramentas!C215","v":" Ansinho "},{"$f":"Ferramentas!D215","v":"un"},{"$f":"Ferramentas!E215","v":30},{"$f":"Ferramentas!F215","v":0},0,{"$error":"#REF!"}]
["9.3.3",{"$f":"Ferramentas!B216","v":"10585 - ORSE"},{"$f":"Ferramentas!C216","v":"Arco de Serra manual (com serra)"},{"$f":"Ferramentas!D216","v":"un"},{"$f":"Ferramentas!E216","v":12},{"$f":"Ferramentas!F216","v":0},0,{"$error":"#REF!"}]
["9.3.4",{"$f":"Ferramentas!B217","v":"10 - SINAPI"},{"$f":"Ferramentas!C217","v":" Balde 10 l "},{"$f":"Ferramentas!D217","v":"un"},{"$f":"Ferramentas!E217","v":60},{"$f":"Ferramentas!F217","v":0},0,{"$error":"#REF!"}]
["9.3.5",{"$f":"Ferramentas!B218","v":0},{"$f":"Ferramentas!C218","v":"Binóculo Profissional Ampliação 8 à 24x 50mm"},{"$f":"Ferramentas!D218","v":"un"},{"$f":"Ferramentas!E218","v":10},{"$f":"Ferramentas!F218","v":0},0,{"$error":"#REF!"}]
["9.3.6",{"$f":"Ferramentas!B219","v":0},{"$f":"Ferramentas!C219","v":"Câmera fotográfica digital 20MP, 5x Zoom Óptico"},{"$f":"Ferramentas!D219","v":"un"},{"$f":"Ferramentas!E219","v":6},{"$f":"Ferramentas!F219","v":0},0,{"$error":"#REF!"}]
["9.3.7",{"$f":"Ferramentas!B220","v":0},{"$f":"Ferramentas!C220","v":" Carrinho para transporte de motor de popa "},{"$f":"Ferramentas!D220","v":"un"},{"$f":"Ferramentas!E220","v":12},{"$f":"Ferramentas!F220","v":0},0,{"$error":"#REF!"}]
["9.3.8",{"$f":"Ferramentas!B221","v":"2711 - SINAPI"},{"$f":"Ferramentas!C221","v":" Carro de mão "},{"$f":"Ferramentas!D221","v":"un"},{"$f":"Ferramentas!E221","v":120},{"$f":"Ferramentas!F221","v":0},0,{"$error":"#REF!"}]
["9.3.9",{"$f":"Ferramentas!B222","v":0},{"$f":"Ferramentas!C222","v":" Cavador articulado "},{"$f":"Ferramentas!D222","v":"un"},{"$f":"Ferramentas!E222","v":30},{"$f":"Ferramentas!F222","v":0},{"$f":"ROUND(E556*F556,2)","v":0},{"$error":"#REF!"}]
["9.3.10",{"$f":"Ferramentas!B223","v":0},{"$f":"Ferramentas!C223","v":" Chibanca "},{"$f":"Ferramentas!D223","v":"un"},{"$f":"Ferramentas!E223","v":105},{"$f":"Ferramentas!F223","v":0},0,{"$error":"#REF!"}]
["9.3.11",{"$f":"Ferramentas!B224","v":0},{"$f":"Ferramentas!C224","v":" Colher de pedreiro nº 9 "},{"$f":"Ferramentas!D224","v":"un"},{"$f":"Ferramentas!E224","v":5},{"$f":"Ferramentas!F224","v":0},0,{"$error":"#REF!"}]
["9.3.12",{"$f":"Ferramentas!B225","v":0},{"$f":"Ferramentas!C225","v":" Conjunto de ferramentas básicas para encanador "},{"$f":"Ferramentas!D225","v":"un"},{"$f":"Ferramentas!E225","v":3},{"$f":"Ferramentas!F225","v":0},0,{"$error":"#REF!"}]
["9.3.13",{"$f":"Ferramentas!B226","v":0},{"$f":"Ferramentas!C226","v":" Conjunto de ferramentas básicas para pedreiro "},{"$f":"Ferramentas!D226","v":"un"},{"$f":"Ferramentas!E226","v":5},{"$f":"Ferramentas!F226","v":0},0,{"$error":"#REF!"}]
["9.3.14",{"$f":"Ferramentas!B227","v":0},{"$f":"Ferramentas!C227","v":" Corda de bombeiro 12mm em nylon trançado (rolo de 100 m) "},{"$f":"Ferramentas!D227","v":"un"},{"$f":"Ferramentas!E227","v":9},{"$f":"Ferramentas!F227","v":0},0,{"$error":"#REF!"}]
["9.3.15",{"$f":"Ferramentas!B228","v":0},{"$f":"Ferramentas!C228","v":" Desempenadeira de aço dentada "},{"$f":"Ferramentas!D228","v":"un"},{"$f":"Ferramentas!E228","v":9},{"$f":"Ferramentas!F228","v":0},0,{"$error":"#REF!"}]
["9.3.16",{"$f":"Ferramentas!B229","v":0},{"$f":"Ferramentas!C229","v":" Desempenadeira de aço lisa "},{"$f":"Ferramentas!D229","v":"un"},{"$f":"Ferramentas!E229","v":9},{"$f":"Ferramentas!F229","v":0},0,{"$error":"#REF!"}]
["9.3.17",{"$f":"Ferramentas!B230","v":0},{"$f":"Ferramentas!C230","v":" Disco corte abrasivo 18\" "},{"$f":"Ferramentas!D230","v":"un"},{"$f":"Ferramentas!E230","v":6},{"$f":"Ferramentas!F230","v":0},0,{"$error":"#REF!"}]
["9.3.18",{"$f":"Ferramentas!B231","v":"38403 - SINAPI"},{"$f":"Ferramentas!C231","v":" Enxada estreita de 240 x 230 mm, sem cabo "},{"$f":"Ferramentas!D231","v":"un"},{"$f":"Ferramentas!E231","v":105},{"$f":"Ferramentas!F231","v":0},0,{"$error":"#REF!"}]
["9.3.19",{"$f":"Ferramentas!B232","v":"38477 - SINAPI"},{"$f":"Ferramentas!C232","v":" Escada articulada multifuncional 16 degraus "},{"$f":"Ferramentas!D232","v":"un"},{"$f":"Ferramentas!E232","v":12},{"$f":"Ferramentas!F232","v":0},0,{"$error":"#REF!"}]
["9.3.20",{"$f":"Ferramentas!B233","v":"12 - SINAPI"},{"$f":"Ferramentas!C233","v":"Escova de aco, com cabo, *4 x 15* fileiras de cerdas "},{"$f":"Ferramentas!D233","v":"un"},{"$f":"Ferramentas!E233","v":12},{"$f":"Ferramentas!F233","v":0},0,{"$error":"#REF!"}]
["9.3.21",{"$f":"Ferramentas!B234","v":"38367 - SINAPI"},{"$f":"Ferramentas!C234","v":"Espátula aço inox, 8cm - cabo de madeira "},{"$f":"Ferramentas!D234","v":"un"},{"$f":"Ferramentas!E234","v":12},{"$f":"Ferramentas!F234","v":0},0,{"$error":"#REF!"}]
["9.3.22",{"$f":"Ferramentas!B235","v":"38368 - SINAPI"},{"$f":"Ferramentas!C235","v":"Espátula de plástico lisa, largura 10 cm "},{"$f":"Ferramentas!D235","v":"un"},{"$f":"Ferramentas!E235","v":12},{"$f":"Ferramentas!F235","v":0},0,{"$error":"#REF!"}]
["9.3.23",{"$f":"Ferramentas!B236","v":0},{"$f":"Ferramentas!C236","v":" Esponja de limpeza "},{"$f":"Ferramentas!D236","v":"un"},{"$f":"Ferramentas!E236","v":105},{"$f":"Ferramentas!F236","v":0},0,{"$error":"#REF!"}]
["9.3.24",{"$f":"Ferramentas!B237","v":"38380 - SINAPI"},{"$f":"Ferramentas!C237","v":"Esquadro 90º x 30cm (12\") "},{"$f":"Ferramentas!D237","v":"un"},{"$f":"Ferramentas!E237","v":6},{"$f":"Ferramentas!F237","v":0},0,{"$error":"#REF!"}]
["9.3.25",{"$f":"Ferramentas!B238","v":0},{"$f":"Ferramentas!C238","v":" Estrovenga "},{"$f":"Ferramentas!D238","v":"un"},{"$f":"Ferramentas!E238","v":105},{"$f":"Ferramentas!F238","v":0},0,{"$error":"#REF!"}]
["9.3.26",{"$f":"Ferramentas!B239","v":0},{"$f":"Ferramentas!C239","v":"Facão para mato, 18 pol"},{"$f":"Ferramentas!D239","v":"un"},{"$f":"Ferramentas!E239","v":107},{"$f":"Ferramentas!F239","v":0},0,{"$error":"#REF!"}]
["9.3.27",{"$f":"Ferramentas!B240","v":0},{"$f":"Ferramentas!C240","v":"Foice 33mm"},{"$f":"Ferramentas!D240","v":"un"},{"$f":"Ferramentas!E240","v":107},{"$f":"Ferramentas!F240","v":0},0,{"$error":"#REF!"}]
["9.3.28",{"$f":"Ferramentas!B241","v":0},{"$f":"Ferramentas!C241","v":" Fumigador para apicultura "},{"$f":"Ferramentas!D241","v":"un"},{"$f":"Ferramentas!E241","v":15},{"$f":"Ferramentas!F241","v":0},0,{"$error":"#REF!"}]
["9.3.29",{"$f":"Ferramentas!B242","v":0},{"$f":"Ferramentas!C242","v":" Lanterna grande - 10 Million "},{"$f":"Ferramentas!D242","v":"un"},{"$f":"Ferramentas!E242","v":12},{"$f":"Ferramentas!F242","v":0},0,{"$error":"#REF!"}]
["9.3.30",{"$f":"Ferramentas!B243","v":0},{"$f":"Ferramentas!C243","v":" Machado "},{"$f":"Ferramentas!D243","v":"un"},{"$f":"Ferramentas!E243","v":45},{"$f":"Ferramentas!F243","v":0},0,{"$error":"#REF!"}]
["9.3.31",{"$f":"Ferramentas!B244","v":0},{"$f":"Ferramentas!C244","v":" Mangueira de ¾ 50 MTS "},{"$f":"Ferramentas!D244","v":"un"},{"$f":"Ferramentas!E244","v":15},{"$f":"Ferramentas!F244","v":0},0,{"$error":"#REF!"}]
["9.3.32",{"$f":"Ferramentas!B245","v":0},{"$f":"Ferramentas!C245","v":" Mangueira de nível "},{"$f":"Ferramentas!D245","v":"un"},{"$f":"Ferramentas!E245","v":18},{"$f":"Ferramentas!F245","v":0},0,{"$error":"#REF!"}]
["9.3.33",{"$f":"Ferramentas!B246","v":"11269 - ORSE"},{"$f":"Ferramentas!C246","v":" Marreta de 1/2 kg com cabo "},{"$f":"Ferramentas!D246","v":"un"},{"$f":"Ferramentas!E246","v":12},{"$f":"Ferramentas!F246","v":0},0,{"$error":"#REF!"}]
["9.3.34",{"$f":"Ferramentas!B247","v":0},{"$f":"Ferramentas!C247","v":" Marreta de 2kg "},{"$f":"Ferramentas!D247","v":"un"},{"$f":"Ferramentas!E247","v":12},{"$f":"Ferramentas!F247","v":0},0,{"$error":"#REF!"}]
["9.3.35",{"$f":"Ferramentas!B248","v":0},{"$f":"Ferramentas!C248","v":"Marreta de 5kg com cabo de madeira"},{"$f":"Ferramentas!D248","v":"un"},{"$f":"Ferramentas!E248","v":12},{"$f":"Ferramentas!F248","v":0},0,{"$error":"#REF!"}]
["9.3.36",{"$f":"Ferramentas!B249","v":0},{"$f":"Ferramentas!C249","v":" Martelo com unha "},{"$f":"Ferramentas!D249","v":"un"},{"$f":"Ferramentas!E249","v":12},{"$f":"Ferramentas!F249","v":0},0,{"$error":"#REF!"}]
["9.3.37",{"$f":"Ferramentas!B250","v":0},{"$f":"Ferramentas!C250","v":" Martelo de borracha 32 Cm"},{"$f":"Ferramentas!D250","v":"un"},{"$f":"Ferramentas!E250","v":5},{"$f":"Ferramentas!F250","v":0},0,{"$error":"#REF!"}]
["9.3.38",{"$f":"Ferramentas!B251","v":0},{"$f":"Ferramentas!C251","v":" Nível c/ bolha ajustável de inclinação, bolha fixa e prumo – 250mm "},{"$f":"Ferramentas!D251","v":"un"},{"$f":"Ferramentas!E251","v":5},{"$f":"Ferramentas!F251","v":0},0,{"$error":"#REF!"}]
["9.3.39",{"$f":"Ferramentas!B252","v":0},{"$f":"Ferramentas!C252","v":" Nível de bolha de madeira "},{"$f":"Ferramentas!D252","v":"un"},{"$f":"Ferramentas!E252","v":5},{"$f":"Ferramentas!F252","v":0},0,{"$error":"#REF!"}]
["9.3.40",{"$f":"Ferramentas!B253","v":0},{"$f":"Ferramentas!C253","v":" Pá quadrada "},{"$f":"Ferramentas!D253","v":"un"},{"$f":"Ferramentas!E253","v":105},{"$f":"Ferramentas!F253","v":0},0,{"$error":"#REF!"}]
["9.3.41",{"$f":"Ferramentas!B254","v":0},{"$f":"Ferramentas!C254","v":" Pé-de-cabra "},{"$f":"Ferramentas!D254","v":"un"},{"$f":"Ferramentas!E254","v":30},{"$f":"Ferramentas!F254","v":0},0,{"$error":"#REF!"}]
["9.3.42",{"$f":"Ferramentas!B255","v":0},{"$f":"Ferramentas!C255","v":" Picareta com cabo "},{"$f":"Ferramentas!D255","v":"un"},{"$f":"Ferramentas!E255","v":105},{"$f":"Ferramentas!F255","v":0},0,{"$error":"#REF!"}]
["9.3.43",{"$f":"Ferramentas!B256","v":0},{"$f":"Ferramentas!C256","v":" Pistola para pintura "},{"$f":"Ferramentas!D256","v":"un"},{"$f":"Ferramentas!E256","v":5},{"$f":"Ferramentas!F256","v":0},0,{"$error":"#REF!"}]
["9.3.44",{"$f":"Ferramentas!B257","v":0},{"$f":"Ferramentas!C257","v":" Ponteiro de aço "},{"$f":"Ferramentas!D257","v":"un"},{"$f":"Ferramentas!E257","v":30},{"$f":"Ferramentas!F257","v":0},0,{"$error":"#REF!"}]
["9.3.45",{"$f":"Ferramentas!B258","v":"38377 - SINAPI"},{"$f":"Ferramentas!C258","v":" Prumo de centro "},{"$f":"Ferramentas!D258","v":"un"},{"$f":"Ferramentas!E258","v":5},{"$f":"Ferramentas!F258","v":0},0,{"$error":"#REF!"}]
["9.3.46",{"$f":"Ferramentas!B259","v":"38376 - SINAPI"},{"$f":"Ferramentas!C259","v":" Prumo de parede "},{"$f":"Ferramentas!D259","v":"un"},{"$f":"Ferramentas!E259","v":5},{"$f":"Ferramentas!F259","v":0},0,{"$error":"#REF!"}]
["9.3.47",{"$f":"Ferramentas!B260","v":0},{"$f":"Ferramentas!C260","v":" Rastelo (ASG) "},{"$f":"Ferramentas!D260","v":"un"},{"$f":"Ferramentas!E260","v":30},{"$f":"Ferramentas!F260","v":0},0,{"$error":"#REF!"}]
["9.3.48",{"$f":"Ferramentas!B261","v":0},{"$f":"Ferramentas!C261","v":"Refletor redondo em alumínio anodizado para lâmpada vapor de mercúrio/sódio, corpo em aluminio com pintura epoxi, para lâmpada E-27 de 300 W, com suporte redondo e alça regulável para fixação. "},{"$f":"Ferramentas!D261","v":"un"},{"$f":"Ferramentas!E261","v":30},{"$f":"Ferramentas!F261","v":0},0,{"$error":"#REF!"}]
["9.3.49",{"$f":"Ferramentas!B262","v":0},{"$f":"Ferramentas!C262","v":" Régua de alumínio - 2,00m "},{"$f":"Ferramentas!D262","v":"un"},{"$f":"Ferramentas!E262","v":5},{"$f":"Ferramentas!F262","v":0},0,{"$error":"#REF!"}]
["9.3.50",{"$f":"Ferramentas!B263","v":0},{"$f":"Ferramentas!C263","v":" Serrote 40cm "},{"$f":"Ferramentas!D263","v":"un"},{"$f":"Ferramentas!E263","v":12},{"$f":"Ferramentas!F263","v":0},0,{"$error":"#REF!"}]
["9.3.51",{"$f":"Ferramentas!B264","v":0},{"$f":"Ferramentas!C264","v":" Talhadeira de aço chato 10\" "},{"$f":"Ferramentas!D264","v":"un"},{"$f":"Ferramentas!E264","v":30},{"$f":"Ferramentas!F264","v":0},0,{"$error":"#REF!"}]
["9.3.52",{"$f":"Ferramentas!B265","v":0},{"$f":"Ferramentas!C265","v":" Torqueza "},{"$f":"Ferramentas!D265","v":"un"},{"$f":"Ferramentas!E265","v":15},{"$f":"Ferramentas!F265","v":0},0,{"$error":"#REF!"}]
["9.3.53",{"$f":"Ferramentas!B266","v":0},{"$f":"Ferramentas!C266","v":"Trena Metálica 8 m"},{"$f":"Ferramentas!D266","v":"un"},{"$f":"Ferramentas!E266","v":20},{"$f":"Ferramentas!F266","v":0},0,{"$error":"#REF!"}]
["9.3.54",{"$f":"Ferramentas!B267","v":0},{"$f":"Ferramentas!C267","v":" Trena de Fita 20m "},{"$f":"Ferramentas!D267","v":"un"},{"$f":"Ferramentas!E267","v":3},{"$f":"Ferramentas!F267","v":0},0,{"$error":"#REF!"}]
["9.3.55",{"$f":"Ferramentas!B268","v":0},{"$f":"Ferramentas!C268","v":" Trena de Fita 50m "},{"$f":"Ferramentas!D268","v":"un"},{"$f":"Ferramentas!E268","v":3},{"$f":"Ferramentas!F268","v":0},0,{"$error":"#REF!"}]
[]
["10.",null,{"$f":"Equipamentos!C13","v":"EQUIPAMENTOS"},null,null,null,{"$f":"SUBTOTAL(109,G605:G727)","v":0},{"$f":"ROUND(G604/G$8,4)","v":{"$error":"#REF!"}}]
["10.1.",null,{"$f":"Equipamentos!C15","v":"EQUIPAMENTOS - MECÂNICA"},null,null,null,{"$f":"SUBTOTAL(109,G606:G649)","v":0},{"$error":"#REF!"}]
["10.1.1",{"$f":"Equipamentos!B16","v":"COT_AFER"},{"$f":"Equipamentos!C16","v":"Aferidor de manômetro de 0 a 150 bar "},{"$f":"Equipamentos!D16","v":"un x mês"},{"$f":"Equipamentos!E16","v":12},{"$f":"Equipamentos!F16","v":0},0,{"$error":"#REF!"}]
["10.1.2",{"$f":"Equipamentos!B17","v":"COT_ALMO_FLEX"},{"$f":"Equipamentos!C17","v":"Almotolia de bico flexível 500ml"},{"$f":"Equipamentos!D17","v":"un x mês"},{"$f":"Equipamentos!E17","v":36},{"$f":"Equipamentos!F17","v":0},0,{"$error":"#REF!"}]
["10.1.3",{"$f":"Equipamentos!B18","v":"COT_ALMO_RIG"},{"$f":"Equipamentos!C18","v":"Almotolia de bico rígido 500ml"},{"$f":"Equipamentos!D18","v":"un x mês"},{"$f":"Equipamentos!E18","v":36},{"$f":"Equipamentos!F18","v":0},0,{"$error":"#REF!"}]
["10.1.4",{"$f":"Equipamentos!B19","v":"COT_ANDA"},{"$f":"Equipamentos!C19","v":"Andaime metálico tipo fachadeiro Dim: Largura= 1,20m / Altura por peça= 2,00m. (Altura Total=10m - 5 peças por conjunto)"},{"$f":"Equipamentos!D19","v":"m²"},{"$f":"Equipamentos!E19","v":144},{"$f":"Equipamentos!F19","v":0},0,{"$error":"#REF!"}]
["10.1.5",{"$f":"Equipamentos!B20","v":"COT_BANC_OFIC"},{"$f":"Equipamentos!C20","v":"Bancada para oficina (Dim: 1,2m x 2,5m) "},{"$f":"Equipamentos!D20","v":"un x mês"},{"$f":"Equipamentos!E20","v":72},{"$f":"Equipamentos!F20","v":0},0,{"$error":"#REF!"}]
["10.1.6",{"$f":"Equipamentos!B21","v":"COT_BOMB_GRAX"},{"$f":"Equipamentos!C21","v":"Bomba de graxa manual 5kg "},{"$f":"Equipamentos!D21","v":"un x mês"},{"$f":"Equipamentos!E21","v":36},{"$f":"Equipamentos!F21","v":0},0,{"$error":"#REF!"}]
["10.1.7",{"$f":"Equipamentos!B22","v":"13914 - SINAPI/PE"},{"$f":"Equipamentos!C22","v":"Talha Manual de Corrente com Alavanca 1,5 t Elevação 1,5m (Catraca 1,5 ton) "},{"$f":"Equipamentos!D22","v":"un x mês"},{"$f":"Equipamentos!E22","v":12},{"$f":"Equipamentos!F22","v":0},0,{"$error":"#REF!"}]
["10.1.8",{"$f":"Equipamentos!B23","v":"COT_CHAV_46"},{"$f":"Equipamentos!C23","v":"Chave de impacto 46mm boca/estria "},{"$f":"Equipamentos!D23","v":"un x mês"},{"$f":"Equipamentos!E23","v":24},{"$f":"Equipamentos!F23","v":0},0,{"$error":"#REF!"}]
["10.1.9",{"$f":"Equipamentos!B24","v":"COT_CHAV_55"},{"$f":"Equipamentos!C24","v":"Chave de impacto 55mm boca/estria "},{"$f":"Equipamentos!D24","v":"un x mês"},{"$f":"Equipamentos!E24","v":24},{"$f":"Equipamentos!F24","v":0},0,{"$error":"#REF!"}]
["10.1.10",{"$f":"Equipamentos!B25","v":"COT_CHAV_60"},{"$f":"Equipamentos!C25","v":"Chave de impacto 60mm boca/estria "},{"$f":"Equipamentos!D25","v":"un x mês"},{"$f":"Equipamentos!E25","v":24},{"$f":"Equipamentos!F25","v":0},0,{"$error":"#REF!"}]
["10.1.11",{"$f":"Equipamentos!B26","v":"COT_CHAV_65"},{"$f":"Equipamentos!C26","v":"Chave de impacto 65mm boca/estria "},{"$f":"Equipamentos!D26","v":"un x mês"},{"$f":"Equipamentos!E26","v":24},{"$f":"Equipamentos!F26","v":0},0,{"$error":"#REF!"}]
["10.1.12",{"$f":"Equipamentos!B27","v":"COT_CHAV_70"},{"$f":"Equipamentos!C27","v":"Chave de impacto 70mm boca/estria "},{"$f":"Equipamentos!D27","v":"un x mês"},{"$f":"Equipamentos!E27","v":24},{"$f":"Equipamentos!F27","v":0},0,{"$error":"#REF!"}]
["10.1.13",{"$f":"Equipamentos!B28","v":"COT_CHAV_75"},{"$f":"Equipamentos!C28","v":"Chave de impacto 75mm boca/estria"},{"$f":"Equipamentos!D28","v":"un x mês"},{"$f":"Equipamentos!E28","v":48},{"$f":"Equipamentos!F28","v":0},0,{"$error":"#REF!"}]
["10.1.14",{"$f":"Equipamentos!B29","v":"COT_CHAV_85"},{"$f":"Equipamentos!C29","v":"Chave de impacto 85mm boca/estria"},{"$f":"Equipamentos!D29","v":"un x mês"},{"$f":"Equipamentos!E29","v":48},{"$f":"Equipamentos!F29","v":0},{"$f":"ROUND(E619*F619,2)","v":0},{"$error":"#REF!"}]
["10.1.15",{"$f":"Equipamentos!B30","v":"COT_CINT_3T"},{"$f":"Equipamentos!C30","v":"Cinta para elevação de carga (comprimento: 3m / capacidade de carga: 3t)"},{"$f":"Equipamentos!D30","v":"un x mês"},{"$f":"Equipamentos!E30","v":18},{"$f":"Equipamentos!F30","v":0},0,{"$error":"#REF!"}]
["10.1.16",{"$f":"Equipamentos!B31","v":"COT_CINT_20T"},{"$f":"Equipamentos!C31","v":"Cinta para elevação de carga  (comprimento: 6m / capacidade de carga: 20t)"},{"$f":"Equipamentos!D31","v":"un x mês"},{"$f":"Equipamentos!E31","v":18},{"$f":"Equipamentos!F31","v":0},0,{"$error":"#REF!"}]
["10.1.17",{"$f":"Equipamentos!B32","v":"COT_CORT"},{"$f":"Equipamentos!C32","v":"Cortador a frio para tubos - Cortador Tubo Ferro Ferrari 1/8\" - 2\""},{"$f":"Equipamentos!D32","v":"un x mês"},{"$f":"Equipamentos!E32","v":24},{"$f":"Equipamentos!F32","v":0},0,{"$error":"#REF!"}]
["10.1.18",{"$f":"Equipamentos!B33","v":"COT_CURV"},{"$f":"Equipamentos!C33","v":"Curvador de tubos (Até 1”) - Curvador e Dobrador De Tubos Manual"},{"$f":"Equipamentos!D33","v":"un x mês"},{"$f":"Equipamentos!E33","v":24},{"$f":"Equipamentos!F33","v":0},0,{"$error":"#REF!"}]
["10.1.19",{"$f":"Equipamentos!B34","v":"38476 - SINAPI/PE"},{"$f":"Equipamentos!C34","v":"Escada de abrir com 2 x 8 degraus (2,40m) em alumínio "},{"$f":"Equipamentos!D34","v":"un x mês"},{"$f":"Equipamentos!E34","v":48},{"$f":"Equipamentos!F34","v":0},0,{"$error":"#REF!"}]
["10.1.20",{"$f":"Equipamentos!B35","v":"38477 - SINAPI/PE"},{"$f":"Equipamentos!C35","v":"Escada de marinheiro extensível em duraluníno com 10 x 20 degraus (3,00m / 6,00m) "},{"$f":"Equipamentos!D35","v":"un x mês"},{"$f":"Equipamentos!E35","v":36},{"$f":"Equipamentos!F35","v":0},0,{"$error":"#REF!"}]
["10.1.21",{"$f":"Equipamentos!B36","v":"COT_ESCA_07"},{"$f":"Equipamentos!C36","v":"Escada metálica de 07 degraus "},{"$f":"Equipamentos!D36","v":"un x mês"},{"$f":"Equipamentos!E36","v":36},{"$f":"Equipamentos!F36","v":0},0,{"$error":"#REF!"}]
["10.1.22",{"$f":"Equipamentos!B37","v":"COT_ESCA_16"},{"$f":"Equipamentos!C37","v":"Escada articulada multifuncional 4x4 16 degraus"},{"$f":"Equipamentos!D37","v":"un x mês"},{"$f":"Equipamentos!E37","v":12},{"$f":"Equipamentos!F37","v":0},0,{"$error":"#REF!"}]
["10.1.23",{"$f":"Equipamentos!B38","v":"COT_ESME"},{"$f":"Equipamentos!C38","v":"Esmerilhadeira angular de 4 ½” "},{"$f":"Equipamentos!D38","v":"un x mês"},{"$f":"Equipamentos!E38","v":24},{"$f":"Equipamentos!F38","v":0},0,{"$error":"#REF!"}]
["10.1.24",{"$f":"Equipamentos!B39","v":"11359 - SINAPI/PE"},{"$f":"Equipamentos!C39","v":"Esmerilhadeira angular de 7” "},{"$f":"Equipamentos!D39","v":"un x mês"},{"$f":"Equipamentos!E39","v":24},{"$f":"Equipamentos!F39","v":0},0,{"$error":"#REF!"}]
["10.1.25",{"$f":"Equipamentos!B40","v":"I9378 - SEINFRA/CE"},{"$f":"Equipamentos!C40","v":"Furadeira Manual 650W 1050 – 1450 RPM 220V Ø 13mm"},{"$f":"Equipamentos!D40","v":"un x mês"},{"$f":"Equipamentos!E40","v":24},{"$f":"Equipamentos!F40","v":0},0,{"$error":"#REF!"}]
["10.1.26",{"$f":"Equipamentos!B41","v":"COT_INDU"},{"$f":"Equipamentos!C41","v":"Indutor elétrico para aquecimento de rolamentos (JM 500) "},{"$f":"Equipamentos!D41","v":"un x mês"},{"$f":"Equipamentos!E41","v":12},{"$f":"Equipamentos!F41","v":0},0,{"$error":"#REF!"}]
["10.1.27",{"$f":"Equipamentos!B42","v":"COT_LIXA"},{"$f":"Equipamentos!C42","v":"Lixadeira 4 1/2\" "},{"$f":"Equipamentos!D42","v":"un x mês"},{"$f":"Equipamentos!E42","v":24},{"$f":"Equipamentos!F42","v":0},0,{"$error":"#REF!"}]
["10.1.28",{"$f":"Equipamentos!B43","v":"COT_MACA_20T"},{"$f":"Equipamentos!C43","v":"Macaco de comando a distância 20 t - Macaco Hidráulico 20 Toneladas Tipo Garrafa"},{"$f":"Equipamentos!D43","v":"un x mês"},{"$f":"Equipamentos!E43","v":24},{"$f":"Equipamentos!F43","v":0},0,{"$error":"#REF!"}]
["10.1.29",{"$f":"Equipamentos!B44","v":"COT_MACA_50T"},{"$f":"Equipamentos!C44","v":"Macaco de comando a distância 50 t - Macaco Hidráulico 50 Toneladas Tipo Garrafa"},{"$f":"Equipamentos!D44","v":"un x mês"},{"$f":"Equipamentos!E44","v":24},{"$f":"Equipamentos!F44","v":0},0,{"$error":"#REF!"}]
["10.1.30",{"$f":"Equipamentos!B45","v":"COT_MACA_2T"},{"$f":"Equipamentos!C45","v":"Macaco tipo elevador capacidade de 2 t - Macaco Hidráulico 2 Toneladas tipo Garrafa"},{"$f":"Equipamentos!D45","v":"un x mês"},{"$f":"Equipamentos!E45","v":24},{"$f":"Equipamentos!F45","v":0},0,{"$error":"#REF!"}]
["10.1.31",{"$f":"Equipamentos!B46","v":"COT_MACA_GIR"},{"$f":"Equipamentos!C46","v":"Macaco tipo girafa de 2 t - Guincho Hidráulico 2 Toneladas com Prolongador"},{"$f":"Equipamentos!D46","v":"un x mês"},{"$f":"Equipamentos!E46","v":24},{"$f":"Equipamentos!F46","v":0},0,{"$error":"#REF!"}]
["10.1.32",{"$f":"Equipamentos!B47","v":"40403 - SINAPI/PE"},{"$f":"Equipamentos!C47","v":"Máquina de solda elétrica de 250 A com kit."},{"$f":"Equipamentos!D47","v":"un x mês"},{"$f":"Equipamentos!E47","v":24},{"$f":"Equipamentos!F47","v":0},0,{"$error":"#REF!"}]
["10.1.33",{"$f":"Equipamentos!B48","v":"COT_MORS"},{"$f":"Equipamentos!C48","v":"Morsa para bancada nº 08 "},{"$f":"Equipamentos!D48","v":"un x mês"},{"$f":"Equipamentos!E48","v":72},{"$f":"Equipamentos!F48","v":0},0,{"$error":"#REF!"}]
["10.1.34",{"$f":"Equipamentos!B49","v":"E9630-DNIT/PE"},{"$f":"Equipamentos!C49","v":"Conjunto Motor bomba 7,5 CV, 380 V, Q=75,6 m3/h e H=17 mca. (Poço de rebaixamento da EBV-3)"},{"$f":"Equipamentos!D49","v":"un x mês"},{"$f":"Equipamentos!E49","v":12},{"$f":"Equipamentos!F49","v":0},0,{"$error":"#REF!"}]
["10.1.35",{"$f":"Equipamentos!B50","v":"COT_BOMB_SUB"},{"$f":"Equipamentos!C50","v":"Bomba Submersível 5 Cv Trifásica 380V, Q=2 - 52 m3/h e H= 3-25 mca.(Poço de rebaixamento do Res. de areias (Estrutura de Controle)"},{"$f":"Equipamentos!D50","v":"un x mês"},{"$f":"Equipamentos!E50","v":12},{"$f":"Equipamentos!F50","v":0},0,{"$error":"#REF!"}]
["10.1.36",{"$f":"Equipamentos!B51","v":"COT_MOTO_ESMER"},{"$f":"Equipamentos!C51","v":"Motoesmeril de 1cv - 3.500 RPM "},{"$f":"Equipamentos!D51","v":"un x mês"},{"$f":"Equipamentos!E51","v":72},{"$f":"Equipamentos!F51","v":0},0,{"$error":"#REF!"}]
["10.1.37",{"$f":"Equipamentos!B52","v":"COT_MULT"},{"$f":"Equipamentos!C52","v":"Multiplicador de Torque Manual 2700 N.m/2000 lb.ft CDI GA190"},{"$f":"Equipamentos!D52","v":"un x mês"},{"$f":"Equipamentos!E52","v":12},{"$f":"Equipamentos!F52","v":0},0,{"$error":"#REF!"}]
["10.1.38",{"$f":"Equipamentos!B53","v":"7252 - SINAPI/PE"},{"$f":"Equipamentos!C53","v":"Nível de precisão  "},{"$f":"Equipamentos!D53","v":"un x mês"},{"$f":"Equipamentos!E53","v":12},{"$f":"Equipamentos!F53","v":0},0,{"$error":"#REF!"}]
["10.1.39",{"$f":"Equipamentos!B54","v":"COT_PARA"},{"$f":"Equipamentos!C54","v":"Parafusadeira elétrica a bateria "},{"$f":"Equipamentos!D54","v":"un x mês"},{"$f":"Equipamentos!E54","v":24},{"$f":"Equipamentos!F54","v":0},0,{"$error":"#REF!"}]
["10.1.40",{"$f":"Equipamentos!B55","v":"COT_PREN"},{"$f":"Equipamentos!C55","v":"Prensa hidráulica de 10 ton "},{"$f":"Equipamentos!D55","v":"un x mês"},{"$f":"Equipamentos!E55","v":24},{"$f":"Equipamentos!F55","v":0},0,{"$error":"#REF!"}]
["10.1.41",{"$f":"Equipamentos!B56","v":"E9207-DNIT/PE"},{"$f":"Equipamentos!C56","v":"Retífica elétrica "},{"$f":"Equipamentos!D56","v":"un x mês"},{"$f":"Equipamentos!E56","v":24},{"$f":"Equipamentos!F56","v":0},0,{"$error":"#REF!"}]
["10.1.42",{"$f":"Equipamentos!B57","v":"E9748-DNIT/PE"},{"$f":"Equipamentos!C57","v":"Rosqueadeira ( para tubos de ½” a 4”) -Rosqueadeira Elétrica 1/2 A 4 Pol. 750w 220v-Br Motors-Brr124bsp"},{"$f":"Equipamentos!D57","v":"un x mês"},{"$f":"Equipamentos!E57","v":12},{"$f":"Equipamentos!F57","v":0},0,{"$error":"#REF!"}]
["10.1.43",{"$f":"Equipamentos!B58","v":"10809 - SINAPI/PE"},{"$f":"Equipamentos!C58","v":"Talha capacidade 3t"},{"$f":"Equipamentos!D58","v":"un x mês"},{"$f":"Equipamentos!E58","v":24},{"$f":"Equipamentos!F58","v":0},0,{"$error":"#REF!"}]
["10.1.44",{"$f":"Equipamentos!B59","v":"COT_TIFO"},{"$f":"Equipamentos!C59","v":"Tifor 3t"},{"$f":"Equipamentos!D59","v":"un x mês"},{"$f":"Equipamentos!E59","v":24},{"$f":"Equipamentos!F59","v":0},0,{"$error":"#REF!"}]
["10.2.",null,{"$f":"Equipamentos!C62","v":"EQUIPAMENTOS - ELÉTRICA"},null,null,null,{"$f":"SUBTOTAL(109,G651:G661)","v":0},{"$error":"#REF!"}]
["10.2.1",{"$f":"Equipamentos!B63","v":"COT_ANAL"},{"$f":"Equipamentos!C63","v":"Analisador de grandezas elétricas trifásico, display LCD colorido 5,6\", TRMS 1.000 V, corrente 3.000A "},{"$f":"Equipamentos!D63","v":"un x mês"},{"$f":"Equipamentos!E63","v":12},{"$f":"Equipamentos!F63","v":0},0,{"$error":"#REF!"}]
["10.2.2",{"$f":"Equipamentos!B64","v":"COT_BANC_TESTE"},{"$f":"Equipamentos!C64","v":"Bancada de teste, amperimetro 150A, voltímetro 40V "},{"$f":"Equipamentos!D64","v":"un x mês"},{"$f":"Equipamentos!E64","v":12},{"$f":"Equipamentos!F64","v":0},0,{"$error":"#REF!"}]
["10.2.3",{"$f":"Equipamentos!B65","v":"COT_BANC_PROT"},{"$f":"Equipamentos!C65","v":"Bancada protegida contra eletricidade estática "},{"$f":"Equipamentos!D65","v":"un x mês"},{"$f":"Equipamentos!E65","v":12},{"$f":"Equipamentos!F65","v":0},0,{"$error":"#REF!"}]
["10.2.4",{"$f":"Equipamentos!B66","v":"COT_DATA"},{"$f":"Equipamentos!C66","v":"Data Logger de 4 a 20 mA (verificação de intermitência em instrumentação) "},{"$f":"Equipamentos!D66","v":"un x mês"},{"$f":"Equipamentos!E66","v":12},{"$f":"Equipamentos!F66","v":0},0,{"$error":"#REF!"}]
["10.2.5",{"$f":"Equipamentos!B67","v":"13761 - SINAPI/PE"},{"$f":"Equipamentos!C67","v":"Estação de solda com temperatura ajustável e proteção antiestático "},{"$f":"Equipamentos!D67","v":"un x mês"},{"$f":"Equipamentos!E67","v":12},{"$f":"Equipamentos!F67","v":0},0,{"$error":"#REF!"}]
["10.2.6",{"$f":"Equipamentos!B68","v":"10236 - ORSE/SE"},{"$f":"Equipamentos!C68","v":"Fonte de alimentação com tensão variável de 0 a 30Vcc de 3 A "},{"$f":"Equipamentos!D68","v":"un x mês"},{"$f":"Equipamentos!E68","v":12},{"$f":"Equipamentos!F68","v":0},0,{"$error":"#REF!"}]
["10.2.7",{"$f":"Equipamentos!B69","v":"COT_FONT"},{"$f":"Equipamentos!C69","v":"Fonte de bancada 12 V "},{"$f":"Equipamentos!D69","v":"un x mês"},{"$f":"Equipamentos!E69","v":12},{"$f":"Equipamentos!F69","v":0},0,{"$error":"#REF!"}]
["10.2.8",{"$f":"Equipamentos!B70","v":"I9378 - SEINFRA/CE"},{"$f":"Equipamentos!C70","v":"Furadeira Manual 650W 1050 – 1450 RPM 220V Ø 13mm"},{"$f":"Equipamentos!D70","v":"un x mês"},{"$f":"Equipamentos!E70","v":12},{"$f":"Equipamentos!F70","v":0},0,{"$error":"#REF!"}]
["10.2.9",{"$f":"Equipamentos!B71","v":"COT_GERA"},{"$f":"Equipamentos!C71","v":"Gerador de corrente e tensão de 0 a 20 mA e 0 a 10V, precisão de 0,1% "},{"$f":"Equipamentos!D71","v":"un x mês"},{"$f":"Equipamentos!E71","v":12},{"$f":"Equipamentos!F71","v":0},0,{"$error":"#REF!"}]
["10.2.10",{"$f":"Equipamentos!B72","v":"COT_KIT "},{"$f":"Equipamentos!C72","v":"Kit para enchimento e complementação para gás SF6, composto de adaptador ,regulador, mangueira e manômetro padrão "},{"$f":"Equipamentos!D72","v":"un x mês"},{"$f":"Equipamentos!E72","v":12},{"$f":"Equipamentos!F72","v":0},0,{"$error":"#REF!"}]
["10.2.11",{"$f":"Equipamentos!B73","v":"COT_TTR "},{"$f":"Equipamentos!C73","v":"TTR - medidor digital de relação de espiras, escala de medição 0,8000:1 a 8.000,0: 1 "},{"$f":"Equipamentos!D73","v":"un x mês"},{"$f":"Equipamentos!E73","v":12},{"$f":"Equipamentos!F73","v":0},0,{"$error":"#REF!"}]
["10.3.",null,{"$f":"Equipamentos!C76","v":"EQUIPAMENTOS - CIVIL"},null,null,null,{"$f":"SUBTOTAL(109,G663:G727)","v":0},{"$error":"#REF!"}]
["10.3.1.",null,{"$f":"Equipamentos!C77","v":"MANUTENÇÃO"},null,null,null,{"$f":"SUBTOTAL(109,G664:G717)","v":0},{"$error":"#REF!"}]
["10.3.1.1",{"$f":"Equipamentos!B78","v":"4085 - SINAPI/PE"},{"$f":"Equipamentos!C78","v":"Bomba elétrica submersa para drenagem 5cv Flyght 3\" 12.3 m³/h (acompanhada com os mangotes, incluindo quadro de comando compatível com o modelo de bomba, 250 m de cabo flexível trifásico, isolado, tensão 600 V/1000 V, em conformidade com NBR 7288)."},{"$f":"Equipamentos!D78","v":"un x mês"},{"$f":"Equipamentos!E78","v":24},{"$f":"Equipamentos!F78","v":0},0,{"$error":"#REF!"}]
["10.3.1.2",{"$f":"Equipamentos!B79","v":"COT_ANDA"},{"$f":"Equipamentos!C79","v":"Andaime metálico tipo fachadeiro Dim: Largura= 1,20m / Altura por peça= 2,00m. (Altura Total=10m - 5 peças por conjunto)"},{"$f":"Equipamentos!D79","v":"m²"},{"$f":"Equipamentos!E79","v":144},{"$f":"Equipamentos!F79","v":0},0,{"$error":"#REF!"}]
["10.3.1.3",{"$f":"Equipamentos!B80","v":"COT_BETO"},{"$f":"Equipamentos!C80","v":"Betoneira, capacidade nominal 400 l, capacidade de mistura 310 l, motor a diesel potência 5 cv, sem carregador."},{"$f":"Equipamentos!D80","v":"un x mês"},{"$f":"Equipamentos!E80","v":36},{"$f":"Equipamentos!F80","v":0},0,{"$f":"ROUND(G666/G$8,4)","v":{"$error":"#REF!"}}]
["10.3.1.4",{"$f":"Equipamentos!B81","v":"36398 - SINAPI/PE"},{"$f":"Equipamentos!C81","v":"Betoneira, capacidade nominal 600 l, capacidade de mistura 440 l,  motor a diesel potência 10 cv, com carregador."},{"$f":"Equipamentos!D81","v":"un x mês"},{"$f":"Equipamentos!E81","v":36},{"$f":"Equipamentos!F81","v":0},0,{"$error":"#REF!"}]
["10.3.1.5",{"$f":"Equipamentos!B82","v":"746 - SINAPI/PE"},{"$f":"Equipamentos!C82","v":"Lavadora de alta pressão a diesel, partida elétrica, motor de 10 hp"},{"$f":"Equipamentos!D82","v":"un x mês"},{"$f":"Equipamentos!E82","v":12},{"$f":"Equipamentos!F82","v":0},0,{"$error":"#REF!"}]
["10.3.1.6",{"$f":"Equipamentos!B83","v":"COT_BOMB_DRAGA"},{"$f":"Equipamentos!C83","v":"Bomba draga autoescorvante 3”x 3” , motor: 4 tempos, potência: 6,5cv, cilindrada: 196 cm³, ignição eletrônica, consumo aproximadamente: 1,7 l/h, capacidade do tanque: 3,6 l."},{"$f":"Equipamentos!D83","v":"un x mês"},{"$f":"Equipamentos!E83","v":24},{"$f":"Equipamentos!F83","v":0},0,{"$error":"#REF!"}]
["10.3.1.7",{"$f":"Equipamentos!B84","v":"COT_BOMB_4CV"},{"$f":"Equipamentos!C84","v":"Locação de bomba submersível para drenagem e esgotamento, motor elétrico trifásico, potência de  4 cv, diâmetro de recalque de 3\". Faixa de operação: Q= 60 m³/h (± 1 m³/h) e AMT=2 m; Q= 11 m³/h (± 1 m³/h) e AMT = 23 m (± 1 m)."},{"$f":"Equipamentos!D84","v":"un x mês"},{"$f":"Equipamentos!E84","v":24},{"$f":"Equipamentos!F84","v":0},0,{"$error":"#REF!"}]
["10.3.1.8",{"$f":"Equipamentos!B85","v":"COT_BOMBA_2CV"},{"$f":"Equipamentos!C85","v":"Locação de bomba submersível para drenagem e esgotamento, motor elétrico trifásico, potência de 2 cv, diâmetro de recalque de  2\". Faixa de operação: Q= 35 m³/h (± 3 m³/h) e AMT=2 m; Q=13 m³/h (± 3 m³/h) e AMT = 17 m (± 3 m)."},{"$f":"Equipamentos!D85","v":"un x mês"},{"$f":"Equipamentos!E85","v":24},{"$f":"Equipamentos!F85","v":0},0,{"$error":"#REF!"}]
["10.3.1.9",{"$f":"Equipamentos!B86","v":"E9579-DNIT/PE"},{"$f":"Equipamentos!C86","v":"Caminhão basculante, capacidade de carga  15,0 t e volume 10,0 m³ ."},{"$f":"Equipamentos!D86","v":"un x mês"},{"$f":"Equipamentos!E86","v":36},{"$f":"Equipamentos!F86","v":0},0,{"$error":"#REF!"}]
["10.3.1.10",{"$f":"Equipamentos!B87","v":"E9506-DNIT/PE"},{"$f":"Equipamentos!C87","v":"Caminhao basculante, capacidade de carga  9,0 t e volume 6,0 m³ ."},{"$f":"Equipamentos!D87","v":"un x mês"},{"$f":"Equipamentos!E87","v":36},{"$f":"Equipamentos!F87","v":0},0,{"$error":"#REF!"}]
["10.3.1.11",{"$f":"Equipamentos!B88","v":"E9592-DNIT/PE"},{"$f":"Equipamentos!C88","v":"Caminhão Carroceria - de madeira, capacidade de carga 15,0 t"},{"$f":"Equipamentos!D88","v":"un x mês"},{"$f":"Equipamentos!E88","v":36},{"$f":"Equipamentos!F88","v":0},0,{"$error":"#REF!"}]
["10.3.1.12",{"$f":"Equipamentos!B89","v":"COT_CAMI"},{"$f":"Equipamentos!C89","v":"Caminhão Comboio para lubrificação e abastecimento (melosa), convencional totalmente equipado (Capacidade de Combustível: 5.000 l, Capacidade de Lubrificante: 500 l, Capacidade de Graxa: 200 kg, Capacidade de Água: 300 l, Recipiente para Óleo Usado: 200 l, Compressor de Ar e Bomba- d’agua)."},{"$f":"Equipamentos!D89","v":"un x mês"},{"$f":"Equipamentos!E89","v":12},{"$f":"Equipamentos!F89","v":0},0,{"$error":"#REF!"}]
["10.3.1.13",{"$f":"Equipamentos!B90","v":"E9686-DNIT/PE"},{"$f":"Equipamentos!C90","v":"Caminhão guindauto com capacidade de carga até 10,0 t."},{"$f":"Equipamentos!D90","v":"un x mês"},{"$f":"Equipamentos!E90","v":36},{"$f":"Equipamentos!F90","v":0},0,{"$error":"#REF!"}]
["10.3.1.14",{"$f":"Equipamentos!B91","v":"E9605-DNIT/PE"},{"$f":"Equipamentos!C91","v":"Caminhão tanque, capacidade de volume  6000 l e potência 136,0 hp ."},{"$f":"Equipamentos!D91","v":"un x mês"},{"$f":"Equipamentos!E91","v":36},{"$f":"Equipamentos!F91","v":0},{"$f":"ROUND(E677*F677,2)","v":0},{"$error":"#REF!"}]
["10.3.1.15",{"$f":"Equipamentos!B92","v":"4262 - SINAPI/PE"},{"$f":"Equipamentos!C92","v":"Pá carregadeira sobre rodas, potência líquida 128 hp, capacidade da caçamba de 1,7 a 2,8 m³, peso operacional de 11.632 kg."},{"$f":"Equipamentos!D92","v":"un x mês"},{"$f":"Equipamentos!E92","v":24},{"$f":"Equipamentos!F92","v":0},0,{"$error":"#REF!"}]
["10.3.1.16",{"$f":"Equipamentos!B93","v":"E9666-DNIT/PE"},{"$f":"Equipamentos!C93","v":"Transportes de máquinas e equipamentos por caminhão cavalo mecânico com carreta-prancha capacidade 20t"},{"$f":"Equipamentos!D93","v":"un x mês"},{"$f":"Equipamentos!E93","v":12},{"$f":"Equipamentos!F93","v":0},0,{"$error":"#REF!"}]
["10.3.1.17",{"$f":"Equipamentos!B94","v":"E9107-DNIT/PE"},{"$f":"Equipamentos!C94","v":"Compactador de solo a percussão (soquete), com motor gasolina de 4 tempos, peso entre 55 e 65 kg, força de impacto de 1.000 a 1.500 kgf, frequência de 600 a 700 golpes por minuto,velocidade de trabalho entre 10 e 15 m/min, potência entre 2 e 3 hp."},{"$f":"Equipamentos!D94","v":"un x mês"},{"$f":"Equipamentos!E94","v":108},{"$f":"Equipamentos!F94","v":0},0,{"$error":"#REF!"}]
["10.3.1.18",{"$f":"Equipamentos!B95","v":"E9556-DNIT/PE"},{"$f":"Equipamentos!C95","v":"Compactador de solo, tipo placa vibratória reversível, com motor a diesel, peso entre 700 e 820 kg, força centrífuga entre 6.200 e 10.000 kgf, largura de trabalho entre 650 e 720 mm, frequência de vibração entre 3.000 e 3.500 rpm, velocidade de trabalho entre 25 e 30 m/min, potência entre 13,0 e 15,0 hp."},{"$f":"Equipamentos!D95","v":"un x mês"},{"$f":"Equipamentos!E95","v":60},{"$f":"Equipamentos!F95","v":0},0,{"$error":"#REF!"}]
["10.3.1.19",{"$f":"Equipamentos!B96","v":"E9513-DNIT/PE"},{"$f":"Equipamentos!C96","v":"Compressor de ar rebocável, vazão 400 pcm, pressão efetiva de trabalho 102 psi, motor diesel, potência 110 cv."},{"$f":"Equipamentos!D96","v":"un x mês"},{"$f":"Equipamentos!E96","v":12},{"$f":"Equipamentos!F96","v":0},0,{"$error":"#REF!"}]
["10.3.1.20",{"$f":"Equipamentos!B97","v":"E9661-DNIT/PE"},{"$f":"Equipamentos!C97","v":"Compressor de ar rebocável, vazão 189 pcm, pressão efetiva de trabalho 102 psi, motor diesel, potência  63 cv."},{"$f":"Equipamentos!D97","v":"un x mês"},{"$f":"Equipamentos!E97","v":12},{"$f":"Equipamentos!F97","v":0},0,{"$error":"#REF!"}]
["10.3.1.21",{"$f":"Equipamentos!B98","v":"COT_CONJ_160"},{"$f":"Equipamentos!C98","v":"Conjunto motorbomba com 160 kW de potência no motor elétrico (25 mca x 0,5 m³/s) para esgotamento, com respectivos mangotes de sucção e descarga a serem especificados em função dos diâmetros. "},{"$f":"Equipamentos!D98","v":"un x mês"},{"$f":"Equipamentos!E98","v":12},{"$f":"Equipamentos!F98","v":0},0,{"$error":"#REF!"}]
["10.3.1.22",{"$f":"Equipamentos!B99","v":"COT_CONJ_30"},{"$f":"Equipamentos!C99","v":"Conjunto motorbomba com 30 kW de potência no motor elétrico (25 mca x 0,1 m³/s) para esgotamento, com respectivos mangotes de sucção e descarga a serem especificados em função dos diâmetros. "},{"$f":"Equipamentos!D99","v":"un x mês"},{"$f":"Equipamentos!E99","v":12},{"$f":"Equipamentos!F99","v":0},0,{"$error":"#REF!"}]
["10.3.1.23",{"$f":"Equipamentos!B100","v":"E9528-DNIT/PE"},{"$f":"Equipamentos!C100","v":"Empilhadeira sobre pneus com torre de três estágios, 4,80 m de elevação, com deslocador lateral dos garfos, motor glp 2.4 l, capacidade nominal de carga de 2,5 t."},{"$f":"Equipamentos!D100","v":"un x mês"},{"$f":"Equipamentos!E100","v":12},{"$f":"Equipamentos!F100","v":0},0,{"$error":"#REF!"}]
["10.3.1.24",{"$f":"Equipamentos!B101","v":"E9017-DNIT/PE"},{"$f":"Equipamentos!C101","v":"Escavadeira hidráulica sobre esteiras, caçamba 0,62 m³, peso operacional 12,61 t, potência líquida 95 hp."},{"$f":"Equipamentos!D101","v":"un x mês"},{"$f":"Equipamentos!E101","v":12},{"$f":"Equipamentos!F101","v":0},0,{"$error":"#REF!"}]
["10.3.1.25",{"$f":"Equipamentos!B102","v":"COT_ESCAV"},{"$f":"Equipamentos!C102","v":"Escavadeira hidráulica sobre esteiras, caçamba  0,80 m³, peso operacional 17 t, potência bruta 111 hp."},{"$f":"Equipamentos!D102","v":"un x mês"},{"$f":"Equipamentos!E102","v":24},{"$f":"Equipamentos!F102","v":0},0,{"$error":"#REF!"}]
["10.3.1.26",{"$f":"Equipamentos!B103","v":"E9521-DNIT/PE"},{"$f":"Equipamentos!C103","v":"Grupo gerador de 4 KVA, 220v, trifásico, silenciado, com 100 metros de cabos e 01 QTA. "},{"$f":"Equipamentos!D103","v":"un x mês"},{"$f":"Equipamentos!E103","v":24},{"$f":"Equipamentos!F103","v":0},0,{"$error":"#REF!"}]
["10.3.1.27",{"$f":"Equipamentos!B104","v":"E9066-DNIT/PE"},{"$f":"Equipamentos!C104","v":"Grupo gerador de 10 KVA, 220v, trifásico, silenciado, com 100 metros de cabos e 01 QTA. "},{"$f":"Equipamentos!D104","v":"un x mês"},{"$f":"Equipamentos!E104","v":24},{"$f":"Equipamentos!F104","v":0},0,{"$error":"#REF!"}]
["10.3.1.28",{"$f":"Equipamentos!B105","v":"COT_GRUP_15KVA"},{"$f":"Equipamentos!C105","v":"Grupo gerador, potência nominal 15 kVA (emergência), incluindo instalação, cabeamento, base de concreto e demais materiais necessários."},{"$f":"Equipamentos!D105","v":"un x mês"},{"$f":"Equipamentos!E105","v":24},{"$f":"Equipamentos!F105","v":0},0,{"$error":"#REF!"}]
["10.3.1.29",{"$f":"Equipamentos!B106","v":"E9066-DNIT/PE"},{"$f":"Equipamentos!C106","v":"Grupo gerador de 15 kVA, 220V, trifásico, silenciado, com 100 metros de cabos e 01 QTA. "},{"$f":"Equipamentos!D106","v":"un x mês"},{"$f":"Equipamentos!E106","v":12},{"$f":"Equipamentos!F106","v":0},0,{"$error":"#REF!"}]
["10.3.1.30",{"$f":"Equipamentos!B107","v":"36500 - SINAPI/PE"},{"$f":"Equipamentos!C107","v":"Locação de grupo gerador acima de 125 até 180 kVA, motor diesel, rebocável, acionamento manual."},{"$f":"Equipamentos!D107","v":"un x mês"},{"$f":"Equipamentos!E107","v":12},{"$f":"Equipamentos!F107","v":0},0,{"$error":"#REF!"}]
["10.3.1.31",{"$f":"Equipamentos!B108","v":"39593 - SINAPI/PE"},{"$f":"Equipamentos!C108","v":"Grupo gerador diesel, com carenagem, potência standart entre 250 e 260 kVA, velocidade de 1800 rpm, frequência de 60 Hz."},{"$f":"Equipamentos!D108","v":"un x mês"},{"$f":"Equipamentos!E108","v":12},{"$f":"Equipamentos!F108","v":0},0,{"$error":"#REF!"}]
["10.3.1.32",{"$f":"Equipamentos!B109","v":"COT_PLAT"},{"$f":"Equipamentos!C109","v":"Plataforma Aérea, altura de trabalho 16,0 m, capacidade de carga 227 kg, fonte de energia: diesel, painel de controle na base e na plataforma, altura arriada: 2,0 m."},{"$f":"Equipamentos!D109","v":"un x mês"},{"$f":"Equipamentos!E109","v":24},{"$f":"Equipamentos!F109","v":0},0,{"$error":"#REF!"}]
["10.3.1.33",{"$f":"Equipamentos!B110","v":"40269 - SINAPI/PE"},{"$f":"Equipamentos!C110","v":"Serra circular de bancada, modelo pica-pau, diâmetro de 350 mm. Características do motor: trifásico, potência de 5 hp, frequência de 60 H."},{"$f":"Equipamentos!D110","v":"un x mês"},{"$f":"Equipamentos!E110","v":36},{"$f":"Equipamentos!F110","v":0},0,{"$error":"#REF!"}]
["10.3.1.34",{"$f":"Equipamentos!B111","v":"40403 - SINAPI/PE"},{"$f":"Equipamentos!C111","v":"Máquina de solda elétrica de 250 A com kit."},{"$f":"Equipamentos!D111","v":"un x mês"},{"$f":"Equipamentos!E111","v":36},{"$f":"Equipamentos!F111","v":0},0,{"$error":"#REF!"}]
["10.3.1.35",{"$f":"Equipamentos!B112","v":"E9568-DNIT/PE"},{"$f":"Equipamentos!C112","v":"Furadeira elétrica profissional."},{"$f":"Equipamentos!D112","v":"un x mês"},{"$f":"Equipamentos!E112","v":36},{"$f":"Equipamentos!F112","v":0},0,{"$error":"#REF!"}]
["10.3.1.36",{"$f":"Equipamentos!B113","v":"13192 - SINAPI/PE"},{"$f":"Equipamentos!C113","v":"Lixadeira elétrica angular para concreto, potência 1.400 W, prato diamantado de 5''."},{"$f":"Equipamentos!D113","v":"un x mês"},{"$f":"Equipamentos!E113","v":36},{"$f":"Equipamentos!F113","v":0},0,{"$error":"#REF!"}]
["10.3.1.37",{"$f":"Equipamentos!B114","v":"14619 - SINAPI/PE"},{"$f":"Equipamentos!C114","v":"Máquina para corte com disco abrasivo de diâmetro de 18'' (450 mm), com motor elétrico trifásico de 10 cv."},{"$f":"Equipamentos!D114","v":"un x mês"},{"$f":"Equipamentos!E114","v":36},{"$f":"Equipamentos!F114","v":0},0,{"$error":"#REF!"}]
["10.3.1.38",{"$f":"Equipamentos!B115","v":"40703 - SINAPI/PE"},{"$f":"Equipamentos!C115","v":"Martelete rompedor 33 kg."},{"$f":"Equipamentos!D115","v":"un x mês"},{"$f":"Equipamentos!E115","v":36},{"$f":"Equipamentos!F115","v":0},0,{"$error":"#REF!"}]
["10.3.1.39",{"$f":"Equipamentos!B116","v":"36533 - SINAPI/PE"},{"$f":"Equipamentos!C116","v":"Martelo demolidor pneumático manual, com redução de vibração, peso de 31,5 kg."},{"$f":"Equipamentos!D116","v":"un x mês"},{"$f":"Equipamentos!E116","v":36},{"$f":"Equipamentos!F116","v":0},0,{"$error":"#REF!"}]
["10.3.1.40",{"$f":"Equipamentos!B117","v":"37514 - SINAPI/PE"},{"$f":"Equipamentos!C117","v":"Minicarregadeira sobre rodas, potência líquida de 47 hp, capacidade nominal de operação de 646 kg."},{"$f":"Equipamentos!D117","v":"un x mês"},{"$f":"Equipamentos!E117","v":24},{"$f":"Equipamentos!F117","v":0},0,{"$error":"#REF!"}]
["10.3.1.41",{"$f":"Equipamentos!B118","v":"4090 - SINAPI/PE"},{"$f":"Equipamentos!C118","v":"Motoniveladora com escarificador (potência básica líquida -primeira marcha- 125 hp , peso bruto 13.843 kg, largura da lâmina de 3,7 m)"},{"$f":"Equipamentos!D118","v":"un x mês"},{"$f":"Equipamentos!E118","v":24},{"$f":"Equipamentos!F118","v":0},0,{"$error":"#REF!"}]
["10.3.1.42",{"$f":"Equipamentos!B119","v":"13955 - SINAPI/PE"},{"$f":"Equipamentos!C119","v":"Motoserra portátil com motor a gosolina de 60 cc."},{"$f":"Equipamentos!D119","v":"un x mês"},{"$f":"Equipamentos!E119","v":36},{"$f":"Equipamentos!F119","v":0},0,{"$error":"#REF!"}]
["10.3.1.43",{"$f":"Equipamentos!B120","v":"4778 - SINAPI/PE"},{"$f":"Equipamentos!C120","v":"Perfuratriz pneumática manual de peso médio, 18 kg, comprimento de curso de 6 m, diâmetro do pistão de 5,5 cm"},{"$f":"Equipamentos!D120","v":"un x mês"},{"$f":"Equipamentos!E120","v":12},{"$f":"Equipamentos!F120","v":0},0,{"$error":"#REF!"}]
["10.3.1.44",{"$f":"Equipamentos!B121","v":"E9526-DNIT/PE"},{"$f":"Equipamentos!C121","v":"Retroescavadeira sobre rodas com carregadeira, tração 4x4, potência líquida 72 hp, peso operacional mínimo de 7.140 kg, capacidade mínima da carregadeira de 0,79 m³ e da retroescavadeira mínima de 0,18 m³, profundidade de escavação máxima de 4,50 m."},{"$f":"Equipamentos!D121","v":"un x mês"},{"$f":"Equipamentos!E121","v":72},{"$f":"Equipamentos!F121","v":0},0,{"$error":"#REF!"}]
["10.3.1.45",{"$f":"Equipamentos!B122","v":"10664 - SINAPI/PE"},{"$f":"Equipamentos!C122","v":"Roçadeira deslocável, largura de trabalho de 1,3 m."},{"$f":"Equipamentos!D122","v":"un x mês"},{"$f":"Equipamentos!E122","v":12},{"$f":"Equipamentos!F122","v":0},0,{"$error":"#REF!"}]
["10.3.1.46",{"$f":"Equipamentos!B123","v":"10559 - SINAPI/PE"},{"$f":"Equipamentos!C123","v":"Roçadeira costal com motor a gasolina de  32 cc."},{"$f":"Equipamentos!D123","v":"un x mês"},{"$f":"Equipamentos!E123","v":72},{"$f":"Equipamentos!F123","v":0},0,{"$error":"#REF!"}]
["10.3.1.47",{"$f":"Equipamentos!B124","v":"E9685-DNIT/PE"},{"$f":"Equipamentos!C124","v":"Rolo compactador pé-de-carneiro vibratório, potência 125 hp, peso operacional sem/com lastro 11,95/13,30 t, impacto dinâmico 38,5/22,5 t, largura de trabalho 2,15 m."},{"$f":"Equipamentos!D124","v":"un x mês"},{"$f":"Equipamentos!E124","v":24},{"$f":"Equipamentos!F124","v":0},0,{"$error":"#REF!"}]
["10.3.1.48",{"$f":"Equipamentos!B125","v":"COT_TORR"},{"$f":"Equipamentos!C125","v":"Torre de iluminação 4000 W"},{"$f":"Equipamentos!D125","v":"un x mês"},{"$f":"Equipamentos!E125","v":36},{"$f":"Equipamentos!F125","v":0},0,{"$error":"#REF!"}]
["10.3.1.49",{"$f":"Equipamentos!B126","v":"36511 - SINAPI/PE"},{"$f":"Equipamentos!C126","v":"Trator Agrícola para reboque de máquina roçadeira"},{"$f":"Equipamentos!D126","v":"un x mês"},{"$f":"Equipamentos!E126","v":12},{"$f":"Equipamentos!F126","v":0},0,{"$error":"#REF!"}]
["10.3.1.50",{"$f":"Equipamentos!B127","v":"E9540-DNIT/PE"},{"$f":"Equipamentos!C127","v":"Trator de esteiras, potência de 150 hp, peso operacional de 16,7 t, com roda motriz elevada e lâmina com contato de 3,18 m³."},{"$f":"Equipamentos!D127","v":"un x mês"},{"$f":"Equipamentos!E127","v":12},{"$f":"Equipamentos!F127","v":0},0,{"$error":"#REF!"}]
["10.3.1.51",{"$f":"Equipamentos!B128","v":"39628 - SINAPI/PE"},{"$f":"Equipamentos!C128","v":"Motor a diesel para vibrador de imersão de 4,7 cv."},{"$f":"Equipamentos!D128","v":"un x mês"},{"$f":"Equipamentos!E128","v":12},{"$f":"Equipamentos!F128","v":0},0,{"$error":"#REF!"}]
["10.3.1.52",{"$f":"Equipamentos!B129","v":"39399 - SINAPI/PE"},{"$f":"Equipamentos!C129","v":"Vibrador de imersão, com ponteira de 35 mm, mangote de 5 m, sem motor."},{"$f":"Equipamentos!D129","v":"un x mês"},{"$f":"Equipamentos!E129","v":36},{"$f":"Equipamentos!F129","v":0},0,{"$error":"#REF!"}]
["10.3.1.53",{"$f":"Equipamentos!B130","v":"39400 - SINAPI/PE"},{"$f":"Equipamentos!C130","v":"Vibrador de imersão, com ponteira de 45 mm, mangote de 5 m, sem motor."},{"$f":"Equipamentos!D130","v":"un x mês"},{"$f":"Equipamentos!E130","v":36},{"$f":"Equipamentos!F130","v":0},0,{"$error":"#REF!"}]
["10.3.1.54",{"$f":"Equipamentos!B131","v":"39401 - SINAPI/PE"},{"$f":"Equipamentos!C131","v":"Vibrador de imersão, com ponteira de 60 mm, mangote de 5 m, sem motor."},{"$f":"Equipamentos!D131","v":"un x mês"},{"$f":"Equipamentos!E131","v":36},{"$f":"Equipamentos!F131","v":0},0,{"$error":"#REF!"}]
["10.3.2.",null,{"$f":"Equipamentos!C134","v":"SEGURANÇA DE BARRAGEM"},null,null,null,{"$f":"SUBTOTAL(109,G719:G727)","v":0},{"$error":"#REF!"}]
["10.3.2.1",{"$f":"Equipamentos!B135","v":"E9763-DNIT/PE"},{"$f":"Equipamentos!C135","v":"Grupo Gerador - 32,0 kVA, 220 V, trifásico, silenciado, com 100 metros de cabos e 01 QTA. "},{"$f":"Equipamentos!D135","v":"un x mês"},{"$f":"Equipamentos!E135","v":12},{"$f":"Equipamentos!F135","v":0},0,{"$error":"#REF!"}]
["10.3.2.2",{"$f":"Equipamentos!B136","v":"4090 - SINAPI/PE"},{"$f":"Equipamentos!C136","v":"Motoniveladora com escarificador (potência básica líquida -primeira marcha- 125 hp , peso bruto 13.843 kg, largura da lâmina de 3,7 m)"},{"$f":"Equipamentos!D136","v":"un x mês"},{"$f":"Equipamentos!E136","v":12},{"$f":"Equipamentos!F136","v":0},0,{"$error":"#REF!"}]
["10.3.2.3",{"$f":"Equipamentos!B137","v":"E9017-DNIT/PE"},{"$f":"Equipamentos!C137","v":"Escavadeira hidráulica sobre esteiras, caçamba 0,62 m³, peso operacional 12,61 t, potência líquida 95 hp."},{"$f":"Equipamentos!D137","v":"un x mês"},{"$f":"Equipamentos!E137","v":12},{"$f":"Equipamentos!F137","v":0},0,{"$error":"#REF!"}]
["10.3.2.4",{"$f":"Equipamentos!B138","v":"E9540-DNIT/PE"},{"$f":"Equipamentos!C138","v":"Trator de esteiras, potência de 150 hp, peso operacional de 16,7 t, com roda motriz elevada e lâmina com contato de 3,18 m³."},{"$f":"Equipamentos!D138","v":"un x mês"},{"$f":"Equipamentos!E138","v":12},{"$f":"Equipamentos!F138","v":0},0,{"$error":"#REF!"}]
["10.3.2.5",{"$f":"Equipamentos!B139","v":"E9666-DNIT/PE"},{"$f":"Equipamentos!C139","v":"Cavalo Mecânico com Reboque M. Benz Randon LS-1634/45 29,5 t, ou similar"},{"$f":"Equipamentos!D139","v":"un x mês"},{"$f":"Equipamentos!E139","v":12},{"$f":"Equipamentos!F139","v":0},0,{"$error":"#REF!"}]
["10.3.2.6",{"$f":"Equipamentos!B140","v":"E9685-DNIT/PE"},{"$f":"Equipamentos!C140","v":"Rolo compactador pé-de-carneiro vibratório, potência 125 hp, peso operacional sem/com lastro 11,95/13,30 t, impacto dinâmico 38,5/22,5 t, largura de trabalho 2,15 m."},{"$f":"Equipamentos!D140","v":"un x mês"},{"$f":"Equipamentos!E140","v":12},{"$f":"Equipamentos!F140","v":0},0,{"$error":"#REF!"}]
["10.3.2.7",{"$f":"Equipamentos!B141","v":"E9043-DNIT/PE"},{"$f":"Equipamentos!C141","v":"Barco tipo Alumínio, 7 m de comprimento, Alumínio soldado, reforçado, borda sem corrimão, chapa de Alumínio 2,00 cm, boca 1,50 cm, borda 0,60 cm (inclusive barqueiro)"},{"$f":"Equipamentos!D141","v":"un x mês"},{"$f":"Equipamentos!E141","v":144},{"$f":"Equipamentos!F141","v":0},0,{"$error":"#REF!"}]
["10.3.2.8",{"$f":"Equipamentos!B142","v":"A9382-DNIT/PE"},{"$f":"Equipamentos!C142","v":"Carreta Reboque (para embarcação)"},{"$f":"Equipamentos!D142","v":"un x mês"},{"$f":"Equipamentos!E142","v":144},{"$f":"Equipamentos!F142","v":0},0,{"$error":"#REF!"}]
["10.3.2.9",{"$f":"Equipamentos!B143","v":"COT_MOTO_POP"},{"$f":"Equipamentos!C143","v":"Motor popa, tipo partida manual, potência 15 hp, aplicação barco Alumínio, características adicionais: válvulas automáticas descompressão, refrigerado a ar, quantidade marchas 2 und, quantidade cilíndro 2 und, capacidade tanque 23 l, tipo motor: 2 tempos, velocidade: 4.500 a 5.800 rpm."},{"$f":"Equipamentos!D143","v":"un x mês"},{"$f":"Equipamentos!E143","v":144},{"$f":"Equipamentos!F143","v":0},0,{"$error":"#REF!"}]
[]
["11.",null,{"$f":"Instrumentos!C13","v":"INSTRUMENTOS"},null,null,null,{"$f":"SUBTOTAL(109,G730:G766)","v":0},{"$f":"ROUND(G729/G$8,4)","v":{"$error":"#REF!"}}]
["11.1.",null,{"$f":"Instrumentos!C15","v":"INSTRUMENTOS - MECÂNICA"},null,null,null,{"$f":"SUBTOTAL(109,G731:G743)","v":0},{"$error":"#REF!"}]
["11.1.1",{"$f":"Instrumentos!B16","v":0},{"$f":"Instrumentos!C16","v":"Analisador de vibração VIB 496FFY VIBOTRON"},{"$f":"Instrumentos!D16","v":"un x mês"},{"$f":"Instrumentos!E16","v":12},{"$f":"Instrumentos!F16","v":0},0,{"$error":"#REF!"}]
["11.1.2",{"$f":"Instrumentos!B17","v":0},{"$f":"Instrumentos!C17","v":"Base magnética para relógio comparador"},{"$f":"Instrumentos!D17","v":"un x mês"},{"$f":"Instrumentos!E17","v":48},{"$f":"Instrumentos!F17","v":0},0,{"$error":"#REF!"}]
["11.1.3",{"$f":"Instrumentos!B18","v":0},{"$f":"Instrumentos!C18","v":"Estetoscópio Kent"},{"$f":"Instrumentos!D18","v":"un x mês"},{"$f":"Instrumentos!E18","v":24},{"$f":"Instrumentos!F18","v":0},0,{"$error":"#REF!"}]
["11.1.4",{"$f":"Instrumentos!B19","v":0},{"$f":"Instrumentos!C19","v":"Micrômetro 100 à 200 externo"},{"$f":"Instrumentos!D19","v":"un x mês"},{"$f":"Instrumentos!E19","v":24},{"$f":"Instrumentos!F19","v":0},0,{"$error":"#REF!"}]
["11.1.5",{"$f":"Instrumentos!B20","v":0},{"$f":"Instrumentos!C20","v":"Micrômetro externo 0 – 100mm"},{"$f":"Instrumentos!D20","v":"un x mês"},{"$f":"Instrumentos!E20","v":24},{"$f":"Instrumentos!F20","v":0},0,{"$error":"#REF!"}]
["11.1.6",{"$f":"Instrumentos!B21","v":0},{"$f":"Instrumentos!C21","v":"Micrômetro interno 50 – 800mm"},{"$f":"Instrumentos!D21","v":"un x mês"},{"$f":"Instrumentos!E21","v":24},{"$f":"Instrumentos!F21","v":0},0,{"$error":"#REF!"}]
["11.1.7",{"$f":"Instrumentos!B22","v":0},{"$f":"Instrumentos!C22","v":"Nível ótico (Topcon AT-B2) ou similar"},{"$f":"Instrumentos!D22","v":"un x mês"},{"$f":"Instrumentos!E22","v":12},{"$f":"Instrumentos!F22","v":0},0,{"$error":"#REF!"}]
["11.1.8",{"$f":"Instrumentos!B23","v":0},{"$f":"Instrumentos!C23","v":"Paquímetro digital 0 – 150mm/0,01mm"},{"$f":"Instrumentos!D23","v":"un x mês"},{"$f":"Instrumentos!E23","v":24},{"$f":"Instrumentos!F23","v":0},{"$f":"ROUND(E738*F738,2)","v":0},{"$error":"#REF!"}]
["11.1.9",{"$f":"Instrumentos!B24","v":0},{"$f":"Instrumentos!C24","v":"Paquímetro universal 0 - 650mm/0,02mm"},{"$f":"Instrumentos!D24","v":"un x mês"},{"$f":"Instrumentos!E24","v":24},{"$f":"Instrumentos!F24","v":0},0,{"$error":"#REF!"}]
["11.1.10",{"$f":"Instrumentos!B25","v":0},{"$f":"Instrumentos!C25","v":"Relógio comparador 0 – 10/0,01mm digital"},{"$f":"Instrumentos!D25","v":"un x mês"},{"$f":"Instrumentos!E25","v":48},{"$f":"Instrumentos!F25","v":0},0,{"$error":"#REF!"}]
["11.1.11",{"$f":"Instrumentos!B26","v":0},{"$f":"Instrumentos!C26","v":"Tacômetro digital 0,1 - 1,0 RPM DT - 2234 A"},{"$f":"Instrumentos!D26","v":"un x mês"},{"$f":"Instrumentos!E26","v":12},{"$f":"Instrumentos!F26","v":0},0,{"$error":"#REF!"}]
["11.1.12",{"$f":"Instrumentos!B27","v":0},{"$f":"Instrumentos!C27","v":"Termômetro mira laser escala de -20 a 500ºC"},{"$f":"Instrumentos!D27","v":"un x mês"},{"$f":"Instrumentos!E27","v":12},{"$f":"Instrumentos!F27","v":0},0,{"$error":"#REF!"}]
["11.1.13",{"$f":"Instrumentos!B28","v":0},{"$f":"Instrumentos!C28","v":"Termovisor, com resolução Infravermelha de 120 x 90, Sensibilidade Térmica menor que 0,10 ºC, frequência da imagem de 9 Hz e faixa de temperatura –20 a 250 °C. "},{"$f":"Instrumentos!D28","v":"un x mês"},{"$f":"Instrumentos!E28","v":12},{"$f":"Instrumentos!F28","v":0},0,{"$error":"#REF!"}]
["11.2.",null,{"$f":"Instrumentos!C31","v":"INSTRUMENTOS - ELÉTRICA"},null,null,null,{"$f":"SUBTOTAL(109,G745:G762)","v":0},{"$error":"#REF!"}]
["11.2.1",{"$f":"Instrumentos!B32","v":0},{"$f":"Instrumentos!C32","v":"Alicate Amperímetro (mod. 381 CA/CC True-rms 1000V CAT III (ou similar)"},{"$f":"Instrumentos!D32","v":"un x mês"},{"$f":"Instrumentos!E32","v":156},{"$f":"Instrumentos!F32","v":0},0,{"$error":"#REF!"}]
["11.2.2",{"$f":"Instrumentos!B33","v":0},{"$f":"Instrumentos!C33","v":"Alicate amperímetro CA/CC de 600V, digital, CAT III FLUKE 305"},{"$f":"Instrumentos!D33","v":"un x mês"},{"$f":"Instrumentos!E33","v":120},{"$f":"Instrumentos!F33","v":0},0,{"$error":"#REF!"}]
["11.2.3",{"$f":"Instrumentos!B34","v":0},{"$f":"Instrumentos!C34","v":"Alicate Medidor de qualidade de energia (mod. Fluke 345 ou  similar) "},{"$f":"Instrumentos!D34","v":"un x mês"},{"$f":"Instrumentos!E34","v":24},{"$f":"Instrumentos!F34","v":0},0,{"$error":"#REF!"}]
["11.2.4",{"$f":"Instrumentos!B35","v":0},{"$f":"Instrumentos!C35","v":"Calibrador de processos multifunção digital (mod. Fluke 725 ou  similar) "},{"$f":"Instrumentos!D35","v":"un x mês"},{"$f":"Instrumentos!E35","v":24},{"$f":"Instrumentos!F35","v":0},0,{"$error":"#REF!"}]
["11.2.5",{"$f":"Instrumentos!B36","v":0},{"$f":"Instrumentos!C36","v":"Fasímetro, digital, categoria IV, 40~700Vca, 600V "},{"$f":"Instrumentos!D36","v":"un x mês"},{"$f":"Instrumentos!E36","v":120},{"$f":"Instrumentos!F36","v":0},0,{"$error":"#REF!"}]
["11.2.6",{"$f":"Instrumentos!B37","v":0},{"$f":"Instrumentos!C37","v":"Freqüencímetro gitital de bancada , 1GHz de 8 dígitos "},{"$f":"Instrumentos!D37","v":"un x mês"},{"$f":"Instrumentos!E37","v":12},{"$f":"Instrumentos!F37","v":0},0,{"$error":"#REF!"}]
["11.2.7",{"$f":"Instrumentos!B38","v":0},{"$f":"Instrumentos!C38","v":"Medidor de distância, laser, amplitude de medição 1mm a 80m "},{"$f":"Instrumentos!D38","v":"un x mês"},{"$f":"Instrumentos!E38","v":12},{"$f":"Instrumentos!F38","v":0},0,{"$error":"#REF!"}]
["11.2.8",{"$f":"Instrumentos!B39","v":0},{"$f":"Instrumentos!C39","v":"Medidor de resistência de aterramento e resistividade do solo (Faixa de medição de 0,02Ω a 300KΩ; Alcance de até 2 K Ω) com 02 pinças "},{"$f":"Instrumentos!D39","v":"un x mês"},{"$f":"Instrumentos!E39","v":12},{"$f":"Instrumentos!F39","v":0},0,{"$error":"#REF!"}]
["11.2.9",{"$f":"Instrumentos!B40","v":0},{"$f":"Instrumentos!C40","v":"Medidor de vazão portátil tipo Clamp-on "},{"$f":"Instrumentos!D40","v":"un x mês"},{"$f":"Instrumentos!E40","v":12},{"$f":"Instrumentos!F40","v":0},0,{"$error":"#REF!"}]
["11.2.10",{"$f":"Instrumentos!B41","v":0},{"$f":"Instrumentos!C41","v":"Megôhmetro digital de 5 kV, alcance de até 1 TΩ, Interface USB, IP54 "},{"$f":"Instrumentos!D41","v":"un x mês"},{"$f":"Instrumentos!E41","v":24},{"$f":"Instrumentos!F41","v":0},{"$f":"ROUND(E754*F754,2)","v":0},{"$error":"#REF!"}]
["11.2.11",{"$f":"Instrumentos!B42","v":0},{"$f":"Instrumentos!C42","v":"Multímetro digital, tensão DC/AC 50,000 mV a 1000V, 0,4% (True/RMS), frequencia 99,999Hz a 999,99KHz  \"FLUKE-87-V\" com pontas prova TWIST GUARD"},{"$f":"Instrumentos!D42","v":"un x mês"},{"$f":"Instrumentos!E42","v":156},{"$f":"Instrumentos!F42","v":0},0,{"$error":"#REF!"}]
["11.2.12",{"$f":"Instrumentos!B43","v":0},{"$f":"Instrumentos!C43","v":"Multímetro digital para teste de equipotencialização (medições de baixas resistências), 100V, 10A, 0,1 Ω a 50 Ω "},{"$f":"Instrumentos!D43","v":"un x mês"},{"$f":"Instrumentos!E43","v":156},{"$f":"Instrumentos!F43","v":0},0,{"$error":"#REF!"}]
["11.2.13",{"$f":"Instrumentos!B44","v":0},{"$f":"Instrumentos!C44","v":"Osciloscópio portátil com frequência de trabalho de 100Mhz, LCD Colorido 7”,  CAT II 600V "},{"$f":"Instrumentos!D44","v":"un x mês"},{"$f":"Instrumentos!E44","v":12},{"$f":"Instrumentos!F44","v":0},0,{"$error":"#REF!"}]
["11.2.14",{"$f":"Instrumentos!B45","v":0},{"$f":"Instrumentos!C45","v":"Power Meter (Medidor Potência Fibra Óptica) potência 1310 nm, 1490 nm e 1550 nm  + Caneta Laser 10w "},{"$f":"Instrumentos!D45","v":"un x mês"},{"$f":"Instrumentos!E45","v":24},{"$f":"Instrumentos!F45","v":0},0,{"$error":"#REF!"}]
["11.2.15",{"$f":"Instrumentos!B46","v":0},{"$f":"Instrumentos!C46","v":"Termômetro mira laser escala de -30ºC a 500ºc "},{"$f":"Instrumentos!D46","v":"un x mês"},{"$f":"Instrumentos!E46","v":156},{"$f":"Instrumentos!F46","v":0},0,{"$error":"#REF!"}]
["11.2.16",{"$f":"Instrumentos!B47","v":0},{"$f":"Instrumentos!C47","v":"Termovisor -20ºC a 350ºC, com camera de 5 megapixels, visor LCD de 3,5 polegadas "},{"$f":"Instrumentos!D47","v":"un x mês"},{"$f":"Instrumentos!E47","v":12},{"$f":"Instrumentos!F47","v":0},0,{"$error":"#REF!"}]
["11.2.17",{"$f":"Instrumentos!B48","v":0},{"$f":"Instrumentos!C48","v":"Testador de cabos RJ45 / 11, frequencia 200kHz, display LCD 3 ½ digitos, 600V "},{"$f":"Instrumentos!D48","v":"un x mês"},{"$f":"Instrumentos!E48","v":24},{"$f":"Instrumentos!F48","v":0},0,{"$error":"#REF!"}]
["11.2.18",{"$f":"Instrumentos!B49","v":0},{"$f":"Instrumentos!C49","v":"Verificador elétrico de tensão 1000V, sem contato com cabo (mod. T6-1000 Fluke ou similar) "},{"$f":"Instrumentos!D49","v":"un x mês"},{"$f":"Instrumentos!E49","v":156},{"$f":"Instrumentos!F49","v":0},0,{"$error":"#REF!"}]
["11.3.",null,{"$f":"Instrumentos!C52","v":"INSTRUMENTOS - CIVIL"},null,null,null,{"$f":"SUBTOTAL(109,G764:G766)","v":0},{"$error":"#REF!"}]
["11.3.1",{"$f":"Instrumentos!B53","v":0},{"$f":"Instrumentos!C53","v":"GPS Geodésico portátil com visor 65K de cores legível sob luz solar, à prova d'água, geocaching informatizado e recurso de mapeamento ampliados."},{"$f":"Instrumentos!D53","v":"un x mês"},{"$f":"Instrumentos!E53","v":108},{"$f":"Instrumentos!F53","v":0},0,{"$error":"#REF!"}]
["11.3.2",{"$f":"Instrumentos!B54","v":0},{"$f":"Instrumentos!C54","v":"Estação Total com leitura direta de 1 segundo e precisão de 2\". Prumo óptico na alidade. Interface com principais softwares do mercado, à prova d'água e poeira conforme norma internacional: IEC529. Com kit completo, inclusive tripé com pernas extensíveis."},{"$f":"Instrumentos!D54","v":"un x mês"},{"$f":"Instrumentos!E54","v":12},{"$f":"Instrumentos!F54","v":0},0,{"$error":"#REF!"}]
["11.3.3",{"$f":"Instrumentos!B55","v":0},{"$f":"Instrumentos!C55","v":"Nível automático com precisão de ± 1,0 mm/km duplo de nivelamento, aumento de imagem 32 vezes, limbo horizontal com escala de 1º, abertura da objetiva 45 mm, foco mínimo 1,60 m. Com tripé e mira."},{"$f":"Instrumentos!D55","v":"un x mês"},{"$f":"Instrumentos!E55","v":12},{"$f":"Instrumentos!F55","v":0},0,{"$error":"#REF!"}]
[]
["12.",null,{"$f":"Radios_Comunicadores!C13","v":"SISTEMA DE RÁDIO COMUNICAÇÃO"},null,null,null,{"$f":"SUBTOTAL(109,G769:G773)","v":{"$error":"#REF!"}},{"$f":"ROUND(G768/G$8,4)","v":{"$error":"#REF!"}}]
["12.1",{"$f":"Radios_Comunicadores!B14","v":0},{"$f":"Radios_Comunicadores!C14","v":"Sistema de repetidoras VHF interligadas com link UHF - 4 antenas"},{"$f":"Radios_Comunicadores!D14","v":"un x mês"},{"$f":"Radios_Comunicadores!E14","v":12},{"$f":"Radios_Comunicadores!F14","v":0},0,{"$error":"#REF!"}]
["12.2",{"$f":"Radios_Comunicadores!B15","v":0},{"$f":"Radios_Comunicadores!C15","v":"Rádio VHF portátil EP 450 (Reservatórios)"},{"$f":"Radios_Comunicadores!D15","v":"un x mês"},{"$f":"Radios_Comunicadores!E15","v":156},{"$f":"Radios_Comunicadores!F15","v":0},0,{"$error":"#REF!"}]
["12.3",{"$f":"Radios_Comunicadores!B16","v":0},{"$f":"Radios_Comunicadores!C16","v":"Rádio VHF móvel digital para viatura"},{"$f":"Radios_Comunicadores!D16","v":"un x mês"},{"$f":"Radios_Comunicadores!E16","v":{"$error":"#REF!"}},{"$f":"Radios_Comunicadores!F16","v":0},{"$error":"#REF!"},{"$error":"#REF!"}]
["12.4",{"$f":"Radios_Comunicadores!B17","v":0},{"$f":"Radios_Comunicadores!C17","v":"Rádio VHF para instalação nas EB's, SE´s e Canteiros, composto por rádio base e sistema irradiante"},{"$f":"Radios_Comunicadores!D17","v":"un x mês"},{"$f":"Radios_Comunicadores!E17","v":180},{"$f":"Radios_Comunicadores!F17","v":0},0,{"$error":"#REF!"}]
["12.5",{"$f":"Radios_Comunicadores!B18","v":0},{"$f":"Radios_Comunicadores!C18","v":"Serviço de instalação e configuração de sistema de repetidoras e infraestrutura"},{"$f":"Radios_Comunicadores!D18","v":"un x mês"},{"$f":"Radios_Comunicadores!E18","v":1},{"$f":"Radios_Comunicadores!F18","v":0},0,{"$error":"#REF!"}]
[]
["13.",null,"SERVIÇOS E FORNECIMENTOS REEMBOLSÁVEIS",null,null,null,{"$f":"SUBTOTAL(109,G776)","v":{"$error":"#REF!"}},{"$f":"ROUND(G775/G$8,4)","v":{"$error":"#REF!"}}]
["13.1",null,{"$f":"\"Despesas previamente reembolsáveis (aquisição de componentes e peças de reposição e contratação de serviços especializados não contemplados na planilha orçamentária), previamente autorizadas pela FISCALIZAÇÃO (Demanda - \"&TEXT(E776,\"#0,00%\")&\" do valor do CONTRATO)\"","v":"Despesas previamente reembolsáveis (aquisição de componentes e peças de reposição e contratação de serviços especializados não contemplados na planilha orçamentária), previamente autorizadas pela FISCALIZAÇÃO (Demanda - 0,50% do valor do CONTRATO)"},"%",5.0000000000000001E-3,{"$f":"G8","v":{"$error":"#REF!"}},{"$f":"ROUND(E776*F776,2)","v":{"$error":"#REF!"}},{"$f":"ROUND(G776/G$8,4)","v":{"$error":"#REF!"}}]
[]
["14.",null,"CUSTOS INDIRETOS",null,null,null,{"$f":"SUBTOTAL(109,G779:G781)","v":{"$error":"#REF!"}},{"$f":"ROUND(G778/G$8,4)","v":{"$error":"#REF!"}}]
["14.1",null,{"$f":"\"Custo de Administração (Taxa de \"&TEXT(E779,\"#0,00%\")&\" da mão de obra)\"","v":"Custo de Administração (Taxa de 10,00% da mão de obra)"},"%",{"$f":"ROUND('Custos Administração'!C22,2)","v":0.1},{"$f":"SUMIF(C11:C774,Mao_de_Obra!C$13,G11:G774)","v":0},0,{"$error":"#REF!"}]
["14.2",null,{"$f":"\"Remuneração de Escritório (Taxa de \"&TEXT(E780,\"#0,00%\")&\" dos custos diretos)\"","v":"Remuneração de Escritório (Taxa de 3,00% dos custos diretos)"},"%",0.03,{"$f":"SUBTOTAL(109,G12:G777)","v":{"$error":"#REF!"}},{"$f":"ROUND(E780*F780,2)","v":{"$error":"#REF!"}},{"$f":"ROUND(G780/G$8,4)","v":{"$error":"#REF!"}}]
["14.3",null,{"$f":"\"Despesas Fiscais (\"&TEXT(E781,\"#0,00%\")&\" dos Custos Diretos + Custo de Administração + Remuneração de Escritório)\"","v":"Despesas Fiscais (16,61% dos Custos Diretos + Custo de Administração + Remuneração de Escritório)"},"%",{"$f":"'Despesas Fiscais'!C22","v":0.1661},{"$f":"SUBTOTAL(109,G12:G780)","v":{"$error":"#REF!"}},{"$f":"ROUND(E781*F781,2)","v":{"$error":"#REF!"}},{"$f":"ROUND(G781/G$8,4)","v":{"$error":"#REF!"}}]
[]
[]
["NOME DO INFORMANTE:",{"$nulls":5},"QUALIFICAÇÃO:"]
[]
["ASSINATURA:",{"$nulls":5},"DATA:"]
[]
["OBSERVAÇÃO:"]

{"sheet":"Mobilizacao_Desmobilizacao","index":2,"n_rows":44,"n_cols":7,"rows_kept":44,"cut":false,"hidden":false,"merged":[[29,0,29,6],[20,2,20,6],[24,0,24,5],[42,0,42,6],[36,0,37,2],[36,5,37,6],[31,2,31,4],[38,0,39,2],[38,5,39,6],[40,0,40,6],[32,2,32,4],[33,0,33,4],[26,0,26,5],[30,2,30,4],[18,0,18,5],[14,2,14,6],[0,2,0,6],[1,2,1,6],[2,2,2,6],[4,0,5,6],[7,0,7,6],[10,0,11,0],[10,2,11,2],[10,3,11,3],[10,4,11,4],[10,5,10,6],[12,2,12,6],[10,1,11,1],[46,0,46,6],[30,5,30,6],[31,5,31,6],[32,5,32,6],[33,5,33,6],[45,0,45,6],[41,0,41,6],[43,0,43,6],[44,0,44,6]]}
[null,null,"Ministério do Desenvolvimento Regional  - MDR"]
[null,null,"Companhia de Desenvolvimento dos Vales do São Francisco e do Parnaíba"]
[null,null,"Gerência de Operação do PISF - Centro de Controle e Operação (AD / GOI / CCO)"]
[]
["SERVIÇOS DE OPERAÇÃO E MANUTENÇÃO DAS INFRAESTRUTURAS DO EIXO LESTE DO PROJETO DE INTEGRAÇÃO DO RIO SÃO FRANCISCO COM AS BACIAS HIDROGRÁFICAS DO NORDESTE SETENTRIONAL – PISF"]
[]
[]
["MOBILIZAÇÃO E DESMOBILIZAÇAO"]
[]
[]
["ITEM","CÓDIGO","DESCRIÇÃO","UNIDADE","QUANTIDADE","VALOR (R$)"]
[{"$nulls":5},"UNITARIO","TOTAL"]
[null,null,{"$f":"A8","v":"MOBILIZAÇÃO E DESMOBILIZAÇAO"}]
[]
["1.",null,"MOBILIZAÇÃO (Máquinas, Equipamentos, Ferramentas, Instrumentos, Materiais, Mobiliário)"]
["1.1",null,"Mobilização da Equipe - Canteiro Lote 09 (Floresta/PE)","un",1,{"$f":"CPU_MOBILIZACAO!I64","v":0},{"$f":"ROUND(E16*F16,2)","v":0}]
["1.2",null,"Mobilização da Equipe - Canteiro Lote 10 (Custódia/PE)","un",1,{"$f":"CPU_MOBILIZACAO!I112","v":0},{"$f":"ROUND(E17*F17,2)","v":0}]
["1.3",null,"Mobilização da Equipe - Canteiro Lote 12 (Sertânia/PE)","un",1,{"$f":"CPU_MOBILIZACAO!I164","v":0},0]
["TOTAL - MOBILIZAÇÃO DA EQUIPE (R$):",{"$nulls":5},{"$f":"SUBTOTAL(9,G16:G18)","v":0}]
[]
["2.",null,"DESMOBILIZAÇÃO (Máquinas, Equip., Ferramentas, Instrumentos, Materiais, Mobiliário)"]
["2.1",null,"Desmobilização da Equipe - Canteiro Lote 09 (Floresta/PE)","un",1,{"$f":"CPU_DESMOBILIZAZAO!I64","v":0},{"$f":"ROUND(E22*F22,2)","v":0}]
["2.2",null,"Desmobilização da Equipe - Canteiro Lote 10 (Custódia/PE)","un",1,{"$f":"CPU_DESMOBILIZAZAO!I112","v":0},{"$f":"ROUND(E23*F23,2)","v":0}]
["2.3",null,"Desmobilização da Equipe - Canteiro Lote 12 (Sertânia/PE)","un",1,{"$f":"CPU_DESMOBILIZAZAO!I164","v":0},0]
["TOTAL - DESMOBILIZAÇÃO DA EQUIPE (R$):",{"$nulls":5},{"$f":"SUBTOTAL(9,G22:G24)","v":0}]
[]
[{"$f":"\"TOTAL - \"&C13&\" - (R$):\"","v":"TOTAL - MOBILIZAÇÃO E DESMOBILIZAÇAO - (R$):"},{"$nulls":5},{"$f":"SUBTOTAL(9,G15:G26)","v":0}]
[]
[]
[{"$f":"\"RESUMO - \"&A$8","v":"RESUMO - MOBILIZAÇÃO E DESMOBILIZAÇAO"}]
["ITEM",null,"DESCRIÇÃO",null,null,"VALOR TOTAL (R$)"]
["01",null,{"$f":"C15","v":"MOBILIZAÇÃO (Máquinas, Equipamentos, Ferramentas, Instrumentos, Materiais, Mobiliário)"},null,null,{"$f":"G19","v":0}]
["02",null,{"$f":"C21","v":"DESMOBILIZAÇÃO (Máquinas, Equip., Ferramentas, Instrumentos, Materiais, Mobiliário)"},null,null,{"$f":"G25","v":0}]
[{"$f":"\"TOTAL GERAL - \"&A$8&\" - (R$):\"","v":"TOTAL GERAL - MOBILIZAÇÃO E DESMOBILIZAÇAO - (R$):"},{"$nulls":4},{"$f":"SUM(F32:G33)","v":0}]
[]
[]
["NOME DO INFORMANTE:",{"$nulls":4},"QUALIFICAÇÃO:"]
[]
["ASSINATURA:",{"$nulls":4},"DATA:"]
[]
["OBSERVAÇÃO:"]
["1. Considerou-se na Mobilizaçao: Transporte dos materiais e equipamentos / Instalação de Pessoal, entre outras despesas."]
["2. Considerou-se na Desmobilização: Retirada de máquinas e equipamentos / Demolições e/ou Recuperação de Canteiro, entre outras despesas."]
["3. Mobilização e Desmobilização do Quadro de Pessoal: Será realizada  com os veículos previstos no contrato."]

{"sheet":"CPU_MOBILIZACAO","index":3,"n_rows":189,"n_cols":9,"rows_kept":189,"cut":false,"hidden":false,"merged":[[169,7,169,8],[166,0,166,6],[167,0,167,6],[168,0,168,6],[169,0,169,6],[170,0,170,8],[161,3,161,7],[176,0,176,8],[147,0,147,7],[149,0,149,8],[153,0,153,7],[155,0,155,8],[159,0,159,7],[163,0,163,7],[175,0,175,8],[174,0,174,8],[172,0,172,8],[161,0,161,1],[166,7,166,8],[167,7,167,8],[168,7,168,8],[142,0,142,8],[111,0,111,7],[114,0,114,8],[115,0,115,8],[117,0,117,2],[119,0,119,8],[140,0,140,7],[117,4,117,7],[109,3,109,7],[67,0,67,8],[69,0,69,2],[71,0,71,8],[88,0,88,7],[90,0,90,8],[95,0,95,7],[97,0,97,8],[101,0,101,7],[103,0,103,8],[107,0,107,7],[69,4,69,7],[109,0,109,1],[53,0,53,7],[55,0,55,8],[59,0,59,7],[61,3,61,7],[63,0,63,7],[61,0,61,1],[171,0,171,8],[173,0,173,8],[4,0,5,8],[0,0,0,8],[1,0,1,8],[2,0,2,8],[9,0,9,8],[8,0,8,8],[11,0,11,2],[13,0,13,8],[40,0,40,7],[42,0,42,8],[11,4,11,7],[66,0,66,8],[47,0,47,7],[49,0,49,8]]}
["Ministério do Desenvolvimento Regional -MDR"]
["Companhia de Desenvolvimento dos Vales do São Francisco e do Parnaíba"]
["Gerência de Operação do PISF-Centro de Controle e Operação (AD / GOI / CCO)"]
[]
["SERVIÇOS DE OPERAÇÃO E MANUTENÇÃO DAS INFRAESTRUTURAS DO EIXO LESTE DO PROJETO DE INTEGRAÇÃO DO RIO SÃO FRANCISCO COM AS BACIAS HIDROGRÁFICAS DO NORDESTE SETENTRIONAL – PISF"]
[]
[]
[]
["COMPOSIÇÃO DE PREÇO UNITÁRIO-MOBILIZAÇÃO"]
["Local / Canteiros: EIXO LESTE-Canteiro Lote 9 (Floresta/PE)"]
[]
["Distância entre Recife/PE-Canteiro Lote 9 (km):",null,null,{"$f":"Canteiros!$H$13","v":472},"Veloc. Média (km/h):",null,null,null,60]
[]
["EQUIPAMENTO"]
["CÓDIGO","DESCRIÇÃO","MEIO DE\nLOCOMOÇÃO","QUANTIDADE","FU","K","DMT\n(km)","CHP\n(R$)","CUSTO TOTAL\n(R$)"]
["E9592-DNIT/PE","Caminhão Carroceria-de madeira, capacidade de carga 15,0 t","Rodando",2,1,1,{"$f":"$D$12","v":472},null,{"$f":"ROUND(D16*(((G16*F16*E16)/$I$12)*H16),2)","v":0}]
["E9579-DNIT/PE","Caminhão basculante, capacidade de carga  15,0 t e volume 10,0 m³","Rodando",1,1,1,{"$f":"$D$12","v":472},null,0]
["E9506-DNIT/PE","Caminhao basculante, capacidade de carga  9,0 t e volume 6,0 m³","Rodando",1,1,1,472,null,0]
["E9592-DNIT/PE","Caminhão Carroceria-de madeira, capacidade de carga 15,0 t","Rodando",1,1,1,472,null,0]
["E9509-DNIT/PE","Caminhão Comboio para lubrificação e abastecimento (melosa), convencional totalmente equipado (Capacidade de Combustível: 5.000 l, Capacidade de Lubrificante: 500 l, Capacidade de Graxa: 200 kg, Capacidade de Água: 300 l, Recipiente para Óleo Usado: 200 l, Compressor de Ar e Bomba- d’agua)","Rodando",1,1,1,472,null,0]
["E9686-DNIT/PE","Caminhão guindauto com capacidade de carga até 10,0 t","Rodando",1,1,1,472,null,0]
["E9605-DNIT/PE","Caminhão tanque, capacidade de volume  6000 l e potência 136,0 hp","Rodando",1,1,1,472,null,0]
["A9353-DNIT/PE","Carreta Reboque (para embarcação)","Rodando",4,1,1,472,null,0]
["E9666-DNIT/PE","Pá carregadeira sobre rodas, potência líquida 128 hp, capacidade da caçamba de 1,7 a 2,8 m³, peso operacional de 11.632 kg","Carreta",1,1,2,472,null,0]
["E9666-DNIT/PE","Empilhadeira sobre pneus com torre de três estágios, 4,80 m de elevação, com deslocador lateral dos garfos, motor glp 2.4 l, capacidade nominal de carga de 2,5 t.","Carreta",1,1,2,472,null,0]
["E9666-DNIT/PE","Escavadeira hidráulica sobre esteiras, caçamba 0,62 m³, peso operacional 12,61 t, potência líquida 95 hp.","Carreta",1,1,2,472,null,0]
["E9666-DNIT/PE","Escavadeira hidráulica sobre esteiras, caçamba  0,80 m³, peso operacional 17 t, potência bruta 111 hp.","Carreta",1,1,2,472,null,0]
["E9686-DNIT/PE","Grupo gerador de 4 KVA, 220v, trifásico, silenciado, com 100 metros de cabos e 01 QTA","Guindauto",1,1,2,472,null,0]
["E9686-DNIT/PE","Grupo gerador de 10 KVA, 220v, trifásico, silenciado, com 100 metros de cabos e 01 QTA","Guindauto",1,1,2,472,null,0]
["E9686-DNIT/PE","Grupo gerador, potência nominal 15 kVA (emergência), incluindo instalação, cabeamento, base de concreto e demais materiais necessários","Guindauto",1,1,2,472,null,0]
["E9686-DNIT/PE","Grupo gerador de 15 kVA, 220V, trifásico, silenciado, com 100 metros de cabos e 01 QTA","Guindauto",1,1,2,472,null,0]
["E9666-DNIT/PE","Motoniveladora com escarificador (potência básica líquida -primeira marcha- 125 hp , peso bruto 13.843 kg, largura da lâmina de 3,7 m)","Carreta",1,1,2,472,null,0]
["E9666-DNIT/PE","Grupo Gerador-32,0 kVA, 220 V, trifásico, silenciado, com 100 metros de cabos e 01 QTA. ","Carreta",1,1,2,472,null,0]
["E9666-DNIT/PE","Motoniveladora com escarificador (potência básica líquida -primeira marcha- 125 hp , peso bruto 13.843 kg, largura da lâmina de 3,7 m)","Carreta",1,1,2,472,null,0]
["E9666-DNIT/PE","Escavadeira hidráulica sobre esteiras, caçamba 0,62 m³, peso operacional 12,61 t, potência líquida 95 hp.","Carreta",1,1,2,472,null,0]
["E9666-DNIT/PE","Trator de esteiras, potência de 150 hp, peso operacional de 16,7t, com roda motriz elevada e lâmina com contato de 3,18 m³.","Carreta",1,1,2,472,null,0]
["E9666-DNIT/PE","Cavalo Mecânico com Reboque M. Benz Randon LS-1634/45 29,5 t, ou similar","Carreta",1,1,2,472,null,0]
["E9666-DNIT/PE","Rolo compactador pé-de-carneiro vibratório, potência 125 hp, peso operacional sem/com lastro 11,95/13,30 t, impacto dinâmico 38,5/22,5 t, largura de trabalho 2,15 m.","Carreta",1,1,2,472,null,0]
["A9353-DNIT/PE","Barco tipo Alumínio, 7 m de comprimento, Alumínio soldado, reforçado, borda sem corrimão, chapa de Alumínio 2,00 cm, boca 1,50 cm, borda 0,60 cm. / Motor popa, tipo partida manual, potência 15 hp, aplicação barco Alumínio, características adicionais: válvulas automáticas descompressão, refrigerado a ar, quantidade marchas 2 und, quantidade cilíndro 2 und, capacidade tanque 23 l, tipo motor: 2 tempos, velocidade: 4.500 a 5.800 rpm.","Rodando",4,1,1,472,null,0]
[]
["SUB-TOTAL (R$):",{"$nulls":7},{"$f":"SUM(I16:I39)","v":0}]
[]
["MATERIAL"]
["CÓDIGO","DESCRIÇÃO","UNIDADE","QUANTIDADE",null,null,null,"CUSTO UNIT.\n(R$)","CUSTO TOTAL\n(R$)"]
["SINDUSCON/PE","Alimentação (motorista que vai rodando)","und",{"$f":"SUMIF(C16:C39,\"RODANDO\",D16:D39)","v":16},{"$nulls":4},{"$f":"ROUND(D45*H45,2)","v":0}]
["SINDUSCON/PE","Alimentação (motorista que retorna)","und",{"$f":"SUMIF(C16:C39,\"CARRETA\",D16:D39)+SUMIF(C16:C39,\"REBOQUE\",D16:D39)+SUMIF(C16:C39,\"GUINDAUTO\",D16:D39)","v":15},{"$nulls":4},{"$f":"ROUND(D46*H46,2)","v":0}]
[]
["SUB-TOTAL (R$):",{"$nulls":7},{"$f":"SUM(I45:I47)","v":0}]
[]
["SERVIÇOS-COMPOSIÇÕES AUXILIARES"]
["CÓDIGO","DESCRIÇÃO","UNIDADE","QUANTIDADE",null,null,null,"CUSTO UNIT.\n(R$)","CUSTO TOTAL\n(R$)"]
[]
[]
["SUB-TOTAL (R$):",{"$nulls":7},{"$f":"SUM(I52:I53)","v":0}]
[]
["MÃO DE OBRA"]
["CÓDIGO","DESCRIÇÃO","UNIDADE","QUANTIDADE",null,null,null,"CUSTO UNIT.\n(R$)","CUSTO TOTAL\n(R$)"]
[]
[]
["SUB-TOTAL (R$):",{"$nulls":7},{"$f":"SUM(I58:I59)","v":0}]
[]
["PRODUÇÃO DA EQUIPE:",null,1,"CUSTO (R$):",{"$nulls":4},{"$f":"I41+I48+I54+I60","v":0}]
[]
[{"$f":"\"TOTAL-\"&A9&\"-(R$):\"","v":"TOTAL-COMPOSIÇÃO DE PREÇO UNITÁRIO-MOBILIZAÇÃO-(R$):"},{"$nulls":7},{"$f":"ROUND(C62*I62,2)","v":0}]
[]
[]
["COMPOSIÇÃO DE PREÇO UNITÁRIO-MOBILIZAÇÃO"]
["Local / Canteiros: EIXO LESTE-Canteiro Lote 10 (Custódia/PE)"]
[]
["Distância entre Recife/PE-Canteiro Lote 10 (km):",null,null,{"$f":"Canteiros!$H$17","v":368},"Veloc. Média (km/h):",null,null,null,{"$f":"I$12","v":60}]
[]
["EQUIPAMENTO"]
["CÓDIGO","DESCRIÇÃO","MEIO DE\nLOCOMOÇÃO","QUANTIDADE","FU","K","DMT\n(km)","CHP\n(R$)","CUSTO TOTAL\n(R$)"]
["E9592-DNIT/PE","Caminhão Carroceria-de madeira, capacidade de carga 15,0 t","Rodando",2,1,1,{"$f":"$D$70","v":368},null,{"$f":"ROUND(D74*(((G74*F74*E74)/$I$12)*H74),2)","v":0}]
["E9579-DNIT/PE","Caminhão basculante, capacidade de carga  15,0 t e volume 10,0 m³","Rodando",1,1,1,{"$f":"$D$70","v":368},null,0]
["E9506-DNIT/PE","Caminhao basculante, capacidade de carga  9,0 t e volume 6,0 m³","Rodando",1,1,1,{"$f":"$D$70","v":368},null,0]
["E9592-DNIT/PE","Caminhão Carroceria-de madeira, capacidade de carga 15,0 t","Rodando",1,1,1,368,null,0]
["E9686-DNIT/PE","Caminhão guindauto com capacidade de carga até 10,0 t","Rodando",1,1,1,368,null,0]
["E9605-DNIT/PE","Caminhão tanque, capacidade de volume  6000 l e potência 136,0 hp","Rodando",1,1,1,368,null,0]
["A9353-DNIT/PE","Carreta Reboque (para embarcação)","Rodando",4,1,1,368,null,0]
["E9666-DNIT/PE","Pá carregadeira sobre rodas, potência líquida 128 hp, capacidade da caçamba de 1,7 a 2,8 m³, peso operacional de 11.632 kg","Carreta",1,1,2,368,null,0]
["E9686-DNIT/PE","Grupo gerador de 4 KVA, 220v, trifásico, silenciado, com 100 metros de cabos e 01 QTA","Guindauto",1,1,2,368,null,0]
["E9686-DNIT/PE","Grupo gerador de 10 KVA, 220v, trifásico, silenciado, com 100 metros de cabos e 01 QTA","Guindauto",1,1,2,368,null,0]
["E9686-DNIT/PE","Grupo gerador, potência nominal 15 kVA (emergência), incluindo instalação, cabeamento, base de concreto e demais materiais necessários","Guindauto",1,1,2,368,null,0]
["E9666-DNIT/PE","Motoniveladora com escarificador (potência básica líquida -primeira marcha- 125 hp , peso bruto 13.843 kg, largura da lâmina de 3,7 m)","Carreta",1,1,2,368,null,0]
["E9666-DNIT/PE","Rolo compactador pé-de-carneiro vibratório, potência 125 hp, peso operacional sem/com lastro 11,95/13,30 t, impacto dinâmico 38,5/22,5 t, largura de trabalho 2,15 m.","Carreta",2,1,2,368,null,0]
["A9353-DNIT/PE","Barco tipo Alumínio, 7 m de comprimento, Alumínio soldado, reforçado, borda sem corrimão, chapa de Alumínio 2,00 cm, boca 1,50 cm, borda 0,60 cm. / Motor popa, tipo partida manual, potência 15 hp, aplicação barco Alumínio, características adicionais: válvulas automáticas descompressão, refrigerado a ar, quantidade marchas 2 und, quantidade cilíndro 2 und, capacidade tanque 23 l, tipo motor: 2 tempos, velocidade: 4.500 a 5.800 rpm.","Rodando",4,1,1,368,null,0]
[]
["SUB-TOTAL (R$):",{"$nulls":7},{"$f":"SUM(I74:I87)","v":0}]
[]
["MATERIAL"]
["CÓDIGO","DESCRIÇÃO","UNIDADE","QUANTIDADE",null,null,null,"CUSTO UNIT.\n(R$)","CUSTO TOTAL\n(R$)"]
["SINDUSCON/PE","Alimentação (motorista que vai rodando)","und",{"$f":"SUMIF(C74:C87,\"RODANDO\",D74:D87)","v":15},{"$nulls":4},{"$f":"ROUND(D93*H93,2)","v":0}]
["SINDUSCON/PE","Alimentação (motorista que retorna)","und",{"$f":"SUMIF(C74:C87,\"CARRETA\",D74:D87)+SUMIF(C74:C87,\"REBOQUE\",D74:D87)+SUMIF(C74:C87,\"GUINDAUTO\",D74:D87)","v":7},{"$nulls":4},{"$f":"ROUND(D94*H94,2)","v":0}]
[]
["SUB-TOTAL (R$):",{"$nulls":7},{"$f":"SUM(I93:I95)","v":0}]
[]
["SERVIÇOS-COMPOSIÇÕES AUXILIARES"]
["CÓDIGO","DESCRIÇÃO","UNIDADE","QUANTIDADE",null,null,null,"CUSTO UNIT.\n(R$)","CUSTO TOTAL\n(R$)"]
[]
[]
["SUB-TOTAL (R$):",{"$nulls":7},{"$f":"SUM(I100:I101)","v":0}]
[]
["MÃO DE OBRA"]
["CÓDIGO","DESCRIÇÃO","UNIDADE","QUANTIDADE",null,null,null,"CUSTO UNIT.\n(R$)","CUSTO TOTAL\n(R$)"]
[]
[]
["SUB-TOTAL (R$):",{"$nulls":7},{"$f":"SUM(I106:I107)","v":0}]
[]
["PRODUÇÃO DA EQUIPE:",null,1,"CUSTO (R$):",{"$nulls":4},{"$f":"I89+I96+I102+I108","v":0}]
[]
[{"$f":"\"TOTAL-\"&A67&\"-(R$):\"","v":"TOTAL-COMPOSIÇÃO DE PREÇO UNITÁRIO-MOBILIZAÇÃO-(R$):"},{"$nulls":7},{"$f":"ROUND(C110*I110,2)","v":0}]
[]
[]
["COMPOSIÇÃO DE PREÇO UNITÁRIO-MOBILIZAÇÃO"]
["Local / Canteiros: EIXO LESTE-Canteiro Lote 12 (Sertânia/PE)"]
[]
["Distância entre Recife/PE-Canteiro Lote 12 (km):",null,null,{"$f":"Canteiros!H21","v":320},"Veloc. Média (km/h):",null,null,null,{"$f":"$I$12","v":60}]
[]
["EQUIPAMENTO"]
["CÓDIGO","DESCRIÇÃO","MEIO DE\nLOCOMOÇÃO","QUANTIDADE","FU","K","DMT\n(km)","CHP\n(R$)","CUSTO TOTAL\n(R$)"]
["E9592-DNIT/PE","Caminhão Carroceria-de madeira, capacidade de carga 15,0 t","Rodando",2,1,1,{"$f":"$D$118","v":320},null,{"$f":"D122*(((G122*F122*E122)/$I$12)*H122)","v":0}]
["E9579-DNIT/PE","Caminhão basculante, capacidade de carga  15,0 t e volume 10,0 m³","Rodando",1,1,1,{"$f":"$D$118","v":320},null,0]
["E9506-DNIT/PE","Caminhao basculante, capacidade de carga  9,0 t e volume 6,0 m³","Rodando",1,1,1,{"$f":"$D$118","v":320},null,0]
["E9592-DNIT/PE","Caminhão Carroceria-de madeira, capacidade de carga 15,0 t","Rodando",1,1,1,320,null,0]
["E9686-DNIT/PE","Caminhão guindauto com capacidade de carga até 10,0 t","Rodando",1,1,1,320,null,0]
["E9605-DNIT/PE","Caminhão tanque, capacidade de volume  6000 l e potência 136,0 hp","Rodando",1,1,1,320,null,0]
["A9353-DNIT/PE","Carreta Reboque (para embarcação)","Rodando",4,1,1,320,null,0]
["E9666-DNIT/PE","Pá carregadeira sobre rodas, potência líquida 128 hp, capacidade da caçamba de 1,7 a 2,8 m³, peso operacional de 11.632 kg","Carreta",1,1,2,320,null,0]
["E9666-DNIT/PE","Escavadeira hidráulica sobre esteiras, caçamba  0,80 m³, peso operacional 17 t, potência bruta 111 hp.","Carreta",1,1,2,320,null,0]
["E9686-DNIT/PE","Grupo gerador de 4 KVA, 220v, trifásico, silenciado, com 100 metros de cabos e 01 QTA","Guindauto",1,1,2,320,null,0]
["E9686-DNIT/PE","Grupo gerador de 10 KVA, 220v, trifásico, silenciado, com 100 metros de cabos e 01 QTA","Guindauto",1,1,2,320,null,0]
["E9686-DNIT/PE","Grupo gerador, potência nominal 15 kVA (emergência), incluindo instalação, cabeamento, base de concreto e demais materiais necessários","Guindauto",1,1,2,320,null,0]
["E9686-DNIT/PE","Locação de grupo gerador acima de 125 até 180 kVA, motor diesel, rebocável, acionamento manual","Guindauto",1,1,2,320,null,0]
["E9686-DNIT/PE","Grupo gerador diesel, com carenagem, potência standart entre 250 e 260 kVA, velocidade de 1800 rpm, frequência de 60 Hz","Guindauto",1,1,2,320,null,0]
["E9686-DNIT/PE","Minicarregadeira sobre rodas, potência líquida de 47 hp, capacidade nominal de operação de 646 kg","Guindauto",2,1,2,320,null,0]
["E9666-DNIT/PE","Trator Agrícola para reboque de máquina roçadeira","Carreta",1,1,2,320,null,0]
["E9666-DNIT/PE","Trator de esteiras, potência de 150 hp, peso operacional de 16,7 t, com roda motriz elevada e lâmina com contato de 3,18 m³.","Carreta",1,1,2,320,null,0]
["A9353-DNIT/PE","Barco tipo Alumínio, 7 m de comprimento, Alumínio soldado, reforçado, borda sem corrimão, chapa de Alumínio 2,00 cm, boca 1,50 cm, borda 0,60 cm. / Motor popa, tipo partida manual, potência 15 hp, aplicação barco Alumínio, características adicionais: válvulas automáticas descompressão, refrigerado a ar, quantidade marchas 2 und, quantidade cilíndro 2 und, capacidade tanque 23 l, tipo motor: 2 tempos, velocidade: 4.500 a 5.800 rpm.","Rodando",4,1,1,320,null,0]
[]
["SUB-TOTAL (R$):",{"$nulls":7},{"$f":"SUM(I122:I139)","v":0}]
[]
["MATERIAL"]
["CÓDIGO","DESCRIÇÃO","UNIDADE","QUANTIDADE",null,null,null,"CUSTO UNIT.\n(R$)","CUSTO TOTAL\n(R$)"]
["SINDUSCON/PE","Alimentação (motorista que vai rodando)","und",{"$f":"SUMIF(C122:C139,\"RODANDO\",D122:D139)","v":15},{"$nulls":4},{"$f":"D145*H145","v":0}]
["SINDUSCON/PE","Alimentação (motorista que retorna)","und",{"$f":"SUMIF(C122:C139,\"CARRETA\",D122:D139)+SUMIF(C122:C139,\"REBOQUE\",D122:D139)+SUMIF(C122:C139,\"GUINDAUTO\",D122:D139)","v":11},{"$nulls":4},{"$f":"D146*H146","v":0}]
[]
["SUB-TOTAL (R$):",{"$nulls":7},{"$f":"SUM(I145:I147)","v":0}]
[]
["SERVIÇOS-COMPOSIÇÕES AUXILIARES"]
["CÓDIGO","DESCRIÇÃO","UNIDADE","QUANTIDADE",null,null,null,"CUSTO UNIT.\n(R$)","CUSTO TOTAL\n(R$)"]
[]
[]
["SUB-TOTAL (R$):",{"$nulls":7},{"$f":"SUM(I152:I153)","v":0}]
[]
["MÃO DE OBRA"]
["CÓDIGO","DESCRIÇÃO","UNIDADE","QUANTIDADE",null,null,null,"CUSTO UNIT.\n(R$)","CUSTO TOTAL\n(R$)"]
[]
[]
["SUB-TOTAL (R$):",{"$nulls":7},{"$f":"SUM(I158:I159)","v":0}]
[]
["PRODUÇÃO DA EQUIPE:",null,1,"CUSTO (R$):",{"$nulls":4},{"$f":"I141+I148+I154+I160","v":0}]
[]
[{"$f":"\"TOTAL-\"&A115&\"-(R$):\"","v":"TOTAL-COMPOSIÇÃO DE PREÇO UNITÁRIO-MOBILIZAÇÃO-(R$):"},{"$nulls":7},{"$f":"ROUND(C162*I162,2)","v":0}]
[]
[]
["NOME DO INFORMANTE:",{"$nulls":6},"QUALIFICAÇÃO:"]
[]
["ASSINATURA:",{"$nulls":6},"DATA:"]
[]
["OBSERVAÇÃO:"]
["1. Fonte de Preços: Sistemas de Custos Referenciais de Obras-DNIT/PE (Tabela SICRO/PE). Data base: Abril/2019."]
["2. Para o Cálculo do Custo da Mobilização foi utilizada a metodologia do DNIT/PE."]
["3. Distância considerada a partir da capital mais próxima ao canteiro"]
[]
[]
[]
[]
[]
["Código","Descrição","R$/h"]
["E9592-DNIT/PE","Caminhão carroceria com capacidade de 15 t-188 kW",151.7799]
["E9579-DNIT/PE","Caminhão basculante com capacidade de 10 m³-188 kW",153.78909999999999]
["E9506-DNIT/PE","Caminhão basculante com capacidade de 6 m³-136 kW",107.3732]
["E9509-DNIT/PE","Caminhão tanque distribuidor de asfalto com capacidade de 6.000 l-7 kW/136 kW",155.98259999999999]
["E9686-DNIT/PE","Caminhão carroceria com guindauto com capacidade de 20 t.m-136 kW",179.2911]
["E9605-DNIT/PE","Caminhão tanque com capacidade de 6.000 l-136 kW",149.4898]
["A9353-DNIT/PE","Semirreboque com 2 eixos",24.072099999999999]
["E9666-DNIT/PE","Cavalo mecânico com semirreboque com capacidade de 30 t-265 kW",229.38839999999999]
["SINDUSCON/PE","Alimentação (motorista que vai rodando)-Convenção Coletiva de Trabalho 2019-2021-SINDUSCON/PE (Cláusula 14ª)",{"$f":"2*9.32","v":18.64}]

{"sheet":"CPU_DESMOBILIZAZAO","index":4,"n_rows":174,"n_cols":9,"rows_kept":174,"cut":false,"hidden":false,"merged":[[161,0,161,1],[176,0,176,8],[169,0,169,6],[169,7,169,8],[170,0,170,8],[175,0,175,8],[172,0,172,8],[166,0,166,6],[166,7,166,8],[167,0,167,6],[167,7,167,8],[168,0,168,6],[168,7,168,8],[171,0,171,8],[173,0,173,8],[66,0,66,8],[55,0,55,8],[59,0,59,7],[61,3,61,7],[9,0,9,8],[11,0,11,2],[13,0,13,8],[40,0,40,7],[42,0,42,8],[47,0,47,7],[49,0,49,8],[53,0,53,7],[61,0,61,1],[115,0,115,8],[117,0,117,2],[109,3,109,7],[67,0,67,8],[69,0,69,2],[71,0,71,8],[88,0,88,7],[90,0,90,8],[95,0,95,7],[97,0,97,8],[101,0,101,7],[103,0,103,8],[107,0,107,7],[109,0,109,1],[0,0,0,8],[1,0,1,8],[2,0,2,8],[4,0,5,8],[63,0,63,7],[8,0,8,8],[147,0,147,7],[11,4,11,7],[69,4,69,7],[117,4,117,7],[174,0,174,8],[149,0,149,8],[153,0,153,7],[155,0,155,8],[159,0,159,7],[163,0,163,7],[161,3,161,7],[119,0,119,8],[140,0,140,7],[142,0,142,8],[111,0,111,7],[114,0,114,8]]}
["Ministério do Desenvolvimento Regional  - MDR"]
["Companhia de Desenvolvimento dos Vales do São Francisco e do Parnaíba"]
["Gerência de Operação do PISF - Centro de Controle e Operação (AD / GOI / CCO)"]
[]
["SERVIÇOS DE OPERAÇÃO E MANUTENÇÃO DAS INFRAESTRUTURAS DO EIXO LESTE DO PROJETO DE INTEGRAÇÃO DO RIO SÃO FRANCISCO COM AS BACIAS HIDROGRÁFICAS DO NORDESTE SETENTRIONAL – PISF"]
[]
[]
[]
["COMPOSIÇÃO DE PREÇO UNITÁRIO - DESMOBILIZAÇÃO"]
["Local / Canteiros: EIXO LESTE - Canteiro Lote 9 (Floresta/PE)"]
[]
["Distância entre Recife/PE - Canteiro Lote 9 (km):",null,null,{"$f":"Canteiros!H13","v":472},"Veloc. Média (km/h):",null,null,null,60]
[]
["EQUIPAMENTO"]
["CÓDIGO","DISCRIMINAÇÃO","MEIO DE\nLOCOMOÇÃO","QUANTIDADE","FU","K","DMT\n(km)","CHP\n(R$)","CUSTO TOTAL\n(R$)"]
["E9592-DNIT/PE","Caminhão Carroceria - de madeira, capacidade de carga 15,0 t","Rodando",2,1,1,{"$f":"$D$12","v":472},null,{"$f":"ROUND(D16*(((G16*F16*E16)/$I$12)*H16),2)","v":0}]
["E9579-DNIT/PE","Caminhão basculante, capacidade de carga  15,0 t e volume 10,0 m³","Rodando",1,1,1,{"$f":"$D$12","v":472},null,0]
["E9506-DNIT/PE","Caminhao basculante, capacidade de carga  9,0 t e volume 6,0 m³","Rodando",1,1,1,472,null,0]
["E9592-DNIT/PE","Caminhão Carroceria - de madeira, capacidade de carga 15,0 t","Rodando",1,1,1,472,null,0]
["E9509-DNIT/PE","Caminhão Comboio para lubrificação e abastecimento (melosa), convencional totalmente equipado (Capacidade de Combustível: 5.000 l, Capacidade de Lubrificante: 500 l, Capacidade de Graxa: 200 kg, Capacidade de Água: 300 l, Recipiente para Óleo Usado: 200 l, Compressor de Ar e Bomba- d’agua)","Rodando",1,1,1,472,null,0]
["E9686-DNIT/PE","Caminhão guindauto com capacidade de carga até 10,0 t","Rodando",1,1,1,472,null,0]
["E9605-DNIT/PE","Caminhão tanque, capacidade de volume  6000 l e potência 136,0 hp","Rodando",1,1,1,472,null,0]
["A9353-DNIT/PE","Carreta Reboque (para embarcação)","Rodando",4,1,1,472,null,0]
["E9666-DNIT/PE","Pá carregadeira sobre rodas, potência líquida 128 hp, capacidade da caçamba de 1,7 a 2,8 m³, peso operacional de 11.632 kg","Carreta",1,1,2,472,null,0]
["E9666-DNIT/PE","Empilhadeira sobre pneus com torre de três estágios, 4,80 m de elevação, com deslocador lateral dos garfos, motor glp 2.4 l, capacidade nominal de carga de 2,5 t","Carreta",1,1,2,472,null,0]
["E9666-DNIT/PE","Escavadeira hidráulica sobre esteiras, caçamba 0,62 m³, peso operacional 12,61 t, potência líquida 95 hp","Carreta",1,1,2,472,null,0]
["E9666-DNIT/PE","Escavadeira hidráulica sobre esteiras, caçamba  0,80 m³, peso operacional 17 t, potência bruta 111 hp","Carreta",1,1,2,472,null,0]
["E9686-DNIT/PE","Grupo gerador de 4 KVA, 220v, trifásico, silenciado, com 100 metros de cabos e 01 QTA","Guindauto",1,1,2,472,null,0]
["E9686-DNIT/PE","Grupo gerador de 10 KVA, 220v, trifásico, silenciado, com 100 metros de cabos e 01 QTA","Guindauto",1,1,2,472,null,0]
["E9686-DNIT/PE","Grupo gerador, potência nominal 15 kVA (emergência), incluindo instalação, cabeamento, base de concreto e demais materiais necessários","Guindauto",1,1,2,472,null,0]
["E9686-DNIT/PE","Grupo gerador de 15 kVA, 220V, trifásico, silenciado, com 100 metros de cabos e 01 QTA","Guindauto",1,1,2,472,null,0]
["E9666-DNIT/PE","Motoniveladora com escarificador (potência básica líquida -primeira marcha- 125 hp , peso bruto 13.843 kg, largura da lâmina de 3,7 m)","Carreta",1,1,2,472,null,0]
["E9666-DNIT/PE","Grupo Gerador - 32,0 kVA, 220 V, trifásico, silenciado, com 100 metros de cabos e 01 QTA","Carreta",1,1,2,472,null,0]
["E9666-DNIT/PE","Motoniveladora com escarificador (potência básica líquida -primeira marcha- 125 hp , peso bruto 13.843 kg, largura da lâmina de 3,7 m)","Carreta",1,1,2,472,null,0]
["E9666-DNIT/PE","Escavadeira hidráulica sobre esteiras, caçamba 0,62 m³, peso operacional 12,61 t, potência líquida 95 hp","Carreta",1,1,2,472,null,0]
["E9666-DNIT/PE","Trator de esteiras, potência de 150 hp, peso operacional de 16,7t, com roda motriz elevada e lâmina com contato de 3,18 m³","Carreta",1,1,2,472,null,0]
["E9666-DNIT/PE","Cavalo Mecânico com Reboque M. Benz Randon LS-1634/45 29,5 t, ou similar","Carreta",1,1,2,472,null,0]
["E9666-DNIT/PE","Rolo compactador pé-de-carneiro vibratório, potência 125 hp, peso operacional sem/com lastro 11,95/13,30 t, impacto dinâmico 38,5/22,5 t, largura de trabalho 2,15 m","Carreta",1,1,2,472,null,0]
["A9353-DNIT/PE","Barco tipo Alumínio, 7 m de comprimento, Alumínio soldado, reforçado, borda sem corrimão, chapa de Alumínio 2,00 cm, boca 1,50 cm, borda 0,60 cm. / Motor popa, tipo partida manual, potência 15 hp, aplicação barco Alumínio, características adicionais: válvulas automáticas descompressão, refrigerado a ar, quantidade marchas 2 und, quantidade cilíndro 2 und, capacidade tanque 23 l, tipo motor: 2 tempos, velocidade: 4.500 a 5.800 rpm","Rodando",4,1,1,472,null,0]
[]
["SUB-TOTAL (R$):",{"$nulls":7},{"$f":"SUM(I16:I39)","v":0}]
[]
["MATERIAL"]
["CÓDIGO","DISCRIMINAÇÃO","UNIDADE","QUANTIDADE",null,null,null,"CUSTO UNIT.\n(R$)","CUSTO TOTAL\n(R$)"]
["SINDUSCON/PE","Alimentação (motorista que vai rodando)","und",{"$f":"SUMIF(C16:C39,\"RODANDO\",D16:D39)","v":16},{"$nulls":4},{"$f":"ROUND(D45*H45,2)","v":0}]
["SINDUSCON/PE","Alimentação (motorista que retorna)","und",{"$f":"SUMIF(C16:C39,\"CARRETA\",D16:D39)+SUMIF(C16:C39,\"REBOQUE\",D16:D39)+SUMIF(C16:C39,\"GUINDAUTO\",D16:D39)","v":15},{"$nulls":4},{"$f":"ROUND(D46*H46,2)","v":0}]
[]
["SUB-TOTAL (R$):",{"$nulls":7},{"$f":"SUM(I45:I47)","v":0}]
[]
["SERVIÇOS - COMPOSIÇÕES AUXILIARES"]
["CÓDIGO","DISCRIMINAÇÃO","UNIDADE","QUANTIDADE",null,null,null,"CUSTO UNIT.\n(R$)","CUSTO TOTAL\n(R$)"]
[]
[]
["SUB-TOTAL (R$):",{"$nulls":7},{"$f":"SUM(I52:I53)","v":0}]
[]
["MÃO DE OBRA"]
["CÓDIGO","DISCRIMINAÇÃO","UNIDADE","QUANTIDADE",null,null,null,"CUSTO UNIT.\n(R$)","CUSTO TOTAL\n(R$)"]
[]
[]
["SUB-TOTAL (R$):",{"$nulls":7},{"$f":"SUM(I58:I59)","v":0}]
[]
["PRODUÇÃO DA EQUIPE",null,1,"CUSTO (R$):",{"$nulls":4},{"$f":"I41+I48+I54+I60","v":0}]
[]
[{"$f":"\"TOTAL - \"&A9&\" - (R$):\"","v":"TOTAL - COMPOSIÇÃO DE PREÇO UNITÁRIO - DESMOBILIZAÇÃO - (R$):"},{"$nulls":7},{"$f":"ROUND(C62*I62,2)","v":0}]
[]
[]
["COMPOSIÇÃO DE PREÇO UNITÁRIO - DESMOBILIZAÇÃO"]
["Local / Canteiros: EIXO LESTE - Canteiro Lote 10 (Custódia/PE)"]
[]
["Distância entre Recife/PE - Canteiro Lote 10 (km):",null,null,{"$f":"Canteiros!H17","v":368},"Veloc. Média (km/h):",null,null,null,{"$f":"$I$12","v":60}]
[]
["EQUIPAMENTO"]
["CÓDIGO","DISCRIMINAÇÃO","MEIO DE\nLOCOMOÇÃO","QUANTIDADE","FU","K","DMT\n(km)","CHP\n(R$)","CUSTO TOTAL\n(R$)"]
["E9592-DNIT/PE","Caminhão Carroceria - de madeira, capacidade de carga 15,0 t","Rodando",2,1,1,{"$f":"$D$70","v":368},null,{"$f":"ROUND(D74*(((G74*F74*E74)/$I$12)*H74),2)","v":0}]
["E9579-DNIT/PE","Caminhão basculante, capacidade de carga  15,0 t e volume 10,0 m³","Rodando",1,1,1,{"$f":"$D$70","v":368},null,0]
["E9506-DNIT/PE","Caminhao basculante, capacidade de carga  9,0 t e volume 6,0 m³","Rodando",1,1,1,{"$f":"$D$70","v":368},null,0]
["E9592-DNIT/PE","Caminhão Carroceria - de madeira, capacidade de carga 15,0 t","Rodando",1,1,1,368,null,0]
["E9686-DNIT/PE","Caminhão guindauto com capacidade de carga até 10,0 t","Rodando",1,1,1,368,null,0]
["E9605-DNIT/PE","Caminhão tanque, capacidade de volume  6000 l e potência 136,0 hp","Rodando",1,1,1,368,null,0]
["A9353-DNIT/PE","Carreta Reboque (para embarcação)","Rodando",4,1,1,368,null,0]
["E9666-DNIT/PE","Pá carregadeira sobre rodas, potência líquida 128 hp, capacidade da caçamba de 1,7 a 2,8 m³, peso operacional de 11.632 kg","Carreta",1,1,2,368,null,0]
["E9686-DNIT/PE","Grupo gerador de 4 KVA, 220v, trifásico, silenciado, com 100 metros de cabos e 01 QTA","Guindauto",1,1,2,368,null,0]
["E9686-DNIT/PE","Grupo gerador de 10 KVA, 220v, trifásico, silenciado, com 100 metros de cabos e 01 QTA","Guindauto",1,1,2,368,null,0]
["E9686-DNIT/PE","Grupo gerador, potência nominal 15 kVA (emergência), incluindo instalação, cabeamento, base de concreto e demais materiais necessários","Guindauto",1,1,2,368,null,0]
["E9666-DNIT/PE","Motoniveladora com escarificador (potência básica líquida -primeira marcha- 125 hp , peso bruto 13.843 kg, largura da lâmina de 3,7 m)","Carreta",1,1,2,368,null,0]
["E9666-DNIT/PE","Rolo compactador pé-de-carneiro vibratório, potência 125 hp, peso operacional sem/com lastro 11,95/13,30 t, impacto dinâmico 38,5/22,5 t, largura de trabalho 2,15 m","Carreta",2,1,2,368,null,0]
["A9353-DNIT/PE","Barco tipo Alumínio, 7 m de comprimento, Alumínio soldado, reforçado, borda sem corrimão, chapa de Alumínio 2,00 cm, boca 1,50 cm, borda 0,60 cm. / Motor popa, tipo partida manual, potência 15 hp, aplicação barco Alumínio, características adicionais: válvulas automáticas descompressão, refrigerado a ar, quantidade marchas 2 und, quantidade cilíndro 2 und, capacidade tanque 23 l, tipo motor: 2 tempos, velocidade: 4.500 a 5.800 rpm","Rodando",4,1,1,368,null,0]
[]
["SUB-TOTAL (R$):",{"$nulls":7},{"$f":"SUM(I74:I87)","v":0}]
[]
["MATERIAL"]
["CÓDIGO","DISCRIMINAÇÃO","UNIDADE","QUANTIDADE",null,null,null,"CUSTO UNIT.\n(R$)","CUSTO TOTAL\n(R$)"]
["SINDUSCON/PE","Alimentação (motorista que vai rodando)","und",{"$f":"SUMIF(C74:C87,\"RODANDO\",D74:D87)","v":15},{"$nulls":4},{"$f":"ROUND(D93*H93,2)","v":0}]
["SINDUSCON/PE","Alimentação (motorista que retorna)","und",{"$f":"SUMIF(C74:C87,\"CARRETA\",D74:D87)+SUMIF(C74:C87,\"REBOQUE\",D74:D87)+SUMIF(C74:C87,\"GUINDAUTO\",D74:D87)","v":7},{"$nulls":4},{"$f":"ROUND(D94*H94,2)","v":0}]
[]
["SUB-TOTAL (R$):",{"$nulls":7},{"$f":"SUM(I93:I95)","v":0}]
[]
["SERVIÇOS - COMPOSIÇÕES AUXILIARES"]
["CÓDIGO","DISCRIMINAÇÃO","UNIDADE","QUANTIDADE",null,null,null,"CUSTO UNIT.\n(R$)","CUSTO TOTAL\n(R$)"]
[]
[]
["SUB-TOTAL (R$):",{"$nulls":7},{"$f":"SUM(I100:I101)","v":0}]
[]
["MÃO DE OBRA"]
["CÓDIGO","DISCRIMINAÇÃO","UNIDADE","QUANTIDADE",null,null,null,"CUSTO UNIT.\n(R$)","CUSTO TOTAL\n(R$)"]
[]
[]
["SUB-TOTAL (R$):",{"$nulls":7},{"$f":"SUM(I106:I107)","v":0}]
[]
["PRODUÇÃO DA EQUIPE",null,1,"CUSTO (R$):",{"$nulls":4},{"$f":"I89+I96+I102+I108","v":0}]
[]
[{"$f":"\"TOTAL - \"&A67&\" - (R$):\"","v":"TOTAL - COMPOSIÇÃO DE PREÇO UNITÁRIO - DESMOBILIZAÇÃO - (R$):"},{"$nulls":7},{"$f":"ROUND(C110*I110,2)","v":0}]
[]
[]
["COMPOSIÇÃO DE PREÇO UNITÁRIO - DESMOBILIZAÇÃO"]
["Local / Canteiros: EIXO LESTE - Canteiro Lote 12 (Sertânia/PE)"]
[]
["Distância entre Recife/PE - Canteiro Lote 12 (km):",null,null,{"$f":"Canteiros!H21","v":320},"Veloc. Média (km/h):",null,null,null,{"$f":"$I$12","v":60}]
[]
["EQUIPAMENTO"]
["CÓDIGO","DISCRIMINAÇÃO","MEIO DE\nLOCOMOÇÃO","QUANTIDADE","FU","K","DMT\n(km)","CHP\n(R$)","CUSTO TOTAL\n(R$)"]
["E9592-DNIT/PE","Caminhão Carroceria - de madeira, capacidade de carga 15,0 t","Rodando",2,1,1,{"$f":"$D$118","v":320},null,{"$f":"ROUND(D122*(((G122*F122*E122)/$I$12)*H122),2)","v":0}]
["E9579-DNIT/PE","Caminhão basculante, capacidade de carga  15,0 t e volume 10,0 m³","Rodando",1,1,1,{"$f":"$D$118","v":320},null,0]
["E9506-DNIT/PE","Caminhao basculante, capacidade de carga  9,0 t e volume 6,0 m³","Rodando",1,1,1,{"$f":"$D$118","v":320},null,0]
["E9592-DNIT/PE","Caminhão Carroceria - de madeira, capacidade de carga 15,0 t","Rodando",1,1,1,320,null,0]
["E9686-DNIT/PE","Caminhão guindauto com capacidade de carga até 10,0 t","Rodando",1,1,1,320,null,0]
["E9605-DNIT/PE","Caminhão tanque, capacidade de volume  6000 l e potência 136,0 hp","Rodando",1,1,1,320,null,0]
["A9353-DNIT/PE","Carreta Reboque (para embarcação)","Rodando",4,1,1,320,null,0]
["E9666-DNIT/PE","Pá carregadeira sobre rodas, potência líquida 128 hp, capacidade da caçamba de 1,7 a 2,8 m³, peso operacional de 11.632 kg","Carreta",1,1,2,320,null,0]
["E9666-DNIT/PE","Escavadeira hidráulica sobre esteiras, caçamba  0,80 m³, peso operacional 17 t, potência bruta 111 hp","Carreta",1,1,2,320,null,0]
["E9686-DNIT/PE","Grupo gerador de 4 KVA, 220v, trifásico, silenciado, com 100 metros de cabos e 01 QTA","Guindauto",1,1,2,320,null,0]
["E9686-DNIT/PE","Grupo gerador de 10 KVA, 220v, trifásico, silenciado, com 100 metros de cabos e 01 QTA","Guindauto",1,1,2,320,null,0]
["E9686-DNIT/PE","Grupo gerador, potência nominal 15 kVA (emergência), incluindo instalação, cabeamento, base de concreto e demais materiais necessários","Guindauto",1,1,2,320,null,0]
["E9686-DNIT/PE","Locação de grupo gerador acima de 125 até 180 kVA, motor diesel, rebocável, acionamento manual","Guindauto",1,1,2,320,null,0]
["E9686-DNIT/PE","Grupo gerador diesel, com carenagem, potência standart entre 250 e 260 kVA, velocidade de 1800 rpm, frequência de 60 Hz","Guindauto",1,1,2,320,null,0]
["E9686-DNIT/PE","Minicarregadeira sobre rodas, potência líquida de 47 hp, capacidade nominal de operação de 646 kg","Guindauto",2,1,2,320,null,0]
["E9666-DNIT/PE","Trator Agrícola para reboque de máquina roçadeira","Carreta",1,1,2,320,null,0]
["E9666-DNIT/PE","Trator de esteiras, potência de 150 hp, peso operacional de 16,7 t, com roda motriz elevada e lâmina com contato de 3,18 m³","Carreta",1,1,2,320,null,0]
["A9353-DNIT/PE","Barco tipo Alumínio, 7 m de comprimento, Alumínio soldado, reforçado, borda sem corrimão, chapa de Alumínio 2,00 cm, boca 1,50 cm, borda 0,60 cm. / Motor popa, tipo partida manual, potência 15 hp, aplicação barco Alumínio, características adicionais: válvulas automáticas descompressão, refrigerado a ar, quantidade marchas 2 und, quantidade cilíndro 2 und, capacidade tanque 23 l, tipo motor: 2 tempos, velocidade: 4.500 a 5.800 rpm","Rodando",4,1,1,320,null,0]
[]
["SUB-TOTAL (R$):",{"$nulls":7},{"$f":"SUM(I122:I139)","v":0}]
[]
["MATERIAL"]
["CÓDIGO","DISCRIMINAÇÃO","UNIDADE","QUANTIDADE",null,null,null,"CUSTO UNIT.\n(R$)","CUSTO TOTAL\n(R$)"]
["SINDUSCON/PE","Alimentação (motorista que vai rodando)","und",{"$f":"SUMIF(C122:C139,\"RODANDO\",D122:D139)","v":15},{"$nulls":4},{"$f":"ROUND(D145*H145,2)","v":0}]
["SINDUSCON/PE","Alimentação (motorista que retorna)","und",{"$f":"SUMIF(C122:C139,\"CARRETA\",D122:D139)+SUMIF(C122:C139,\"REBOQUE\",D122:D139)+SUMIF(C122:C139,\"GUINDAUTO\",D122:D139)","v":11},{"$nulls":4},{"$f":"ROUND(D146*H146,2)","v":0}]
[]
["SUB-TOTAL (R$):",{"$nulls":7},{"$f":"SUM(I145:I147)","v":0}]
[]
["SERVIÇOS - COMPOSIÇÕES AUXILIARES"]
["CÓDIGO","DISCRIMINAÇÃO","UNIDADE","QUANTIDADE",null,null,null,"CUSTO UNIT.\n(R$)","CUSTO TOTAL\n(R$)"]
[]
[]
["SUB-TOTAL (R$):",{"$nulls":7},{"$f":"SUM(I152:I153)","v":0}]
[]
["MÃO DE OBRA"]
["CÓDIGO","DISCRIMINAÇÃO","UNIDADE","QUANTIDADE",null,null,null,"CUSTO UNIT.\n(R$)","CUSTO TOTAL\n(R$)"]
[]
[]
["SUB-TOTAL (R$):",{"$nulls":7},{"$f":"SUM(I158:I159)","v":0}]
[]
["PRODUÇÃO DA EQUIPE",null,1,"CUSTO (R$):",{"$nulls":4},{"$f":"I141+I148+I154+I160","v":0}]
[]
[{"$f":"\"TOTAL - \"&A115&\" - (R$):\"","v":"TOTAL - COMPOSIÇÃO DE PREÇO UNITÁRIO - DESMOBILIZAÇÃO - (R$):"},{"$nulls":7},{"$f":"ROUND(C162*I162,2)","v":0}]
[]
[]
["NOME DO INFORMANTE:",{"$nulls":6},"QUALIFICAÇÃO:"]
[]
["ASSINATURA:",{"$nulls":6},"DATA:"]
[]
["OBSERVAÇÃO:"]
["1. Fonte de Preços: Sistemas de Custos Referenciais de Obras-DNIT/PE (Tabela SICRO/PE). Data base: Abril/2019."]
["2. Para o Cálculo do Custo da Mobilização foi utilizada a metodologia do DNIT/PE."]
["3. Distância considerada a partir da capital mais próxima ao canteiro"]

{"sheet":"Canteiros","index":5,"n_rows":32,"n_cols":8,"rows_kept":32,"cut":false,"hidden":false,"merged":[[27,6,27,7],[20,1,24,1],[12,0,15,0],[16,0,19,0],[20,0,24,0],[12,1,15,1],[27,0,27,5],[16,1,19,1],[12,2,15,2],[16,2,19,2],[20,2,24,2],[12,6,15,6],[20,6,24,6],[20,7,24,7],[12,7,15,7],[16,6,19,6],[28,0,28,5],[29,0,29,5],[28,6,28,7],[29,6,29,7],[30,0,30,5],[31,0,31,7],[32,0,32,7],[33,0,33,7],[34,0,34,7],[30,6,30,7],[20,3,24,3],[10,0,11,0],[10,1,11,1],[10,4,11,4],[10,2,11,2],[0,2,0,7],[1,2,1,7],[2,2,2,7],[16,7,19,7],[10,3,11,3],[12,3,15,3],[16,3,19,3],[10,6,10,7],[10,5,11,5],[4,0,5,7],[7,0,7,7]]}
[null,null,"Ministério do Desenvolvimento Regional  - MDR"]
[null,null,"Companhia de Desenvolvimento dos Vales do São Francisco e do Parnaíba"]
[null,null,"Gerência de Operação do PISF - Centro de Controle e Operação (AD / GOI / CCO)"]
[]
["SERVIÇOS DE OPERAÇÃO E MANUTENÇÃO DAS INFRAESTRUTURAS DO EIXO LESTE DO PROJETO DE INTEGRAÇÃO DO RIO SÃO FRANCISCO COM AS BACIAS HIDROGRÁFICAS DO NORDESTE SETENTRIONAL – PISF"]
[]
[]
["CANTEIROS - INFORMAÇÕES COMPLEMENTARES"]
[]
[]
["ITEM","CANTEIRO","COORDENADAS\n(SAD69)","TRECHO","RESERVATÓRIOS","ESTAÇÕES DE\nBOMBEAMENTO","LOCALIZAÇÃO"]
[{"$nulls":6},"CAPITAL MAIS PRÓXIMA","DIST. ATÉ CAPITAL (km)"]
[1,"Lote 09 (Floresta/PE)","Leste: 572780,\nNorte: 9030684","Trecho 1 - Do reservatório de Itaparica até o Reservatório Salgueiro","Areias","EBV-1","Recife / PE",472]
[{"$nulls":4},"Braúnas","EBV-2"]
[{"$nulls":4},"Mandantes","EBV-3"]
[{"$nulls":4},"Salgueiro"]
[2,"Lote 10 (Custódia/PE)","Leste: 628932,\nNorte: 9076044",".\nTrecho 2 - Do Reservatório Salgueiro até Reservatório Copiti.","Muquem","EBV-4","Recife / PE",368]
[{"$nulls":4},"Cacimba Nova"]
[{"$nulls":4},"Bagres"]
[{"$nulls":4},"Copiti"]
[3,"Lote 12 (Sertânia/PE)","Leste: 690429,\nNorte: 9108941","\nTrecho 3 - De Reservatório Copiti até Monteiro/PB.","Moxotó","EBV-5","Recife / PE",320]
[{"$nulls":4},"Barreiro","EBV-6"]
[{"$nulls":4},"Campos"]
[{"$nulls":4},"Barro Branco"]
[{"$nulls":4},"Monteiro"]
[]
[]
["NOME DO INFORMANTE:",{"$nulls":5},"QUALIFICAÇÃO:"]
[]
["ASSINATURA:",{"$nulls":5},"DATA:"]
[]
["OBSERVAÇAO:"]

{"sheet":"Reforma_Canteiros","index":6,"n_rows":83,"n_cols":7,"rows_kept":83,"cut":false,"hidden":false,"merged":[[12,2,12,6],[57,5,57,6],[53,5,53,6],[54,2,54,4],[54,5,54,6],[55,2,55,4],[55,5,55,6],[35,0,35,5],[37,2,37,6],[14,2,14,6],[23,0,23,5],[25,2,25,6],[64,0,64,6],[47,0,47,5],[49,0,49,5],[63,5,63,6],[60,0,60,4],[61,0,61,4],[62,0,62,4],[63,0,63,4],[60,5,60,6],[61,5,61,6],[62,5,62,6],[52,0,52,6],[53,2,53,4],[56,2,56,4],[56,5,56,6],[57,0,57,4],[0,2,0,6],[1,2,1,6],[2,2,2,6],[4,0,5,6],[7,0,7,6],[10,3,11,3],[10,4,11,4],[10,5,10,6],[10,2,11,2],[10,0,11,0],[10,1,11,1],[75,3,75,4],[75,2,76,2],[75,1,76,1],[65,0,65,6],[66,0,66,6],[67,0,67,6],[68,0,68,6],[69,0,69,6],[70,0,70,6],[73,0,73,6],[72,0,72,6],[71,0,71,6]]}
[null,null,"Ministério do Desenvolvimento Regional  - MDR"]
[null,null,"Companhia de Desenvolvimento dos Vales do São Francisco e do Parnaíba"]
[null,null,"Gerência de Operação do PISF - Centro de Controle e Operação (AD / GOI / CCO)"]
[]
["SERVIÇOS DE OPERAÇÃO E MANUTENÇÃO DAS INFRAESTRUTURAS DO EIXO LESTE DO PROJETO DE INTEGRAÇÃO DO RIO SÃO FRANCISCO COM AS BACIAS HIDROGRÁFICAS DO NORDESTE SETENTRIONAL – PISF"]
[]
[]
["REFORMA DOS CANTEIROS"]
[]
[]
["ITEM","CÓDIGO","CANTEIRO","UNIDADE","QUANTIDADE","VALOR (R$)"]
[{"$nulls":5},"UNITARIO","TOTAL"]
[null,null,{"$f":"A8","v":"REFORMA DOS CANTEIROS"}]
[]
[1,null,"REFORMA DO CANTEIRO DO LOTE 09 (FLOPRESTA/PE)"]
["1.1","93206-SINAPI/PE*","Escritório 1","m²",174.06,null,{"$f":"ROUND(E16*F16,2)","v":0}]
["1.2","93206-SINAPI/PE*","Escritório 2","m²",276.75,null,{"$f":"ROUND(E17*F17,2)","v":0}]
["1.3","93585-SINAPI/PE*","Guarita","m²",57.29,null,0]
["1.4","93213-SINAPI/PE*","Vestiário e sanitário","m²",108.24,null,0]
["1.5","93211-SINAPI/PE*","Cozinha e refeitório/Auditório","m²",427.68,null,0]
["1.6","93213-SINAPI/PE*","Lazer (área de convivência)","m²",142.21,null,0]
["1.7","93209-SINAPI/PE*","Almoxarifado","m²",264.95999999999998,null,0]
["1.8","93582-SINAPI/PE*","Central de armação","m²",702.74,null,0]
[{"$f":"\"TOTAL - \"&C15&\" - (R$):\"","v":"TOTAL - REFORMA DO CANTEIRO DO LOTE 09 (FLOPRESTA/PE) - (R$):"},{"$nulls":5},{"$f":"SUBTOTAL(9,G15:G23)","v":0}]
[]
["2.",null,"REFORMA DO CANTEIRO DO LOTE 10 (CUSTÓDIA/PE)"]
["2.1","93206-SINAPI/PE","Escritório 1","m²",255.16,null,{"$f":"ROUND(E27*F27,2)","v":0}]
["2.2","93206-SINAPI/PE","Escritório 2","m²",297.08,null,0]
["2.3","93585-SINAPI/PE*","Guarita","m²",12.46,null,0]
["2.4","93213-SINAPI/PE","Vestiário e sanitário","m²",268.64,null,0]
["2.5","93211-SINAPI/PE","Cozinha e refeitório/Auditório","m²",1477.66,null,0]
["2.6","93213-SINAPI/PE*","Lazer (área de convivência)","m²",350,null,0]
["2.7","93209-SINAPI/PE*","Almoxarifado","m²",456.2,null,0]
["2.8","93582-SINAPI/PE*","Central de armação","m²",663.82,null,0]
["2.9","93206-SINAPI/PE","Centro de Saúde","m²",53.72,null,0]
[{"$f":"\"TOTAL - \"&C26&\" - (R$):\"","v":"TOTAL - REFORMA DO CANTEIRO DO LOTE 10 (CUSTÓDIA/PE) - (R$):"},{"$nulls":5},{"$f":"SUBTOTAL(9,G26:G35)","v":0}]
[]
["3.",null,"REFORMA DO CANTEIRO DO LOTE 12 (SERTÂNIA/PE)"]
["3.1","93206-SINAPI/PE*","Escritório 1","m²",285.33,null,{"$f":"ROUND(E39*F39,2)","v":0}]
["3.2","93206-SINAPI/PE*","Escritório 2","m²",323.2,null,0]
["3.3","93585-SINAPI/PE*","Guarita","m²",9.9,null,0]
["3.4","93213-SINAPI/PE*","Vestiário e sanitário","m²",616.98,null,0]
["3.5","93211-SINAPI/PE*","Cozinha e refeitório/Auditório","m²",690.8,null,0]
["3.6","93213-SINAPI/PE*","Lazer (área de convivência)","m²",58.76,null,0]
["3.7","93209-SINAPI/PE*","Almoxarifado","m²",229.35,null,0]
["3.8","93582-SINAPI/PE*","Central de armação","m²",216.72,null,0]
["3.9","93206-SINAPI/PE*","Centro de Saúde","m²",53.72,null,0]
[{"$f":"\"TOTAL - \"&C38&\" - (R$):\"","v":"TOTAL - REFORMA DO CANTEIRO DO LOTE 12 (SERTÂNIA/PE) - (R$):"},{"$nulls":5},{"$f":"SUBTOTAL(9,G38:G47)","v":0}]
[]
[{"$f":"\"TOTAL - \"&C13&\" - (R$):\"","v":"TOTAL - REFORMA DOS CANTEIROS - (R$):"},{"$nulls":5},{"$f":"SUBTOTAL(9,G15:G49)","v":0}]
[]
[]
[{"$f":"\"RESUMO - \"&A8","v":"RESUMO - REFORMA DOS CANTEIROS"}]
["ITEM",null,"DESCRIÇÃO",null,null,"VALOR TOTAL (R$)"]
[1,null,{"$f":"C15","v":"REFORMA DO CANTEIRO DO LOTE 09 (FLOPRESTA/PE)"},null,null,{"$f":"G24","v":0}]
[2,null,{"$f":"C26","v":"REFORMA DO CANTEIRO DO LOTE 10 (CUSTÓDIA/PE)"},null,null,{"$f":"G36","v":0}]
[3,null,{"$f":"C38","v":"REFORMA DO CANTEIRO DO LOTE 12 (SERTÂNIA/PE)"},null,null,{"$f":"G48","v":0}]
[{"$f":"\"TOTAL GERAL - \"&A53&\" -  (R$):\"","v":"TOTAL GERAL - RESUMO - REFORMA DOS CANTEIROS -  (R$):"},{"$nulls":4},{"$f":"SUM(F55:G57)","v":0}]
[]
[]
["NOME DO INFORMANTE:",{"$nulls":4},"QUALIFICAÇÃO:"]
[]
["ASSINATURA:",{"$nulls":4},"DATA:"]
[]
["OBSERVAÇÃO:"]
["1. Fonte de Preços Sistema Nacional de Pesquisa de Custos e Índices da Construção (Tabela SINAPI/PE). Data base: Setembro/2019."]
["2. Para os serviços que não são codificados pela Tabela SINAPI, foi adotado valor de serviços similares."]
["3. Foi considerada reconstrução dos escritórios, vestiários e sanitários do canteiro de Custódia/PE"]
["4. Para os casos de reconstrução, foi adotado o valor de referência integral da Tabela SINAPI/PE."]
["5. Para os casos de reforma, foi adotado o percentual de 25% do valor integral da Tabela SINAPI/PE."]
["6. A reforma dos escritórios inclui toda a parte civil e instalações prediais, inclusive serviços e fornecimento de material."]
[]
[]
[]
[]
[null,"Código","Descrição","R$"]
[null,null,null,1,0.25]
[null,"93206-SINAPI/PE","EXECUÇÃO DE ESCRITÓRIO EM CANTEIRO DE OBRA EM ALVENARIA, NÃO INCLUSO MOBILIÁRIO E EQUIPAMENTOS. AF_02/2016",793.66,{"$f":"ROUND(D78*E$77,2)","v":198.42}]
[null,"93585-SINAPI/PE","EXECUÇÃO DE GUARITA EM CANTEIRO DE OBRA EM CHAPA DE MADEIRA COMPENSADA, NÃO INCLUSO MOBILIÁRIO. AF_04/2016",687.44,171.86]
[null,"93213-SINAPI/PE","EXECUÇÃO DE SANITÁRIO E VESTIÁRIO EM CANTEIRO DE OBRA EM ALVENARIA, NÃO INCLUSO MOBILIÁRIO. AF_02/2016",738.13,184.53]
[null,"93211-SINAPI/PE","EXECUÇÃO DE REFEITÓRIO EM CANTEIRO DE OBRA EM ALVENARIA, NÃO INCLUSO MOBILIÁRIO E EQUIPAMENTOS. AF_02/2016",404.27,101.07]
[null,"93209-SINAPI/PE","EXECUÇÃO DE ALMOXARIFADO EM CANTEIRO DE OBRA EM ALVENARIA, INCLUSO PRATELEIRAS. AF_02/2016",656.1,164.03]
[null,"93582-SINAPI/PE","EXECUÇÃO DE CENTRAL DE ARMADURA EM CANTEIRO DE OBRA, NÃO INCLUSO MOBILIÁRIO E EQUIPAMENTOS. AF_04/2016",187.93,46.98]

{"sheet":"Moveis_Equipamentos","index":7,"n_rows":152,"n_cols":7,"rows_kept":152,"cut":false,"hidden":false,"merged":[[0,2,0,6],[1,2,1,6],[2,2,2,6],[4,0,5,6],[7,0,7,6],[91,0,91,6],[92,0,92,6],[93,0,93,6],[75,5,75,6],[76,5,76,6],[77,5,77,6],[78,5,78,6],[75,0,76,4],[77,0,78,4],[79,0,79,6],[80,0,90,6],[12,2,12,6],[10,0,11,0],[10,2,11,2],[10,3,11,3],[10,4,11,4],[10,5,10,6],[10,1,11,1],[72,5,72,6],[72,0,72,4],[66,0,66,5],[69,0,69,6],[70,2,70,4],[70,5,70,6],[71,2,71,4],[71,5,71,6]]}
[null,null,"Ministério do Desenvolvimento Regional -MDR"]
[null,null,"Companhia de Desenvolvimento dos Vales do São Francisco e do Parnaíba"]
[null,null,"Gerência de Operação do PISF-Centro de Controle e Operação (AD / GOI / CCO)"]
[]
["SERVIÇOS DE OPERAÇÃO E MANUTENÇÃO DAS INFRAESTRUTURAS DO EIXO LESTE DO PROJETO DE INTEGRAÇÃO DO RIO SÃO FRANCISCO COM AS BACIAS HIDROGRÁFICAS DO NORDESTE SETENTRIONAL – PISF"]
[]
[]
["MOBILIÁRIO E EQUIPAMENTOS DE ESCRITÓRIO"]
[]
[]
["ITEM","CÓDIGO","DESCRIÇÃO","UNIDADE","QUANTIDADE","VALOR (R$)"]
[{"$nulls":5},"UNITARIO","TOTAL"]
["1.",null,"MOBILIÁRIO E EQUIPAMENTOS DE ESCRTÓRIO"]
["1.1","E209300236-EMBASA/BA","Aluguel de impressora colorida-Laser com cartuchos-formatos A4 e A3 (inclusive suprimentos)","un x mês",{"$f":"3*12+5*3*12","v":216},null,{"$f":"ROUND(E14*F14,2)","v":0}]
["1.2","I8612-SEINFRA/CE","Aluguel de Plotter (inclusive suprimentos)","un x mês",{"$f":"3*12","v":36},null,{"$f":"ROUND(E15*F15,2)","v":0}]
["1.3"," I2677-SEINFRA/CE","Servidor para backup","un",{"$f":"3*12","v":36},null,0]
["1.4","3671-ORSE/SE","Desktop com software-tipo 1 (i7, 1T, 8GB, monitor 19\", S.O. Windows 10 e Office última versão)","un",{"$f":"(44+29)","v":73},null,0]
["1.5","I6395-SEINFRA/CE","Notebook-tipo 1 (i7, 1T, 8GB, S.O. Windows 10 e Office última versão)","um",{"$f":"(3+6+7)","v":16},null,0]
["1.6","P.17.000.042561-CPOS/SP","Antena externa","un",1,null,0]
["1.7","AP_JANTAR","Aparelho de jantar para 06 pessoas","un",20,null,0]
["1.8","I0122-SEINFRA/CE","Armário de cozinha completo","un",3,null,0]
["1.9","I0123-SEINFRA/CE","Armário de escritório","un",11,null,0]
["1.10","11645-ORSE/SE","Armário para vestiário, em aço, com 12 portas, com cadeado","un",3,null,0]
["1.11","73.72.07-SUDECAP/MG","Bebedouro industrial (canteiro)","un",4,null,0]
["1.12","11534-ORSE/SE","Cadeira giratória, com braço, tipo executiva","un",89,null,0]
["1.13","11543-ORSE","Cadeira de plástico sem braço, cor branca","un",15,null,0]
["1.14","COT_CAMA_BOX","Cama box solteiro","un",25,null,0]
["1.15","COT_CAM_FOTO","Câmera fotográfica digital","un",3,null,0]
["1.16","DV_16-CAERN/RN","Carrinhos de lixo","un",7,null,0]
["1.17","\t040117-SBC/PE","Cestos de lixo","un",12,null,0]
["1.18","COT_CHAP","Chapa gás para grelhar","un",4,null,0]
["1.19","621-ORSE/SE","Coifa","un",4,null,0]
["1.20","39555-SINAPI/PE","Condicionador de ar 12.000 BTU","un",15,null,0]
["1.21","COT_MES_06","Conjunto de Mesa com 06 lugares (para cozinha)","un",4,null,0]
["1.22","COT_UTENS","Conjunto de utensílios para cozinha","conj.",3,null,0]
["1.23","COT_FAQUEI","Faqueiro com 24 peças","un",17,null,0]
["1.24","10231-ORSE/SE","Fogão ","un",3,null,0]
["1.25","78052-SIURB/SP","Fogão industrial 6 bocas ","un",3,null,0]
["1.26","COT_FORNO","Forno elétrico","un",3,null,0]
["1.27","COT_MICROOND","Forno Microondas","un",3,null,0]
["1.28","F020000719-EMBASA/BA","Freezer 246 l","un",1,null,0]
["1.29","029028-IOPES","Cilindro de Gás de Cozinha 45 kg","un",{"$f":"2*3+1","v":7},null,{"$f":"ROUND(E42*F42,2)","v":0}]
["1.30","4226-SINAPI/PE","Gás de cozinha-GLP","kg",{"$f":"E42*45*12","v":3780},null,0]
["1.31","F020000716-EMBASA/BA","Geladeira 280 litros","un",3,null,0]
["1.32","\t10232-ORSE/SE","Geladeira industrial 300 litros","un",3,null,0]
["1.33","COT_GPS","GPS com cabo e software (conforme especificação)","un",3,null,0]
["1.34","COT_GUARDA_ROUPA","Guarda-Roupa 4 Portas","un",2,null,0]
["1.35","COT_COPO","Conjunto  copos em vidro com 8 unidades","un",50,null,0]
["1.36","COT_PANEL","Conjunto de panelas com 7 peças","un",4,null,0]
["1.37","COT_ROUPA_BANHO","Jogo de Roupa de banho 5 Peças","un",{"$f":"E27","v":25},null,0]
["1.38","COT_ROUPA_CAMA","Jogo de roupa de cama solteiro","un",{"$f":"E$27*2","v":50},null,0]
["1.39","COT_SOFA","Conjunto de sofá 2 e 3 lugares","un",5,null,0]
["1.40","COT_LIQUID","Liquidificadores industriais","un",4,null,0]
["1.41","COT_MAQ_LAVA_LOUCA","Máquina de lavar louças industrial","un",3,null,0]
["1.42","COT_MAQ_LAVA_ROUPA","Máquina de Lavar roupa 11kg","un",3,null,0]
["1.43","COT_MESA_BUF","Mesa buffets","un",5,null,0]
["1.44","COT_MESA_REFEIT","Mesa de refeitório 10 lugares com cadeiras","un",20,null,0]
["1.45","COT_MESA_REUN","Mesa de reunião 10 lugares com 10 cadeiras","un",3,null,0]
["1.46","COT_MESA_PVC","Mesa retangular em PVC","un",3,null,0]
["1.47","COT_MESA_ESCR","Mesas de escritório com gavetas (conforme especificação)","un",89,null,0]
["1.48","COT_PRATO","Pratos rasos","un",300,null,0]
["1.49","F030000293-EMBASA/BA","Projetor multimídia (Datashow)","un",3,null,0]
["1.50","COT_RACK","Rack (sala)","un",3,null,0]
["1.51","COT_REFRESQUEIRA","Refresqueira","un",4,null,0]
["1.52","COT_TABUA","Tábuas para carnes","un",4,null,0]
["1.53","COT_TELEVISOR","Televisor LCD com 27,5\"","un",3,null,0]
[{"$f":"\"TOTAL-\"&C13&\"-(R$):\"","v":"TOTAL-MOBILIÁRIO E EQUIPAMENTOS DE ESCRTÓRIO-(R$):"},{"$nulls":5},{"$f":"SUBTOTAL(9,G13:G66)","v":0}]
[]
[]
[{"$f":"\"RESUMO-\"&A$8","v":"RESUMO-MOBILIÁRIO E EQUIPAMENTOS DE ESCRITÓRIO"}]
["ITEM",null,"DESCRIÇÃO",null,null,"VALOR TOTAL (R$)"]
[1,null,{"$f":"C13","v":"MOBILIÁRIO E EQUIPAMENTOS DE ESCRTÓRIO"},null,null,{"$f":"G67","v":0}]
[{"$f":"\"TOTAL GERAL-\"&A70&\"- (R$):\"","v":"TOTAL GERAL-RESUMO-MOBILIÁRIO E EQUIPAMENTOS DE ESCRITÓRIO- (R$):"},{"$nulls":4},{"$f":"SUM(F72:G72)","v":0}]
[]
[]
["NOME DO INFORMANTE:",{"$nulls":4},"QUALIFICAÇÃO:"]
[]
["ASSINATURA:",{"$nulls":4},"DATA:"]
[]
["OBSERVAÇÃO:"]
["1. Fonte de Preços:\n- Sistema Nacional de Pesquisa de Custos e Índices da Construção (Tabela SINAPI/PE). Data base: Setembro/2019.\n- Empresa Baiana de Águas e Saneamento S.A. (Tabela de preços EMBASA). Data base: 06/2017.\n- Secretaria da Infraestrutura do Estado do Ceará (Tabela 026 SEINFRA/CE). Data base: 12/2018.\n- Sistema de Orçamento de Obras de Sergipe (ORSE). Data base: 09/2019.\n- Companhia Paulista de Obras e Serviços (Boletim Referencial de Custos CPOS). Data base: 07/2019\n- Superintendência de Desenvolvimento da Capital-Prefeitura de Belo Horizonte (Tabela de Preços SUDECAP/MG). Data base: 08/2019.\n- Companhia de Águas e Esgotos do Rio Grande do Norte (Tabela de Preços CAERN/RN). Data base: 05/2019.\n- Sistemas e Consultoria de Custos (Base de Dados SBC/PE). Data base: 11/2019.\n- Instituto de Obras Públicas do Estado do Espírito Santo (Tabela REferencial de Preços IOPES/ES). Data base: 07/2019."]
{"$rows_empty":16}
[null,"Código","Descrição","Unid.","R$/unit"]
[null,"E209300236-EMBASA/BA","Aluguel de impressora colorida-Laser com cartuchos-formatos A4 e A3","un x mês",225.08]
[null,"E209300236-EMBASA/BA","Aluguel de impressora colorida-Laser com cartuchos-formatos A4 e A3","un x mês",225.08]
[null,"I8612-SEINFRA/CE","Aluguel de Plotter","un x mês",320]
[null," I2677-SEINFRA/CE","Servidor para backup","un",3652]
[null,"3671-ORSE/SE","Desktop com software-tipo 1 (i7, 1T, 8GB, monitor 19\", S.O. Windows 10 e Office última versão)","un",2505.11]
[null,"I6395-SEINFRA/CE","Notebook-tipo 1 (i7, 1T, 8GB, S.O. Windows 10 e Office última versão)","un",2343.44]
[null,"P.17.000.042561-CPOS/SP","Antena externa","un",326.55]
[null,"AP_JANTAR","Aparelho de jantar para 06 pessoas","un",199.97]
[null,"I0122-SEINFRA/CE","Armário de cozinha completo","un",499]
[null,"I0123-SEINFRA/CE","Armário de escritório","un",195.33]
[null,"11645-ORSE/SE","Armário para vestiário, em aço, com 12 portas, com cadeado","un",1726.59]
[null,"73.72.07-SUDECAP/MG","Bebedouro industrial (canteiro)","un",997.4]
[null,"11534-ORSE/SE","Cadeira giratória, com braço, tipo executiva","un",280]
[null,"11543-ORSE","Cadeira de plástico sem braço, cor branca","un",21]
[null,"COT_CAMA_BOX","Cama box solteiro","un",279.3]
[null,"COT_CAM_FOTO","Câmera fotográfica digital","un",1835.21]
[null,"DV_16-CAERN/RN","Carrinhos de lixo","un",429.02]
[null,"\t040117-SBC/PE","Cestos de lixo","un",96]
[null,"COT_CHAP","Chapa gás para grelhar","un",674.18666666666661]
[null,"621-ORSE/SE","Coifa","un",1679.3]
[null,"39555-SINAPI/PE","Condicionador de ar 12.000 BTU","un",1629.96]
[null,"COT_COPO","Conjunto  copos em vidro com 8 unidades","un",31.323333333333334]
[null,"COT_MES_06","Conjunto de Mesa com 06 lugares (para cozinha)","un",550.63]
[null,"COT_PANEL","Conjunto de panelas com 7 peças","un",235.96333333333334]
[null,"COT_SOFA","Conjunto de sofá 2 e 3 lugares","un",495.66666666666669]
[null,"COT_UTENS","Conjunto de utensílios para cozinha","conj.",55.153333333333336]
[null,"COT_FAQUEI","Faqueiro com 24 peças","un",45.613333333333323]
[null,"10231-ORSE/SE","Fogão ","un",591.87]
[null,"78052-SIURB/SP","Fogão industrial 6 bocas ","un",1797.94]
[null,"COT_FORNO","Forno elétrico","un",1670.6133333333335]
[null,"COT_MICROOND","Forno Microondas","un",469]
[null,"F020000719-EMBASA/BA","Freezer 246 l","un",1183.99]
[null,"029028-IOPES","Cilindro de Gás de Cozinha 45 kg","un",535.16999999999996]
[null,"4226-SINAPI/PE","Gás de cozinha-GLP","kg",4.97]
[null,"F020000716-EMBASA/BA","Geladeira 280 litros","un",789.33]
[null,"\t10232-ORSE/SE","Geladeira industrial 300 litros","un",1616.1]
[null,"COT_GPS","GPS com cabo e software (conforme especificação)","un",321.97000000000003]
[null,"COT_GUARDA_ROUPA","Guarda-Roupa 4 Portas","un",287.26333333333332]
[null,"COT_ROUPA_BANHO","Jogo de Roupa de banho 5 Peças","un",96.626666666666665]
[null,"COT_ROUPA_CAMA","Jogo de roupa de cama solteiro","un",147.63333333333333]
[null,"COT_LIQUID","Liquidificadores industriais","un",616.17333333333329]
[null,"COT_MAQ_LAVA_LOUCA","Máquina de lavar louças industrial","um",1050]
[null,"COT_MAQ_LAVA_ROUPA","Máquina de Lavar roupa 11kg","un",1450.0733333333335]
[null,"COT_MESA_BUF","Mesa buffets","un",1577.7033333333331]
[null,"COT_MESA_REFEIT","Mesa de refeitório 10 lugares com cadeiras","un",1280.48]
[null,"COT_MESA_REUN","Mesa de reunião 10 lugares com 10 cadeiras","un",3669.7433333333333]
[null,"COT_MESA_PVC","Mesa retangular em PVC","un",187.995]
[null,"COT_MESA_ESCR","Mesas de escritório com gavetas (conforme especificação)","un",390.96333333333331]
[null,"COT_PRATO","Pratos rasos","un",6.73]
[null,"F030000293-EMBASA/BA","Projetor multimídia (Datashow)","un",1270.25]
[null,"COT_RACK","Rack (sala)","un",210.29999999999998]
[null,"COT_REFRESQUEIRA","Refresqueira","un",1606.88]
[null,"COT_TABUA","Tábuas para carnes","un",91.596666666666678]
[null,"COT_TELEVISOR","Televisor LCD com 27,5\"","un",913.48333333333323]

{"sheet":"Mao_de_Obra","index":8,"n_rows":99,"n_cols":7,"rows_kept":99,"cut":false,"hidden":false,"merged":[[101,0,101,6],[84,0,84,4],[85,0,85,4],[86,0,86,4],[87,0,87,4],[84,5,84,6],[85,5,85,6],[86,5,86,6],[87,5,87,6],[88,0,88,6],[99,0,99,6],[100,0,100,6],[89,0,89,6],[90,0,91,6],[92,0,93,6],[94,0,94,6],[10,5,10,6],[12,2,12,6],[75,0,75,5],[10,0,11,0],[10,2,11,2],[10,3,11,3],[10,4,11,4],[10,1,11,1],[0,2,0,6],[1,2,1,6],[2,2,2,6],[4,0,5,6],[7,0,7,6],[78,0,78,6],[79,2,79,4],[79,5,79,6],[80,2,80,4],[80,5,80,6],[95,0,96,6],[97,0,97,6],[98,0,98,6],[81,0,81,4],[81,5,81,6]]}
[null,null,"Ministério do Desenvolvimento Regional  - MDR"]
[null,null,"Companhia de Desenvolvimento dos Vales do São Francisco e do Parnaíba"]
[null,null,"Gerência de Operação do PISF - Centro de Controle e Operação (AD / GOI / CCO)"]
[]
["SERVIÇOS DE OPERAÇÃO E MANUTENÇÃO DAS INFRAESTRUTURAS DO EIXO LESTE DO PROJETO DE INTEGRAÇÃO DO RIO SÃO FRANCISCO COM AS BACIAS HIDROGRÁFICAS DO NORDESTE SETENTRIONAL – PISF"]
[]
[]
["EQUIPE - MÃO DE OBRA"]
[]
[]
["ITEM","CÓDIGO","DESCRIÇÃO","UNIDADE","QUANTIDADE","VALOR (R$)"]
[{"$nulls":5},"UNITARIO","TOTAL"]
["1.",null,{"$f":"A8","v":"EQUIPE - MÃO DE OBRA"}]
["1.1",{"$f":"VLOOKUP(C14,'Mao_de_Obra (Total)'!B$15:C$108,2,FALSE)","v":"P0"},"Coordenador - Engenheiro Sênior (Civil / Eletricista / Mecânico) - Esp. Manutenção Sist Abast/Ger","homem x mês",{"$f":"SUMIF('Mao_de_Obra (Total)'!B$14:B$109,C14,'Mao_de_Obra (Total)'!F$14:F$109)","v":12},null,{"$f":"ROUND(E14*F14,2)","v":0}]
["1.2",{"$f":"VLOOKUP(C15,'Mao_de_Obra (Total)'!B$15:C$108,2,FALSE)","v":"A1"},"Assistente Administrativo","homem x mês",{"$f":"SUMIF('Mao_de_Obra (Total)'!B$14:B$109,C15,'Mao_de_Obra (Total)'!F$14:F$109)","v":12},null,0]
["1.3",{"$f":"VLOOKUP(C16,'Mao_de_Obra (Total)'!B$15:C$108,2,FALSE)","v":"A3"},"Auxiliar Administrativo","homem x mês",{"$f":"SUMIF('Mao_de_Obra (Total)'!B$14:B$109,C16,'Mao_de_Obra (Total)'!F$14:F$109)","v":48},null,0]
["1.4",{"$f":"VLOOKUP(C17,'Mao_de_Obra (Total)'!B$15:C$108,2,FALSE)","v":"P1"},"Coordenador Operação - Engenheiro Sênior (Civil / Eletricista / Mecânico) - Esp. Manutenção Sist Abast/Ger","homem x mês",{"$f":"SUMIF('Mao_de_Obra (Total)'!B$14:B$109,C17,'Mao_de_Obra (Total)'!F$14:F$109)","v":12},null,0]
["1.5",{"$f":"VLOOKUP(C18,'Mao_de_Obra (Total)'!B$15:C$108,2,FALSE)","v":"P1"},"Coordenador Manutenção - Engenheiro Sênior (Civil / Eletricista / Mecânico) - Esp. Manutenção Sist Abast/Ger","homem x mês",{"$f":"SUMIF('Mao_de_Obra (Total)'!B$14:B$109,C18,'Mao_de_Obra (Total)'!F$14:F$109)","v":12},null,0]
["1.6",{"$f":"VLOOKUP(C19,'Mao_de_Obra (Total)'!B$15:C$108,2,FALSE)","v":"AS"},"Coordenador - Chefe de Escritório","homem x mês",{"$f":"SUMIF('Mao_de_Obra (Total)'!B$14:B$109,C19,'Mao_de_Obra (Total)'!F$14:F$109)","v":12},null,0]
["1.7",{"$f":"VLOOKUP(C20,'Mao_de_Obra (Total)'!B$15:C$108,2,FALSE)","v":"T1"},"Técnico Pleno - Analista em Tecnologia da Informação","homem x mês",{"$f":"SUMIF('Mao_de_Obra (Total)'!B$14:B$109,C20,'Mao_de_Obra (Total)'!F$14:F$109)","v":12},null,0]
["1.8",{"$f":"VLOOKUP(C21,'Mao_de_Obra (Total)'!B$15:C$108,2,FALSE)","v":"A3"},"Motorista","homem x mês",{"$f":"SUMIF('Mao_de_Obra (Total)'!B$14:B$109,C21,'Mao_de_Obra (Total)'!F$14:F$109)","v":60},null,0]
["1.9",{"$f":"VLOOKUP(C22,'Mao_de_Obra (Total)'!B$15:C$108,2,FALSE)","v":"A1"},"Almoxarife","homem x mês",{"$f":"SUMIF('Mao_de_Obra (Total)'!B$14:B$109,C22,'Mao_de_Obra (Total)'!F$14:F$109)","v":12},null,0]
["1.10",{"$f":"VLOOKUP(C23,'Mao_de_Obra (Total)'!B$15:C$108,2,FALSE)","v":"A3"},"Auxiliar de Almoxarifado","homem x mês",{"$f":"SUMIF('Mao_de_Obra (Total)'!B$14:B$109,C23,'Mao_de_Obra (Total)'!F$14:F$109)","v":36},null,0]
["1.11",{"$f":"VLOOKUP(C24,'Mao_de_Obra (Total)'!B$15:C$108,2,FALSE)","v":"A4"},"Servente","homem x mês",{"$f":"SUMIF('Mao_de_Obra (Total)'!B$14:B$109,C24,'Mao_de_Obra (Total)'!F$14:F$109)","v":144},null,0]
["1.12",{"$f":"VLOOKUP(C25,'Mao_de_Obra (Total)'!B$15:C$108,2,FALSE)","v":"P1"},"Engenheiro de Segurança e Medicina do Trabalho","homem x mês",{"$f":"SUMIF('Mao_de_Obra (Total)'!B$14:B$109,C25,'Mao_de_Obra (Total)'!F$14:F$109)","v":12},null,0]
["1.13",{"$f":"VLOOKUP(C26,'Mao_de_Obra (Total)'!B$15:C$108,2,FALSE)","v":"T2"},"Técnico de Segurança e Medicina do Trabalho","homem x mês",{"$f":"SUMIF('Mao_de_Obra (Total)'!B$14:B$109,C26,'Mao_de_Obra (Total)'!F$14:F$109)","v":24},null,0]
["1.14",{"$f":"VLOOKUP(C27,'Mao_de_Obra (Total)'!B$15:C$108,2,FALSE)","v":"P1"},"Médico do Trabalho","homem x mês",{"$f":"SUMIF('Mao_de_Obra (Total)'!B$14:B$109,C27,'Mao_de_Obra (Total)'!F$14:F$109)","v":12},null,0]
["1.15",{"$f":"VLOOKUP(C28,'Mao_de_Obra (Total)'!B$15:C$108,2,FALSE)","v":"P1"},"Engenheiro Pleno - Civil - Especialista em Hidráulica","homem x mês",{"$f":"SUMIF('Mao_de_Obra (Total)'!B$14:B$109,C28,'Mao_de_Obra (Total)'!F$14:F$109)","v":12},null,0]
["1.16",{"$f":"VLOOKUP(C29,'Mao_de_Obra (Total)'!B$15:C$108,2,FALSE)","v":"P1"},"Engenheiro Pleno - Civil - Especialista em Hidrologia","homem x mês",{"$f":"SUMIF('Mao_de_Obra (Total)'!B$14:B$109,C29,'Mao_de_Obra (Total)'!F$14:F$109)","v":12},null,0]
["1.17",{"$f":"VLOOKUP(C30,'Mao_de_Obra (Total)'!B$15:C$108,2,FALSE)","v":"P3"},"Engenheiro Junior - Civil","homem x mês",{"$f":"SUMIF('Mao_de_Obra (Total)'!B$14:B$109,C30,'Mao_de_Obra (Total)'!F$14:F$109)","v":12},null,0]
["1.18",{"$f":"VLOOKUP(C31,'Mao_de_Obra (Total)'!B$15:C$108,2,FALSE)","v":"P1"},"Engenheiro Pleno - Eletricista","homem x mês",{"$f":"SUMIF('Mao_de_Obra (Total)'!B$14:B$109,C31,'Mao_de_Obra (Total)'!F$14:F$109)","v":12},null,0]
["1.19",{"$f":"VLOOKUP(C32,'Mao_de_Obra (Total)'!B$15:C$108,2,FALSE)","v":"P1"},"Engenheiro Pleno - Eletricista - Especialista em Equipamentos e Sistemas Elétricos","homem x mês",{"$f":"SUMIF('Mao_de_Obra (Total)'!B$14:B$109,C32,'Mao_de_Obra (Total)'!F$14:F$109)","v":12},null,0]
["1.20",{"$f":"VLOOKUP(C33,'Mao_de_Obra (Total)'!B$15:C$108,2,FALSE)","v":"P1"},"Engenheiro Pleno - Eletricista - Especialista em Subestação Pátio, L. Transmissão e L. Distribuição","homem x mês",{"$f":"SUMIF('Mao_de_Obra (Total)'!B$14:B$109,C33,'Mao_de_Obra (Total)'!F$14:F$109)","v":12},null,0]
["1.21",{"$f":"VLOOKUP(C34,'Mao_de_Obra (Total)'!B$15:C$108,2,FALSE)","v":"P1"},"Engenheiro Pleno - Eletricista - Especialista em Sistema de Proteção, Controle e Supervisão (SPCS)","homem x mês",{"$f":"SUMIF('Mao_de_Obra (Total)'!B$14:B$109,C34,'Mao_de_Obra (Total)'!F$14:F$109)","v":12},null,0]
["1.22",{"$f":"VLOOKUP(C35,'Mao_de_Obra (Total)'!B$15:C$108,2,FALSE)","v":"P1"},"Engenheiro Pleno - Mecânico","homem x mês",{"$f":"SUMIF('Mao_de_Obra (Total)'!B$14:B$109,C35,'Mao_de_Obra (Total)'!F$14:F$109)","v":12},null,0]
["1.23",{"$f":"VLOOKUP(C36,'Mao_de_Obra (Total)'!B$15:C$108,2,FALSE)","v":"P1"},"Engenheiro Pleno - Civil","homem x mês",{"$f":"SUMIF('Mao_de_Obra (Total)'!B$14:B$109,C36,'Mao_de_Obra (Total)'!F$14:F$109)","v":12},null,0]
["1.24",{"$f":"VLOOKUP(C37,'Mao_de_Obra (Total)'!B$15:C$108,2,FALSE)","v":"P1"},"Engenheiro Pleno - Mecatrônica - Especialista em Automação","homem x mês",{"$f":"SUMIF('Mao_de_Obra (Total)'!B$14:B$109,C37,'Mao_de_Obra (Total)'!F$14:F$109)","v":12},null,0]
["1.25",{"$f":"VLOOKUP(C38,'Mao_de_Obra (Total)'!B$15:C$108,2,FALSE)","v":"P1"},"Engenheiro Pleno - Telecomunicações","homem x mês",{"$f":"SUMIF('Mao_de_Obra (Total)'!B$14:B$109,C38,'Mao_de_Obra (Total)'!F$14:F$109)","v":12},null,0]
["1.26",{"$f":"VLOOKUP(C39,'Mao_de_Obra (Total)'!B$15:C$108,2,FALSE)","v":"T1"},"Técnico Pleno - Manutenção Elétrica -  Especialista em Equipamentos e Sistemas Elétricos","homem x mês",{"$f":"SUMIF('Mao_de_Obra (Total)'!B$14:B$109,C39,'Mao_de_Obra (Total)'!F$14:F$109)","v":12},null,0]
["1.27",{"$f":"VLOOKUP(C40,'Mao_de_Obra (Total)'!B$15:C$108,2,FALSE)","v":"T1"},"Técnico Pleno - Manutenção Elétrica -  Especialista em Subestação Pátio, L. Transmissão e L. Distribuição","homem x mês",{"$f":"SUMIF('Mao_de_Obra (Total)'!B$14:B$109,C40,'Mao_de_Obra (Total)'!F$14:F$109)","v":12},null,0]
["1.28",{"$f":"VLOOKUP(C41,'Mao_de_Obra (Total)'!B$15:C$108,2,FALSE)","v":"T1"},"Técnico Pleno - Manutenção Elétrica -  Especialista em Sistema de Proteção, Controle e Supervisão (SPCS)","homem x mês",{"$f":"SUMIF('Mao_de_Obra (Total)'!B$14:B$109,C41,'Mao_de_Obra (Total)'!F$14:F$109)","v":12},null,0]
["1.29",{"$f":"VLOOKUP(C42,'Mao_de_Obra (Total)'!B$15:C$108,2,FALSE)","v":"T1"},"Técnico Pleno - Manutenção Mecânica","homem x mês",{"$f":"SUMIF('Mao_de_Obra (Total)'!B$14:B$109,C42,'Mao_de_Obra (Total)'!F$14:F$109)","v":12},null,0]
["1.30",{"$f":"VLOOKUP(C43,'Mao_de_Obra (Total)'!B$15:C$108,2,FALSE)","v":"T1"},"Técnico Pleno - Manutenção Civil","homem x mês",{"$f":"SUMIF('Mao_de_Obra (Total)'!B$14:B$109,C43,'Mao_de_Obra (Total)'!F$14:F$109)","v":12},null,0]
["1.31",{"$f":"VLOOKUP(C44,'Mao_de_Obra (Total)'!B$15:C$108,2,FALSE)","v":"P1"},"Geólogo  (Geotecnia)","homem x mês",{"$f":"SUMIF('Mao_de_Obra (Total)'!B$14:B$109,C44,'Mao_de_Obra (Total)'!F$14:F$109)","v":12},null,0]
["1.32",{"$f":"VLOOKUP(C45,'Mao_de_Obra (Total)'!B$15:C$108,2,FALSE)","v":"T1"},"Técnico Pleno - Eletrotécnico - Operador Estação de Bombeamento - Diurno (inclusive adicional de periculosidade)","homem x mês",{"$f":"SUMIF('Mao_de_Obra (Total)'!B$14:B$109,C45,'Mao_de_Obra (Total)'!F$14:F$109)","v":216},null,0]
["1.33",{"$f":"VLOOKUP(C46,'Mao_de_Obra (Total)'!B$15:C$108,2,FALSE)","v":"T1"},"Técnico Pleno - Eletrotécnico - Operador Estação de Bombeamento - Noturno (inclusive adicional de periculosidade)","homem x mês",{"$f":"SUMIF('Mao_de_Obra (Total)'!B$14:B$109,C46,'Mao_de_Obra (Total)'!F$14:F$109)","v":216},null,0]
["1.34",{"$f":"VLOOKUP(C47,'Mao_de_Obra (Total)'!B$15:C$108,2,FALSE)","v":"T2"},"Técnico Junior - Mecânico - Operador Estação de Bombeamento - Diurno (inclusive adicional de periculosidade)","homem x mês",{"$f":"SUMIF('Mao_de_Obra (Total)'!B$14:B$109,C47,'Mao_de_Obra (Total)'!F$14:F$109)","v":216},null,0]
["1.35",{"$f":"VLOOKUP(C48,'Mao_de_Obra (Total)'!B$15:C$108,2,FALSE)","v":"T2"},"Técnico Junior - Mecânico - Operador Estação de Bombeamento - Noturno (inclusive adicional de periculosidade)","homem x mês",{"$f":"SUMIF('Mao_de_Obra (Total)'!B$14:B$109,C48,'Mao_de_Obra (Total)'!F$14:F$109)","v":216},null,0]
["1.36",{"$f":"VLOOKUP(C49,'Mao_de_Obra (Total)'!B$15:C$108,2,FALSE)","v":"T1"},"Técnico Pleno - Eletrotécnico - Operador Subestação - Diurno (inclusive adicional de periculosidade)","homem x mês",{"$f":"SUMIF('Mao_de_Obra (Total)'!B$14:B$109,C49,'Mao_de_Obra (Total)'!F$14:F$109)","v":216},null,0]
["1.37",{"$f":"VLOOKUP(C50,'Mao_de_Obra (Total)'!B$15:C$108,2,FALSE)","v":"T1"},"Técnico Pleno - Eletrotécnico - Operador Subestação - Noturno (inclusive adicional de periculosidade)","homem x mês",{"$f":"SUMIF('Mao_de_Obra (Total)'!B$14:B$109,C50,'Mao_de_Obra (Total)'!F$14:F$109)","v":216},null,0]
["1.38",{"$f":"VLOOKUP(C51,'Mao_de_Obra (Total)'!B$15:C$108,2,FALSE)","v":"T2"},"Técnico Junior - Eletrotécnico - Operador Subestação - Diurno (inclusive adicional de periculosidade)","homem x mês",{"$f":"SUMIF('Mao_de_Obra (Total)'!B$14:B$109,C51,'Mao_de_Obra (Total)'!F$14:F$109)","v":216},null,0]
["1.39",{"$f":"VLOOKUP(C52,'Mao_de_Obra (Total)'!B$15:C$108,2,FALSE)","v":"T2"},"Técnico Junior - Eletrotécnico - Operador Subestação - Noturno (inclusive adicional de periculosidade)","homem x mês",{"$f":"SUMIF('Mao_de_Obra (Total)'!B$14:B$109,C52,'Mao_de_Obra (Total)'!F$14:F$109)","v":216},null,0]
["1.40",{"$f":"VLOOKUP(C53,'Mao_de_Obra (Total)'!B$15:C$108,2,FALSE)","v":"T3"},"Técnico Auxiliar (inclusive adicional de periculosidade)","homem x mês",{"$f":"SUMIF('Mao_de_Obra (Total)'!B$14:B$109,C53,'Mao_de_Obra (Total)'!F$14:F$109)","v":204},null,0]
["1.41",{"$f":"VLOOKUP(C54,'Mao_de_Obra (Total)'!B$15:C$108,2,FALSE)","v":"T3"},"Técnico Auxiliar - Leiturista (inclusive adicional de periculosidade)","homem x mês",{"$f":"SUMIF('Mao_de_Obra (Total)'!B$14:B$109,C54,'Mao_de_Obra (Total)'!F$14:F$109)","v":48},null,0]
["1.42",{"$f":"VLOOKUP(C55,'Mao_de_Obra (Total)'!B$15:C$108,2,FALSE)","v":"T1"},"Técnico Pleno - Mecânico (inclusive adicional de periculosidade)","homem x mês",{"$f":"SUMIF('Mao_de_Obra (Total)'!B$14:B$109,C55,'Mao_de_Obra (Total)'!F$14:F$109)","v":36},null,0]
["1.43",{"$f":"VLOOKUP(C56,'Mao_de_Obra (Total)'!B$15:C$108,2,FALSE)","v":"T3"},"Técnico Auxiliar - Mecânico (inclusive adicional de periculosidade)","homem x mês",{"$f":"SUMIF('Mao_de_Obra (Total)'!B$14:B$109,C56,'Mao_de_Obra (Total)'!F$14:F$109)","v":48},null,0]
["1.44",{"$f":"VLOOKUP(C57,'Mao_de_Obra (Total)'!B$15:C$108,2,FALSE)","v":"T1"},"Técnico Pleno - Eletrotécnico - Especialista em Baixa e Média Tensão (inclusive adicional de periculosidade)","homem x mês",{"$f":"SUMIF('Mao_de_Obra (Total)'!B$14:B$109,C57,'Mao_de_Obra (Total)'!F$14:F$109)","v":36},null,0]
["1.45",{"$f":"VLOOKUP(C58,'Mao_de_Obra (Total)'!B$15:C$108,2,FALSE)","v":"T1"},"Eletrotécnico - Especialista Subestação 230 Kv (inclusive adicional de periculosidade)","homem x mês",{"$f":"SUMIF('Mao_de_Obra (Total)'!B$14:B$109,C58,'Mao_de_Obra (Total)'!F$14:F$109)","v":12},null,0]
["1.46",{"$f":"VLOOKUP(C59,'Mao_de_Obra (Total)'!B$15:C$108,2,FALSE)","v":"T3"},"Eletricista (inclusive adicional de periculosidade)","homem x mês",{"$f":"SUMIF('Mao_de_Obra (Total)'!B$14:B$109,C59,'Mao_de_Obra (Total)'!F$14:F$109)","v":60},null,0]
["1.47",{"$f":"VLOOKUP(C60,'Mao_de_Obra (Total)'!B$15:C$108,2,FALSE)","v":"T1"},"Eletrotécnico - Especialista Inspeção em Linha de Transmissão 230 / 269 Kv (inclusive adicional de periculosidade)","homem x mês",{"$f":"SUMIF('Mao_de_Obra (Total)'!B$14:B$109,C60,'Mao_de_Obra (Total)'!F$14:F$109)","v":12},null,0]
["1.48",{"$f":"VLOOKUP(C61,'Mao_de_Obra (Total)'!B$15:C$108,2,FALSE)","v":"T4"},"Auxiliar Eletrotécnico (inclusive adicional de periculosidade)","homem x mês",{"$f":"SUMIF('Mao_de_Obra (Total)'!B$14:B$109,C61,'Mao_de_Obra (Total)'!F$14:F$109)","v":12},null,0]
["1.49",{"$f":"VLOOKUP(C62,'Mao_de_Obra (Total)'!B$15:C$108,2,FALSE)","v":"T1"},"Eletrotécnico - Especialista em Linha de Distribuição 13,8 Kv (inclusive adicional de periculosidade)","homem x mês",{"$f":"SUMIF('Mao_de_Obra (Total)'!B$14:B$109,C62,'Mao_de_Obra (Total)'!F$14:F$109)","v":12},null,0]
["1.50",{"$f":"VLOOKUP(C63,'Mao_de_Obra (Total)'!B$15:C$108,2,FALSE)","v":"T1"},"Técnico Automação - Especialista em SDSC (inclusive adicional de periculosidade)","homem x mês",{"$f":"SUMIF('Mao_de_Obra (Total)'!B$14:B$109,C63,'Mao_de_Obra (Total)'!F$14:F$109)","v":36},null,0]
["1.51",{"$f":"VLOOKUP(C64,'Mao_de_Obra (Total)'!B$15:C$108,2,FALSE)","v":"T1"},"Eletrotécnico - Especialista em SPCS (inclusive adicional de periculosidade)","homem x mês",{"$f":"SUMIF('Mao_de_Obra (Total)'!B$14:B$109,C64,'Mao_de_Obra (Total)'!F$14:F$109)","v":12},null,0]
["1.52",{"$f":"VLOOKUP(C65,'Mao_de_Obra (Total)'!B$15:C$108,2,FALSE)","v":"T1"},"Técnico Telecomunicações/Eletrônica (inclusive adicional de periculosidade)","homem x mês",{"$f":"SUMIF('Mao_de_Obra (Total)'!B$14:B$109,C65,'Mao_de_Obra (Total)'!F$14:F$109)","v":12},null,0]
["1.53",{"$f":"VLOOKUP(C66,'Mao_de_Obra (Total)'!B$15:C$108,2,FALSE)","v":"T1"},"Técnico Pleno - Encarregado de Campo (inclusive adicional de periculosidade)","homem x mês",{"$f":"SUMIF('Mao_de_Obra (Total)'!B$14:B$109,C66,'Mao_de_Obra (Total)'!F$14:F$109)","v":36},null,0]
["1.54",{"$f":"VLOOKUP(C67,'Mao_de_Obra (Total)'!B$15:C$108,2,FALSE)","v":"T2"},"Tecnico Edificações - Inspeção (inclusive adicional de periculosidade)","homem x mês",{"$f":"SUMIF('Mao_de_Obra (Total)'!B$14:B$109,C67,'Mao_de_Obra (Total)'!F$14:F$109)","v":36},null,0]
["1.55",{"$f":"VLOOKUP(C68,'Mao_de_Obra (Total)'!B$15:C$108,2,FALSE)","v":"T2"},"Técnico Junior - Cadista","homem x mês",{"$f":"SUMIF('Mao_de_Obra (Total)'!B$14:B$109,C68,'Mao_de_Obra (Total)'!F$14:F$109)","v":36},null,{"$f":"ROUND(E68*F68,2)","v":0}]
["1.56",{"$f":"VLOOKUP(C69,'Mao_de_Obra (Total)'!B$15:C$108,2,FALSE)","v":"T1"},"Topógrafo (inclusive adicional de periculosidade)","homem x mês",{"$f":"SUMIF('Mao_de_Obra (Total)'!B$14:B$109,C69,'Mao_de_Obra (Total)'!F$14:F$109)","v":12},null,0]
["1.57",{"$f":"VLOOKUP(C70,'Mao_de_Obra (Total)'!B$15:C$108,2,FALSE)","v":"T4"},"Auxiliar de Topografia (inclusive adicional de periculosidade)","homem x mês",{"$f":"SUMIF('Mao_de_Obra (Total)'!B$14:B$109,C70,'Mao_de_Obra (Total)'!F$14:F$109)","v":24},null,0]
["1.58",{"$f":"VLOOKUP(C71,'Mao_de_Obra (Total)'!B$15:C$108,2,FALSE)","v":"T3"},"Carpinteiro (inclusive adicional de periculosidade)","homem x mês",{"$f":"SUMIF('Mao_de_Obra (Total)'!B$14:B$109,C71,'Mao_de_Obra (Total)'!F$14:F$109)","v":36},null,0]
["1.59",{"$f":"VLOOKUP(C72,'Mao_de_Obra (Total)'!B$15:C$108,2,FALSE)","v":"T3"},"Ferreiro (inclusive adicional de periculosidade)","homem x mês",{"$f":"SUMIF('Mao_de_Obra (Total)'!B$14:B$109,C72,'Mao_de_Obra (Total)'!F$14:F$109)","v":36},null,0]
["1.60",{"$f":"VLOOKUP(C73,'Mao_de_Obra (Total)'!B$15:C$108,2,FALSE)","v":"T3"},"Pedreiro (inclusive adicional de periculosidade)","homem x mês",{"$f":"SUMIF('Mao_de_Obra (Total)'!B$14:B$109,C73,'Mao_de_Obra (Total)'!F$14:F$109)","v":84},null,0]
["1.61",{"$f":"VLOOKUP(C74,'Mao_de_Obra (Total)'!B$15:C$108,2,FALSE)","v":"A4"},"Servente (inclusive adicional de periculosidade)","homem x mês",{"$f":"SUMIF('Mao_de_Obra (Total)'!B$14:B$109,C74,'Mao_de_Obra (Total)'!F$14:F$109)","v":756},null,0]
[]
[{"$f":"\"TOTAL - \"&C13&\" - (R$):\"","v":"TOTAL - EQUIPE - MÃO DE OBRA - (R$):"},{"$nulls":5},{"$f":"SUBTOTAL(9,G13:G75)","v":0}]
[]
[]
[{"$f":"\"RESUMO - \"&A$8","v":"RESUMO - EQUIPE - MÃO DE OBRA"}]
["ITEM",null,"DESCRIÇÃO",null,null,"VALOR TOTAL (R$)"]
[1,null,{"$f":"C13","v":"EQUIPE - MÃO DE OBRA"},null,null,{"$f":"G76","v":0}]
[{"$f":"\"TOTAL GERAL - \"&A$8&\" -  (R$):\"","v":"TOTAL GERAL - EQUIPE - MÃO DE OBRA -  (R$):"},{"$nulls":4},{"$f":"SUM(F81:G81)","v":0}]
[]
[]
["NOME DO INFORMANTE:",{"$nulls":4},"QUALIFICAÇÃO:"]
[]
["ASSINATURA:",{"$nulls":4},"DATA:"]
[]
["OBSERVAÇÕES:"]
["1. Considerado a carga horária de 176 horas/mês"]
["2. Os cálculos de cada parcela que compõe o salário completo foram calculadas isoladamente. (Salário Base + Adicional de Periculosidade (quando houver) + Adicional Noturno (quando houver) + Adicional de Horas Extras (quando houver) +  Encargos Sociais)"]
[]
["3. Adicional de Periculosidade 30%: foi previsto para todos os profissionais eletricitários (Operação e Manutenção) que trabalham em contato com rede elétrica (nas estações de bombeamento, sub-estações, etc.) "]
[]
["4. Hora Noturna: Hora Diurna x 20%"]
["5. Adicional Noturno: *Considerado 120 horas/profissional/mês (Total de 8h noturnas: Período de 22h as 5h = 8h noturnas + 1h até as 6h => Súmula 60 do TST)    *(Incide sobre Salário Base + Periculosidade => Súmula 191 do TST)"]
[]
["6. Período noturno – 22 às 5 horas, o valor da hora tem 52 minutos e 30 segundos; logo, nesse período, há 8 horas"]
["7. Foi considerado intervalo intrajornada para todos os profissionais que trabalham em escala 12h x 36h "]

{"sheet":"Mao_de_Obra (Total)","index":9,"n_rows":125,"n_cols":33,"rows_kept":125,"cut":false,"hidden":false,"merged":[[126,0,126,21],[117,0,117,21],[118,0,118,21],[116,0,116,21],[119,0,119,21],[120,0,120,21],[121,0,121,21],[122,0,122,21],[123,0,123,21],[124,0,124,21],[111,0,112,19],[111,20,112,21],[113,0,114,19],[113,20,114,21],[125,0,125,21],[115,0,115,21],[0,2,0,21],[1,2,1,21],[2,2,2,21],[4,0,5,21],[11,23,12,23],[10,6,10,15],[7,0,7,21],[10,16,10,21],[11,21,12,21],[11,19,12,19],[11,18,12,18],[11,8,11,9],[11,10,11,11],[11,12,11,13],[11,27,12,27],[11,28,12,28],[11,29,12,29],[11,30,12,30],[11,32,12,32],[11,31,12,31],[10,25,10,26],[11,25,12,25],[11,26,12,26],[10,23,10,24],[10,0,12,0],[10,1,12,1],[10,2,12,2],[10,3,12,3],[10,4,11,5],[11,6,12,6],[11,15,12,15],[11,16,12,16],[11,24,12,24]]}
[null,null,"Ministério do Desenvolvimento Regional  - MDR"]
[null,null,"Companhia de Desenvolvimento dos Vales do São Francisco e do Parnaíba"]
[null,null,"Gerência de Operação do PISF - Centro de Controle e Operação (AD / GOI / CCO)"]
[]
["SERVIÇOS DE OPERAÇÃO E MANUTENÇÃO DAS INFRAESTRUTURAS DO EIXO LESTE DO PROJETO DE INTEGRAÇÃO DO RIO SÃO FRANCISCO COM AS BACIAS HIDROGRÁFICAS DO NORDESTE SETENTRIONAL – PISF"]
[]
[]
["MÃO DE OBRA - TOTAL"]
[]
[]
["ITEM","DESCRIÇÃO","CLASSE","Prazo (Mês)","Quantidade (undxmês)",null,"SALÁRIOS MENSAL (R$)",{"$nulls":9},"SALÁRIOS TOTAL (R$)",{"$nulls":6},"Original Total",null,"Original Eixo Leste",null,"Proposta atual"]
[{"$nulls":6},"SALÁRIO BASE (Sem Encargo)","Periculosidade ","Adicional Noturno",null,"Hora Extra 100%",null,"Hora Extra 50%",null,"Encargos Sociais","SALÁRIO COMPLETO (Incluindo: encargos, benefícios, adicionais e horas extras)","SALÁRIO BASE (Sem Encargo)","Periculosidade","Adicional Noturno (c/ intrajornada)","Horas Extras","Encargos Sociais","SALÁRIO COMPLETO (Incluindo: encargos, adicionais e horas extras)",null,"Quantitativo","Diferença","Quantitativo","Diferença","Total","Coordenação (à definir)","Lote 09 (Floresta/PE)","Lote 10 (Custódia/PE)","Lote 12 (Sertânia/PE)","Eixo Norte"]
[{"$nulls":4},"Unitária","Total",null,0.3,"Valor da Hora Noturna","Valor do Adicional Noturno (c/ intrajornada)","Valor Unitário","Valor Mensal (2,5% da quant. de horas /mês)","Valor Unitário","Valor Mensal (5% da quant. de horas /mês)",{"$f":"'Encargos Sociais e Benefícios'!$C$66","v":0.77166480000000015},null,null,{"$f":"H13","v":0.3},null,null,{"$f":"O13","v":0.77166480000000015}]
["1.","COORDENAÇÃO GERAL"]
["1.1","Coordenador - Engenheiro Sênior (Civil / Eletricista / Mecânico) - Esp. Manutenção Sist Abast/Ger","P0",12,{"$f":"AB15","v":1},{"$f":"D15*E15","v":12},null,0,0,0,0,0,0,0,{"$f":"ROUND((G15+H15+J15+L15+N15)*$O$13,2)","v":0},{"$f":"G15+H15+J15+L15+N15+O15","v":0},{"$f":"ROUND(F15*G15,2)","v":0},{"$f":"ROUND(F15*H15,2)","v":0},{"$f":"ROUND(F15*J15,2)","v":0},{"$f":"ROUND((F15*L15)+(F15*N15),2)","v":0},{"$f":"ROUND(F15*O15,2)","v":0},{"$f":"ROUND(F15*P15,2)","v":0},null,1,{"$f":"AB15-$X15","v":0},1,{"$f":"AB15-Z15","v":0},{"$f":"SUM(AC15:AG15)","v":1},1,0,0,0,0]
["1.2","Assistente Administrativo","A1",{"$f":"D$15","v":12},{"$f":"AB16","v":1},{"$f":"D16*E16","v":12},null,0,0,0,0,0,0,0,{"$f":"ROUND((G16+H16+J16+L16+N16)*$O$13,2)","v":0},{"$f":"G16+H16+J16+L16+N16+O16","v":0},{"$f":"ROUND(F16*G16,2)","v":0},{"$f":"ROUND(F16*H16,2)","v":0},{"$f":"ROUND(F16*J16,2)","v":0},{"$f":"ROUND((F16*L16)+(F16*N16),2)","v":0},{"$f":"ROUND(F16*O16,2)","v":0},{"$f":"ROUND(F16*P16,2)","v":0},null,1,{"$f":"AB16-$X16","v":0},1,{"$f":"AB16-Z16","v":0},{"$f":"SUM(AC16:AG16)","v":1},1,0,0,0,0]
["1.3","Auxiliar Administrativo","A3",{"$f":"D$15","v":12},{"$f":"AB17","v":1},{"$f":"D17*E17","v":12},null,0,0,0,0,0,0,0,{"$f":"ROUND((G17+H17+J17+L17+N17)*$O$13,2)","v":0},{"$f":"G17+H17+J17+L17+N17+O17","v":0},{"$f":"ROUND(F17*G17,2)","v":0},{"$f":"ROUND(F17*H17,2)","v":0},{"$f":"ROUND(F17*J17,2)","v":0},{"$f":"ROUND((F17*L17)+(F17*N17),2)","v":0},{"$f":"ROUND(F17*O17,2)","v":0},{"$f":"ROUND(F17*P17,2)","v":0},null,1,{"$f":"AB17-$X17","v":0},1,{"$f":"AB17-Z17","v":0},{"$f":"SUM(AC17:AG17)","v":1},1,0,0,0,0]
["2.","COORDENAÇÃO DA OPERAÇÃO"]
["2.1","Coordenador Operação - Engenheiro Sênior (Civil / Eletricista / Mecânico) - Esp. Manutenção Sist Abast/Ger","P1",{"$f":"D$15","v":12},{"$f":"AB19","v":1},{"$f":"D19*E19","v":12},null,0,0,0,0,0,0,0,{"$f":"ROUND((G19+H19+J19+L19+N19)*$O$13,2)","v":0},{"$f":"G19+H19+J19+L19+N19+O19","v":0},{"$f":"ROUND(F19*G19,2)","v":0},{"$f":"ROUND(F19*H19,2)","v":0},{"$f":"ROUND(F19*J19,2)","v":0},{"$f":"ROUND((F19*L19)+(F19*N19),2)","v":0},{"$f":"ROUND(F19*O19,2)","v":0},{"$f":"ROUND(F19*P19,2)","v":0},null,1,{"$f":"AB19-$X19","v":0},1,{"$f":"AB19-Z19","v":0},{"$f":"SUM(AC19:AG19)","v":1},1,0,0,0,0]
["2.2","Auxiliar Administrativo","A3",12,{"$f":"AB20","v":1},{"$f":"D20*E20","v":12},null,0,0,0,0,0,0,0,{"$f":"ROUND((G20+H20+J20+L20+N20)*$O$13,2)","v":0},{"$f":"G20+H20+J20+L20+N20+O20","v":0},{"$f":"ROUND(F20*G20,2)","v":0},{"$f":"ROUND(F20*H20,2)","v":0},{"$f":"ROUND(F20*J20,2)","v":0},{"$f":"ROUND((F20*L20)+(F20*N20),2)","v":0},{"$f":"ROUND(F20*O20,2)","v":0},{"$f":"ROUND(F20*P20,2)","v":0},null,2,{"$f":"AB20-$X20","v":-1},2,{"$f":"AB20-Z20","v":-1},{"$f":"SUM(AC20:AG20)","v":1},1,0,0,0,0]
["3.","COORDENAÇÃO DA MANUTENÇÃO"]
["3.1","Coordenador Manutenção - Engenheiro Sênior (Civil / Eletricista / Mecânico) - Esp. Manutenção Sist Abast/Ger","P1",{"$f":"D$15","v":12},{"$f":"AB22","v":1},{"$f":"D22*E22","v":12},null,0,0,0,0,0,0,0,{"$f":"ROUND((G22+H22+J22+L22+N22)*$O$13,2)","v":0},{"$f":"G22+H22+J22+L22+N22+O22","v":0},{"$f":"ROUND(F22*G22,2)","v":0},{"$f":"ROUND(F22*H22,2)","v":0},{"$f":"ROUND(F22*J22,2)","v":0},{"$f":"ROUND((F22*L22)+(F22*N22),2)","v":0},{"$f":"ROUND(F22*O22,2)","v":0},{"$f":"ROUND(F22*P22,2)","v":0},null,1,{"$f":"AB22-$X22","v":0},1,{"$f":"AB22-Z22","v":0},{"$f":"SUM(AC22:AG22)","v":1},1,0,0,0,0]
["3.2","Auxiliar Administrativo","A3",12,{"$f":"AB23","v":1},{"$f":"D23*E23","v":12},null,0,0,0,0,0,0,0,{"$f":"ROUND((G23+H23+J23+L23+N23)*$O$13,2)","v":0},{"$f":"G23+H23+J23+L23+N23+O23","v":0},{"$f":"ROUND(F23*G23,2)","v":0},{"$f":"ROUND(F23*H23,2)","v":0},{"$f":"ROUND(F23*J23,2)","v":0},{"$f":"ROUND((F23*L23)+(F23*N23),2)","v":0},{"$f":"ROUND(F23*O23,2)","v":0},{"$f":"ROUND(F23*P23,2)","v":0},null,2,{"$f":"AB23-$X23","v":-1},2,{"$f":"AB23-Z23","v":-1},{"$f":"SUM(AC23:AG23)","v":1},1,0,0,0,0]
["4.","COORDENAÇÃO ADMINISTRAÇÃO E LOGÍSTICA"]
["4.1","Coordenador - Chefe de Escritório","AS",{"$f":"D$15","v":12},{"$f":"AB25","v":1},{"$f":"D25*E25","v":12},null,0,0,0,0,0,0,0,{"$f":"ROUND((G25+H25+J25+L25+N25)*$O$13,2)","v":0},{"$f":"G25+H25+J25+L25+N25+O25","v":0},{"$f":"ROUND(F25*G25,2)","v":0},{"$f":"ROUND(F25*H25,2)","v":0},{"$f":"ROUND(F25*J25,2)","v":0},{"$f":"ROUND((F25*L25)+(F25*N25),2)","v":0},{"$f":"ROUND(F25*O25,2)","v":0},{"$f":"ROUND(F25*P25,2)","v":0},null,1,{"$f":"AB25-$X25","v":0},1,{"$f":"AB25-Z25","v":0},{"$f":"SUM(AC25:AG25)","v":1},1,0,0,0,0]
["4.2","Auxiliar Administrativo","A3",12,1,12,null,0,0,0,0,0,0,0,0,0,0,0,0,0,0,0,null,2,-1,2,-1,1,1,0,0,0,0]
["4.3","Técnico Pleno - Analista em Tecnologia da Informação","T1",12,1,12,null,0,0,0,0,0,0,0,0,0,0,0,0,0,0,0,null,1,0,1,0,1,1,0,0,0,0]
["4.4","Técnico em Tecnologia da Informação","T2",12,0,0,null,0,0,0,0,0,0,0,0,0,0,0,0,0,0,0,null,1,-1,1,-1,0,0,0,0,0,0]
["4.5","Motorista","A3",12,5,60,null,0,0,0,0,0,0,0,0,0,0,0,0,0,0,0,null,9,-4,5,0,5,2,1,1,1,0]
["4.6","Almoxarife","A1",12,1,12,null,0,0,0,0,0,0,0,0,0,0,0,0,0,0,0,null,2,-1,1,0,1,1,0,0,0,0]
["4.7","Auxiliar de Almoxarifado","A3",12,3,36,null,0,0,0,0,0,0,0,0,0,0,0,0,0,0,0,null,3,0,3,0,3,0,1,1,1,0]
["4.8","Servente","A4",12,12,144,null,0,0,0,0,0,0,0,0,0,0,0,0,0,0,0,null,6,6,6,6,12,0,4,4,4,0]
["5.","COORDENAÇÃO SEGURANÇA E MEDICINA DO TRABALHO"]
["5.1","Engenheiro de Segurança e Medicina do Trabalho","P1",{"$f":"D$15","v":12},{"$f":"AB34","v":1},{"$f":"D34*E34","v":12},null,0,0,0,0,0,0,0,{"$f":"ROUND((G34+H34+J34+L34+N34)*$O$13,2)","v":0},{"$f":"G34+H34+J34+L34+N34+O34","v":0},{"$f":"ROUND(F34*G34,2)","v":0},{"$f":"ROUND(F34*H34,2)","v":0},{"$f":"ROUND(F34*J34,2)","v":0},{"$f":"ROUND((F34*L34)+(F34*N34),2)","v":0},{"$f":"ROUND(F34*O34,2)","v":0},{"$f":"ROUND(F34*P34,2)","v":0},null,1,{"$f":"AB34-$X34","v":0},1,{"$f":"AB34-Z34","v":0},{"$f":"SUM(AC34:AG34)","v":1},1,0,0,0,0]
["5.2","Técnico de Segurança e Medicina do Trabalho","T2",12,{"$f":"AB35","v":2},{"$f":"D35*E35","v":24},null,0,0,0,0,0,0,0,{"$f":"ROUND((G35+H35+J35+L35+N35)*$O$13,2)","v":0},{"$f":"G35+H35+J35+L35+N35+O35","v":0},{"$f":"ROUND(F35*G35,2)","v":0},{"$f":"ROUND(F35*H35,2)","v":0},{"$f":"ROUND(F35*J35,2)","v":0},{"$f":"ROUND((F35*L35)+(F35*N35),2)","v":0},{"$f":"ROUND(F35*O35,2)","v":0},{"$f":"ROUND(F35*P35,2)","v":0},null,7,{"$f":"AB35-$X35","v":-5},3,{"$f":"AB35-Z35","v":-1},{"$f":"SUM(AC35:AG35)","v":2},2,0,0,0,0]
["5.3","Médico do Trabalho","P1",12,{"$f":"AB36","v":1},{"$f":"D36*E36","v":12},null,0,0,0,0,0,0,0,{"$f":"ROUND((G36+H36+J36+L36+N36)*$O$13,2)","v":0},{"$f":"G36+H36+J36+L36+N36+O36","v":0},{"$f":"ROUND(F36*G36,2)","v":0},{"$f":"ROUND(F36*H36,2)","v":0},{"$f":"ROUND(F36*J36,2)","v":0},{"$f":"ROUND((F36*L36)+(F36*N36),2)","v":0},{"$f":"ROUND(F36*O36,2)","v":0},{"$f":"ROUND(F36*P36,2)","v":0},null,1,{"$f":"AB36-$X36","v":0},1,{"$f":"AB36-Z36","v":0},{"$f":"SUM(AC36:AG36)","v":1},1,0,0,0,0]
["6.","PLANEJAMENTO E CONTROLE DA OPERAÇÃO"]
["6.1","Engenheiro Pleno - Civil - Especialista em Hidráulica","P1",{"$f":"D$15","v":12},{"$f":"AB38","v":1},{"$f":"D38*E38","v":12},null,0,0,0,0,0,0,0,{"$f":"ROUND((G38+H38+J38+L38+N38)*$O$13,2)","v":0},{"$f":"G38+H38+J38+L38+N38+O38","v":0},{"$f":"ROUND(F38*G38,2)","v":0},{"$f":"ROUND(F38*H38,2)","v":0},{"$f":"ROUND(F38*J38,2)","v":0},{"$f":"ROUND((F38*L38)+(F38*N38),2)","v":0},{"$f":"ROUND(F38*O38,2)","v":0},{"$f":"ROUND(F38*P38,2)","v":0},null,1,{"$f":"AB38-$X38","v":0},1,{"$f":"AB38-Z38","v":0},{"$f":"SUM(AC38:AG38)","v":1},1,0,0,0,0]
["6.2","Engenheiro Pleno - Civil - Especialista em Hidrologia","P1",12,{"$f":"AB39","v":1},{"$f":"D39*E39","v":12},null,0,0,0,0,0,0,0,{"$f":"ROUND((G39+H39+J39+L39+N39)*$O$13,2)","v":0},{"$f":"G39+H39+J39+L39+N39+O39","v":0},{"$f":"ROUND(F39*G39,2)","v":0},{"$f":"ROUND(F39*H39,2)","v":0},{"$f":"ROUND(F39*J39,2)","v":0},{"$f":"ROUND((F39*L39)+(F39*N39),2)","v":0},{"$f":"ROUND(F39*O39,2)","v":0},{"$f":"ROUND(F39*P39,2)","v":0},null,1,{"$f":"AB39-$X39","v":0},1,{"$f":"AB39-Z39","v":0},{"$f":"SUM(AC39:AG39)","v":1},1,0,0,0,0]
["6.3","Engenheiro Junior - Civil","P3",12,{"$f":"AB40","v":1},{"$f":"D40*E40","v":12},null,0,0,0,0,0,0,0,{"$f":"ROUND((G40+H40+J40+L40+N40)*$O$13,2)","v":0},{"$f":"G40+H40+J40+L40+N40+O40","v":0},{"$f":"ROUND(F40*G40,2)","v":0},{"$f":"ROUND(F40*H40,2)","v":0},{"$f":"ROUND(F40*J40,2)","v":0},{"$f":"ROUND((F40*L40)+(F40*N40),2)","v":0},{"$f":"ROUND(F40*O40,2)","v":0},{"$f":"ROUND(F40*P40,2)","v":0},null,2,{"$f":"AB40-$X40","v":-1},1,{"$f":"AB40-Z40","v":0},{"$f":"SUM(AC40:AG40)","v":1},1,0,0,0,0]
["6.4","Engenheiro Pleno - Eletricista","P1",12,{"$f":"AB41","v":1},{"$f":"D41*E41","v":12},null,0,0,0,0,0,0,0,{"$f":"ROUND((G41+H41+J41+L41+N41)*$O$13,2)","v":0},{"$f":"G41+H41+J41+L41+N41+O41","v":0},{"$f":"ROUND(F41*G41,2)","v":0},{"$f":"ROUND(F41*H41,2)","v":0},{"$f":"ROUND(F41*J41,2)","v":0},{"$f":"ROUND((F41*L41)+(F41*N41),2)","v":0},{"$f":"ROUND(F41*O41,2)","v":0},{"$f":"ROUND(F41*P41,2)","v":0},null,1,{"$f":"AB41-$X41","v":0},1,{"$f":"AB41-Z41","v":0},{"$f":"SUM(AC41:AG41)","v":1},1,0,0,0,0]
["6.5","Engenheiro Junior - Eletricista","P3",12,{"$f":"AB42","v":0},{"$f":"D42*E42","v":0},null,0,0,0,0,0,0,0,{"$f":"ROUND((G42+H42+J42+L42+N42)*$O$13,2)","v":0},{"$f":"G42+H42+J42+L42+N42+O42","v":0},{"$f":"ROUND(F42*G42,2)","v":0},{"$f":"ROUND(F42*H42,2)","v":0},{"$f":"ROUND(F42*J42,2)","v":0},{"$f":"ROUND((F42*L42)+(F42*N42),2)","v":0},{"$f":"ROUND(F42*O42,2)","v":0},{"$f":"ROUND(F42*P42,2)","v":0},null,1,{"$f":"AB42-$X42","v":-1},1,{"$f":"AB42-Z42","v":-1},{"$f":"SUM(AC42:AG42)","v":0},0,0,0,0,0]
["7.","PLANEJAMENTO E CONTROLE DA MANUTENÇÃO"]
["7.1","Engenheiro Pleno - Eletricista - Especialista em Equipamentos e Sistemas Elétricos","P1",{"$f":"D$15","v":12},{"$f":"AB44","v":1},{"$f":"D44*E44","v":12},null,0,0,0,0,0,0,0,{"$f":"ROUND((G44+H44+J44+L44+N44)*$O$13,2)","v":0},{"$f":"G44+H44+J44+L44+N44+O44","v":0},{"$f":"ROUND(F44*G44,2)","v":0},{"$f":"ROUND(F44*H44,2)","v":0},{"$f":"ROUND(F44*J44,2)","v":0},{"$f":"ROUND((F44*L44)+(F44*N44),2)","v":0},{"$f":"ROUND(F44*O44,2)","v":0},{"$f":"ROUND(F44*P44,2)","v":0},null,1,{"$f":"AB44-$X44","v":0},1,{"$f":"AB44-Z44","v":0},{"$f":"SUM(AC44:AG44)","v":1},1,0,0,0,0]
["7.2","Engenheiro Pleno - Eletricista - Especialista em Subestação Pátio, L. Transmissão e L. Distribuição","P1",12,1,12,null,0,0,0,0,0,0,0,0,0,0,0,0,0,0,0,null,1,0,1,0,1,1,0,0,0,0]
["7.3","Engenheiro Pleno - Eletricista - Especialista em Sistema de Proteção, Controle e Supervisão (SPCS)","P1",12,1,12,null,0,0,0,0,0,0,0,0,0,0,0,0,0,0,0,null,1,0,1,0,1,1,0,0,0,0]
["7.4","Engenheiro Junior - Eletricista","P3",12,0,0,null,0,0,0,0,0,0,0,0,0,0,0,0,0,0,0,null,2,-2,1,-1,0,0,0,0,0,0]
["7.5","Engenheiro Pleno - Mecânico","P1",12,1,12,null,0,0,0,0,0,0,0,0,0,0,0,0,0,0,0,null,2,-1,1,0,1,1,0,0,0,0]
["7.6","Engenheiro Junior - Mecânico","P3",12,0,0,null,0,0,0,0,0,0,0,0,0,0,0,0,0,0,0,null,2,-2,1,-1,0,0,0,0,0,0]
["7.7","Engenheiro Pleno - Civil","P1",12,1,12,null,0,0,0,0,0,0,0,0,0,0,0,0,0,0,0,null,2,-1,1,0,1,1,0,0,0,0]
["7.8","Engenheiro Junior - Civil","P3",12,0,0,null,0,0,0,0,0,0,0,0,0,0,0,0,0,0,0,null,2,-2,1,-1,0,0,0,0,0,0]
["7.9","Engenheiro Pleno - Mecatrônica - Especialista em Automação","P1",12,1,12,null,0,0,0,0,0,0,0,0,0,0,0,0,0,0,0,null,1,0,1,0,1,1,0,0,0,0]
["7.10","Engenheiro Junior - Telecomunicações -  Especialista em Automação","P3",12,0,0,null,0,0,0,0,0,0,0,0,0,0,0,0,0,0,0,null,1,-1,1,-1,0,0,0,0,0,0]
["7.11","Engenheiro Pleno - Telecomunicações","P1",12,1,12,null,0,0,0,0,0,0,0,0,0,0,0,0,0,0,0,null,1,0,1,0,1,1,0,0,0,0]
["7.12","Técnico Pleno - Manutenção Elétrica -  Especialista em Equipamentos e Sistemas Elétricos","T1",12,1,12,null,0,0,0,0,0,0,0,0,0,0,0,0,0,0,0,null,2,-1,2,-1,1,1,0,0,0,0]
["7.13","Técnico Pleno - Manutenção Elétrica -  Especialista em Subestação Pátio, L. Transmissão e L. Distribuição","T1",12,1,12,null,0,0,0,0,0,0,0,0,0,0,0,0,0,0,0,null,1,0,1,0,1,1,0,0,0,0]
["7.14","Técnico Pleno - Manutenção Elétrica -  Especialista em Sistema de Proteção, Controle e Supervisão (SPCS)","T1",12,1,12,null,0,0,0,0,0,0,0,0,0,0,0,0,0,0,0,null,1,0,1,0,1,1,0,0,0,0]
["7.15","Técnico Pleno - Manutenção Mecânica","T1",12,1,12,null,0,0,0,0,0,0,0,0,0,0,0,0,0,0,0,null,4,-3,2,-1,1,1,0,0,0,0]
["7.16","Técnico Pleno - Manutenção Civil","T1",12,1,12,null,0,0,0,0,0,0,0,0,0,0,0,0,0,0,0,null,4,-3,2,-1,1,1,0,0,0,0]
["7.17","Geólogo  (Geotecnia)","P1",12,1,12,null,0,0,0,0,0,0,0,0,0,0,0,0,0,0,0,null,2,-1,1,0,1,1,0,0,0,0]
["8.","OPERAÇÃO"]
["8.1","Técnico Pleno - Eletrotécnico - Operador Estação de Bombeamento - Diurno (inclusive adicional de periculosidade)","T1",{"$f":"D$15","v":12},{"$f":"AB62","v":18},{"$f":"D62*E62","v":216},null,{"$f":"ROUND(((G62+J62)*$H$13),2)","v":0},0,0,0,0,0,0,{"$f":"ROUND((G62+H62+J62+L62+N62)*$O$13,2)","v":0},{"$f":"G62+H62+J62+L62+N62+O62","v":0},{"$f":"ROUND(F62*G62,2)","v":0},{"$f":"ROUND(F62*H62,2)","v":0},{"$f":"ROUND(F62*J62,2)","v":0},{"$f":"ROUND((F62*L62)+(F62*N62),2)","v":0},{"$f":"ROUND(F62*O62,2)","v":0},{"$f":"ROUND(F62*P62,2)","v":0},null,18,{"$f":"AB62-$X62","v":0},12,{"$f":"AB62-Z62","v":6},{"$f":"SUM(AC62:AG62)","v":18},0,6,2,4,6]
["8.2","Técnico Pleno - Eletrotécnico - Operador Estação de Bombeamento - Noturno (inclusive adicional de periculosidade)","T1",12,18,216,null,{"$f":"ROUND(((G63+J63)*$H$13),2)","v":0},{"$f":"(((G63+H63)/176)*0.2)","v":0},{"$f":"(I63*120)+((I63*120)/25)*5","v":0},0,0,0,0,0,0,0,0,0,0,0,0,null,18,0,12,6,18,0,6,2,4,6]
["8.3","Técnico Junior - Mecânico - Operador Estação de Bombeamento - Diurno (inclusive adicional de periculosidade)","T2",12,18,216,null,0,0,0,0,0,0,0,0,0,0,0,0,0,0,0,null,18,0,12,6,18,0,6,2,4,6]
["8.4","Técnico Junior - Mecânico - Operador Estação de Bombeamento - Noturno (inclusive adicional de periculosidade)","T2",12,18,216,null,0,{"$f":"(((G65+H65)/176)*0.2)","v":0},{"$f":"(I65*120)+((I65*120)/25)*5","v":0},0,0,0,0,0,0,0,0,0,0,0,0,null,18,0,12,6,18,0,6,2,4,6]
["8.5","Técnico Pleno - Eletrotécnico - Operador Subestação - Diurno (inclusive adicional de periculosidade)","T1",12,18,216,null,0,0,0,0,0,0,0,0,0,0,0,0,0,0,0,null,18,0,12,6,18,0,6,2,4,6]
["8.6","Técnico Pleno - Eletrotécnico - Operador Subestação - Noturno (inclusive adicional de periculosidade)","T1",12,18,216,null,0,{"$f":"(((G67+H67)/176)*0.2)","v":0},{"$f":"(I67*120)+((I67*120)/25)*5","v":0},0,0,0,0,0,0,0,0,0,0,0,0,null,18,0,12,6,18,0,6,2,4,6]
["8.7","Técnico Junior - Eletrotécnico - Operador Subestação - Diurno (inclusive adicional de periculosidade)","T2",12,18,216,null,0,0,0,0,0,0,0,0,0,0,0,0,0,0,0,null,18,0,12,6,18,0,6,2,4,6]
["8.8","Técnico Junior - Eletrotécnico - Operador Subestação - Noturno (inclusive adicional de periculosidade)","T2",12,18,216,null,0,{"$f":"(((G69+H69)/176)*0.2)","v":0},{"$f":"(I69*120)+((I69*120)/25)*5","v":0},0,0,0,0,0,0,0,0,0,0,0,0,null,18,0,12,6,18,0,6,2,4,6]
["8.9","Técnico Auxiliar (inclusive adicional de periculosidade)","T3",12,13,156,null,0,0,0,0,0,0,0,0,0,0,0,0,0,0,0,null,18,-5,4,9,13,{"$f":"1*(4+4+5)","v":13},0,0,0,0]
["8.10","Técnico Auxiliar - Leiturista (inclusive adicional de periculosidade)","T3",12,4,48,null,0,0,0,0,0,0,0,0,0,0,0,0,0,0,0,null,6,-2,2,2,4,4,0,0,0,0]
["9.","MANUTENÇÃO - MECÂNICA"]
["9.1","Técnico Pleno - Mecânico (inclusive adicional de periculosidade)","T1",{"$f":"D$15","v":12},{"$f":"AB73","v":3},{"$f":"D73*E73","v":36},null,0,0,0,0,{"$f":"K73*(176*0.025)","v":0},0,{"$f":"M73*(176*0.05)","v":0},{"$f":"ROUND((G73+H73+J73+L73+N73)*$O$13,2)","v":0},{"$f":"G73+H73+J73+L73+N73+O73","v":0},{"$f":"ROUND(F73*G73,2)","v":0},{"$f":"ROUND(F73*H73,2)","v":0},{"$f":"ROUND(F73*J73,2)","v":0},{"$f":"ROUND((F73*L73)+(F73*N73),2)","v":0},{"$f":"ROUND(F73*O73,2)","v":0},{"$f":"ROUND(F73*P73,2)","v":0},null,7,{"$f":"AB73-$X73","v":-4},2,{"$f":"AB73-Z73","v":1},{"$f":"SUM(AC73:AG73)","v":3},0,1,1,1,0]
["9.2","Técnico Auxiliar - Mecânico (inclusive adicional de periculosidade)","T3",12,4,48,null,0,0,0,0,0,0,0,0,0,0,0,0,0,0,0,null,12,-8,5,-1,4,0,2,1,1,0]
["10.","MANUTENÇÃO - EQUIPAMENTOS E SISTEMAS ELÉTRICOS"]
["10.1","Técnico Pleno - Eletrotécnico - Especialista em Baixa e Média Tensão (inclusive adicional de periculosidade)","T1",{"$f":"D$15","v":12},{"$f":"AB76","v":3},{"$f":"D76*E76","v":36},null,{"$f":"ROUND(((G76)*$H$13),2)","v":0},0,0,0,{"$f":"K76*(176*0.025)","v":0},0,{"$f":"M76*(176*0.05)","v":0},{"$f":"ROUND((G76+H76+J76+L76+N76)*$O$13,2)","v":0},{"$f":"G76+H76+J76+L76+N76+O76","v":0},{"$f":"ROUND(F76*G76,2)","v":0},{"$f":"ROUND(F76*H76,2)","v":0},{"$f":"ROUND(F76*J76,2)","v":0},{"$f":"ROUND((F76*L76)+(F76*N76),2)","v":0},{"$f":"ROUND(F76*O76,2)","v":0},{"$f":"ROUND(F76*P76,2)","v":0},null,6,{"$f":"AB76-$X76","v":-3},3,{"$f":"AB76-Z76","v":0},{"$f":"SUM(AC76:AG76)","v":3},0,1,1,1,0]
["10.2","Técnico Junior - Eletrotécnico - Especialista em Baixa e Média Tensão (inclusive adicional de periculosidade)","T2",12,{"$f":"AB77","v":0},{"$f":"D77*E77","v":0},null,0,0,0,0,{"$f":"K77*(176*0.025)","v":0},0,{"$f":"M77*(176*0.05)","v":0},{"$f":"ROUND((G77+H77+J77+L77+N77)*$O$13,2)","v":0},{"$f":"G77+H77+J77+L77+N77+O77","v":0},{"$f":"ROUND(F77*G77,2)","v":0},{"$f":"ROUND(F77*H77,2)","v":0},{"$f":"ROUND(F77*J77,2)","v":0},{"$f":"ROUND((F77*L77)+(F77*N77),2)","v":0},{"$f":"ROUND(F77*O77,2)","v":0},{"$f":"ROUND(F77*P77,2)","v":0},null,2,{"$f":"AB77-$X77","v":-2},2,{"$f":"AB77-Z77","v":-2},{"$f":"SUM(AC77:AG77)","v":0},0,0,0,0,0]
["10.3","Técnico Auxiliar (inclusive adicional de periculosidade)","T3",12,{"$f":"AB78","v":4},{"$f":"D78*E78","v":48},null,0,0,0,0,0,0,{"$f":"M78*(176*0.05)","v":0},{"$f":"ROUND((G78+H78+J78+L78+N78)*$O$13,2)","v":0},{"$f":"G78+H78+J78+L78+N78+O78","v":0},{"$f":"ROUND(F78*G78,2)","v":0},{"$f":"ROUND(F78*H78,2)","v":0},{"$f":"ROUND(F78*J78,2)","v":0},{"$f":"ROUND((F78*L78)+(F78*N78),2)","v":0},{"$f":"ROUND(F78*O78,2)","v":0},{"$f":"ROUND(F78*P78,2)","v":0},null,8,{"$f":"AB78-$X78","v":-4},4,{"$f":"AB78-Z78","v":0},{"$f":"SUM(AC78:AG78)","v":4},0,2,0,2,0]
["11.","Manutenção - Subestação - Pátios"]
["11.1","Eletrotécnico - Especialista Subestação 230 Kv (inclusive adicional de periculosidade)","T1",{"$f":"D$15","v":12},{"$f":"AB80","v":1},{"$f":"D80*E80","v":12},null,0,0,0,0,0,0,{"$f":"M80*(176*0.05)","v":0},{"$f":"ROUND((G80+H80+J80+L80+N80)*$O$13,2)","v":0},{"$f":"G80+H80+J80+L80+N80+O80","v":0},{"$f":"ROUND(F80*G80,2)","v":0},{"$f":"ROUND(F80*H80,2)","v":0},{"$f":"ROUND(F80*J80,2)","v":0},{"$f":"ROUND((F80*L80)+(F80*N80),2)","v":0},{"$f":"ROUND(F80*O80,2)","v":0},{"$f":"ROUND(F80*P80,2)","v":0},null,1,{"$f":"AB80-$X80","v":0},1,{"$f":"AB80-Z80","v":0},{"$f":"SUM(AC80:AG80)","v":1},0,1,0,0,0]
["11.2","Eletricista (inclusive adicional de periculosidade)","T3",12,{"$f":"AB81","v":1},{"$f":"D81*E81","v":12},null,0,0,0,0,0,0,0,{"$f":"ROUND((G81+H81+J81+L81+N81)*$O$13,2)","v":0},{"$f":"G81+H81+J81+L81+N81+O81","v":0},{"$f":"ROUND(F81*G81,2)","v":0},{"$f":"ROUND(F81*H81,2)","v":0},{"$f":"ROUND(F81*J81,2)","v":0},{"$f":"ROUND((F81*L81)+(F81*N81),2)","v":0},{"$f":"ROUND(F81*O81,2)","v":0},{"$f":"ROUND(F81*P81,2)","v":0},null,2,{"$f":"AB81-$X81","v":-1},2,{"$f":"AB81-Z81","v":-1},{"$f":"SUM(AC81:AG81)","v":1},0,1,0,0,0]
["11.3","Eletromecânico (inclusive adicional de periculosidade)","T3",12,{"$f":"AB82","v":0},{"$f":"D82*E82","v":0},null,0,0,0,0,0,0,0,{"$f":"ROUND((G82+H82+J82+L82+N82)*$O$13,2)","v":0},{"$f":"G82+H82+J82+L82+N82+O82","v":0},{"$f":"ROUND(F82*G82,2)","v":0},{"$f":"ROUND(F82*H82,2)","v":0},{"$f":"ROUND(F82*J82,2)","v":0},{"$f":"ROUND((F82*L82)+(F82*N82),2)","v":0},{"$f":"ROUND(F82*O82,2)","v":0},{"$f":"ROUND(F82*P82,2)","v":0},null,2,{"$f":"AB82-$X82","v":-2},2,{"$f":"AB82-Z82","v":-2},{"$f":"SUM(AC82:AG82)","v":0},0,0,0,0,0]
["12.","Manutenção - Linhas de Transmissão 230 kv e 69kv"]
["12.1","Eletrotécnico - Especialista Inspeção em Linha de Transmissão 230 / 269 Kv (inclusive adicional de periculosidade)","T1",{"$f":"D$15","v":12},{"$f":"AB84","v":1},{"$f":"D84*E84","v":12},null,0,0,0,0,0,0,0,{"$f":"ROUND((G84+H84+J84+L84+N84)*$O$13,2)","v":0},{"$f":"G84+H84+J84+L84+N84+O84","v":0},{"$f":"ROUND(F84*G84,2)","v":0},{"$f":"ROUND(F84*H84,2)","v":0},{"$f":"ROUND(F84*J84,2)","v":0},{"$f":"ROUND((F84*L84)+(F84*N84),2)","v":0},{"$f":"ROUND(F84*O84,2)","v":0},{"$f":"ROUND(F84*P84,2)","v":0},null,2,{"$f":"AB84-$X84","v":-1},2,{"$f":"AB84-Z84","v":-1},{"$f":"SUM(AC84:AG84)","v":1},0,0,1,0,0]
["12.2","Auxiliar Eletrotécnico (inclusive adicional de periculosidade)","T4",12,{"$f":"AB85","v":1},{"$f":"D85*E85","v":12},null,0,0,0,0,0,0,0,{"$f":"ROUND((G85+H85+J85+L85+N85)*$O$13,2)","v":0},{"$f":"G85+H85+J85+L85+N85+O85","v":0},{"$f":"ROUND(F85*G85,2)","v":0},{"$f":"ROUND(F85*H85,2)","v":0},{"$f":"ROUND(F85*J85,2)","v":0},{"$f":"ROUND((F85*L85)+(F85*N85),2)","v":0},{"$f":"ROUND(F85*O85,2)","v":0},{"$f":"ROUND(F85*P85,2)","v":0},null,2,{"$f":"AB85-$X85","v":-1},2,{"$f":"AB85-Z85","v":-1},{"$f":"SUM(AC85:AG85)","v":1},0,0,1,0,0]
["13.","Manutenção - Linhas de Distibuição - 13,8kv e 6,9 kv"]
["13.1","Eletrotécnico - Especialista em Linha de Distribuição 13,8 Kv (inclusive adicional de periculosidade)","T1",{"$f":"D$15","v":12},{"$f":"AB87","v":1},{"$f":"D87*E87","v":12},null,0,0,0,0,0,0,0,{"$f":"ROUND((G87+H87+J87+L87+N87)*$O$13,2)","v":0},{"$f":"G87+H87+J87+L87+N87+O87","v":0},{"$f":"ROUND(F87*G87,2)","v":0},{"$f":"ROUND(F87*H87,2)","v":0},{"$f":"ROUND(F87*J87,2)","v":0},{"$f":"ROUND((F87*L87)+(F87*N87),2)","v":0},{"$f":"ROUND(F87*O87,2)","v":0},{"$f":"ROUND(F87*P87,2)","v":0},null,3,{"$f":"AB87-$X87","v":-2},2,{"$f":"AB87-Z87","v":-1},{"$f":"SUM(AC87:AG87)","v":1},0,0,0,1,0]
["13.2","Eletricista (inclusive adicional de periculosidade)","T3",12,{"$f":"AB88","v":1},{"$f":"D88*E88","v":12},null,0,0,0,0,0,0,0,{"$f":"ROUND((G88+H88+J88+L88+N88)*$O$13,2)","v":0},{"$f":"G88+H88+J88+L88+N88+O88","v":0},{"$f":"ROUND(F88*G88,2)","v":0},{"$f":"ROUND(F88*H88,2)","v":0},{"$f":"ROUND(F88*J88,2)","v":0},{"$f":"ROUND((F88*L88)+(F88*N88),2)","v":0},{"$f":"ROUND(F88*O88,2)","v":0},{"$f":"ROUND(F88*P88,2)","v":0},null,3,{"$f":"AB88-$X88","v":-2},2,{"$f":"AB88-Z88","v":-1},{"$f":"SUM(AC88:AG88)","v":1},0,0,0,1,0]
["13.3","Auxiliar Eletrotécnico (inclusive adicional de periculosidade)","T4",12,{"$f":"AB89","v":0},{"$f":"D89*E89","v":0},null,0,0,0,0,0,0,0,{"$f":"ROUND((G89+H89+J89+L89+N89)*$O$13,2)","v":0},{"$f":"G89+H89+J89+L89+N89+O89","v":0},{"$f":"ROUND(F89*G89,2)","v":0},{"$f":"ROUND(F89*H89,2)","v":0},{"$f":"ROUND(F89*J89,2)","v":0},{"$f":"ROUND((F89*L89)+(F89*N89),2)","v":0},{"$f":"ROUND(F89*O89,2)","v":0},{"$f":"ROUND(F89*P89,2)","v":0},null,3,{"$f":"AB89-$X89","v":-3},2,{"$f":"AB89-Z89","v":-2},{"$f":"SUM(AC89:AG89)","v":0},0,0,0,0,0]
["14.","MANUTENÇÃO SDSC"]
["14.1","Técnico Automação - Especialista em SDSC (inclusive adicional de periculosidade)","T1",{"$f":"D$15","v":12},{"$f":"AB91","v":3},{"$f":"D91*E91","v":36},null,{"$f":"ROUND(((G91+J91)*$H$13),2)","v":0},0,0,0,0,0,0,{"$f":"ROUND((G91+H91+J91+L91+N91)*$O$13,2)","v":0},{"$f":"G91+H91+J91+L91+N91+O91","v":0},{"$f":"ROUND(F91*G91,2)","v":0},{"$f":"ROUND(F91*H91,2)","v":0},{"$f":"ROUND(F91*J91,2)","v":0},{"$f":"ROUND((F91*L91)+(F91*N91),2)","v":0},{"$f":"ROUND(F91*O91,2)","v":0},{"$f":"ROUND(F91*P91,2)","v":0},null,2,{"$f":"AB91-$X91","v":1},2,{"$f":"AB91-Z91","v":1},{"$f":"SUM(AC91:AG91)","v":3},0,1,1,1,0]
["14.2","Técnico Instrumentação (inclusive adicional de periculosidade)","T1",12,{"$f":"AB92","v":0},{"$f":"D92*E92","v":0},null,0,0,0,0,0,0,0,{"$f":"ROUND((G92+H92+J92+L92+N92)*$O$13,2)","v":0},{"$f":"G92+H92+J92+L92+N92+O92","v":0},{"$f":"ROUND(F92*G92,2)","v":0},{"$f":"ROUND(F92*H92,2)","v":0},{"$f":"ROUND(F92*J92,2)","v":0},{"$f":"ROUND((F92*L92)+(F92*N92),2)","v":0},{"$f":"ROUND(F92*O92,2)","v":0},{"$f":"ROUND(F92*P92,2)","v":0},null,1,{"$f":"AB92-$X92","v":-1},1,{"$f":"AB92-Z92","v":-1},{"$f":"SUM(AC92:AG92)","v":0},0,0,0,0,0]
["15.","MANUTENÇÃO SPCS"]
["15.1","Eletrotécnico - Especialista em SPCS (inclusive adicional de periculosidade)","T1",{"$f":"D$15","v":12},{"$f":"AB94","v":1},{"$f":"D94*E94","v":12},null,0,0,0,0,0,0,0,{"$f":"ROUND((G94+H94+J94+L94+N94)*$O$13,2)","v":0},{"$f":"G94+H94+J94+L94+N94+O94","v":0},{"$f":"ROUND(F94*G94,2)","v":0},{"$f":"ROUND(F94*H94,2)","v":0},{"$f":"ROUND(F94*J94,2)","v":0},{"$f":"ROUND((F94*L94)+(F94*N94),2)","v":0},{"$f":"ROUND(F94*O94,2)","v":0},{"$f":"ROUND(F94*P94,2)","v":0},null,2,{"$f":"AB94-$X94","v":-1},2,{"$f":"AB94-Z94","v":-1},{"$f":"SUM(AC94:AG94)","v":1},1,0,0,0,0]
["16.","MANUTENÇÃO TELECOM"]
["16.1","Técnico Telecomunicações/Eletrônica (inclusive adicional de periculosidade)","T1",{"$f":"D$15","v":12},{"$f":"AB96","v":1},{"$f":"D96*E96","v":12},null,{"$f":"ROUND(((G96+J96)*$H$13),2)","v":0},0,0,0,{"$f":"K96*(176*0.025)","v":0},0,{"$f":"M96*(176*0.05)","v":0},{"$f":"ROUND((G96+H96+J96+L96+N96)*$O$13,2)","v":0},{"$f":"G96+H96+J96+L96+N96+O96","v":0},{"$f":"ROUND(F96*G96,2)","v":0},{"$f":"ROUND(F96*H96,2)","v":0},{"$f":"ROUND(F96*J96,2)","v":0},{"$f":"ROUND((F96*L96)+(F96*N96),2)","v":0},{"$f":"ROUND(F96*O96,2)","v":0},{"$f":"ROUND(F96*P96,2)","v":0},null,4,{"$f":"AB96-$X96","v":-3},2,{"$f":"AB96-Z96","v":-1},{"$f":"SUM(AC96:AG96)","v":1},1,0,0,0,0]
["17.","MANUTENÇÃO - CIVIL"]
["17.1","Técnico Pleno - Encarregado de Campo (inclusive adicional de periculosidade)","T1",{"$f":"D$15","v":12},{"$f":"AB98","v":3},{"$f":"D98*E98","v":36},null,{"$f":"ROUND(((G98+J98)*$H$13),2)","v":0},0,0,0,{"$f":"K98*(176*0.025)","v":0},0,{"$f":"M98*(176*0.05)","v":0},{"$f":"ROUND((G98+H98+J98+L98+N98)*$O$13,2)","v":0},{"$f":"G98+H98+J98+L98+N98+O98","v":0},{"$f":"ROUND(F98*G98,2)","v":0},{"$f":"ROUND(F98*H98,2)","v":0},{"$f":"ROUND(F98*J98,2)","v":0},{"$f":"ROUND((F98*L98)+(F98*N98),2)","v":0},{"$f":"ROUND(F98*O98,2)","v":0},{"$f":"ROUND(F98*P98,2)","v":0},null,5,{"$f":"AB98-$X98","v":-2},1,{"$f":"AB98-Z98","v":2},{"$f":"SUM(AC98:AG98)","v":3},0,1,1,1,0]
["17.2","Tecnico Edificações - Inspeção (inclusive adicional de periculosidade)","T2",12,3,36,null,{"$f":"ROUND(((G99+J99)*$H$13),2)","v":0},0,0,0,0,0,0,0,0,0,0,0,0,0,0,null,3,0,1,2,3,0,1,1,1,0]
["17.3","Técnico Junior - Cadista","T2",12,3,36,null,0,0,0,0,0,0,0,0,0,0,0,0,0,0,0,null,3,0,2,1,3,0,1,1,1,0]
["17.4","Topógrafo (inclusive adicional de periculosidade)","T1",12,1,12,null,{"$f":"ROUND(((G101+J101)*$H$13),2)","v":0},0,0,0,0,0,0,0,0,0,0,0,0,0,0,null,2,-1,1,0,1,1,0,0,0,0]
["17.5","Auxiliar de Topografia (inclusive adicional de periculosidade)","T4",12,2,24,null,0,0,0,0,0,0,0,0,0,0,0,0,0,0,0,null,4,-2,2,0,2,2,0,0,0,0]
["17.6","Carpinteiro (inclusive adicional de periculosidade)","T3",12,3,36,null,0,0,0,0,0,0,0,0,0,0,0,0,0,0,0,null,6,-3,1,2,3,0,1,1,1,0]
["17.7","Eletricista (inclusive adicional de periculosidade)","T3",12,3,36,null,0,0,0,0,0,0,0,0,0,0,0,0,0,0,0,null,7,-4,2,1,3,0,1,1,1,0]
["17.8","Ferreiro (inclusive adicional de periculosidade)","T3",12,3,36,null,0,0,0,0,0,0,0,0,0,0,0,0,0,0,0,null,6,-3,1,2,3,0,1,1,1,0]
["17.9","Pedreiro (inclusive adicional de periculosidade)","T3",12,7,84,null,0,0,0,0,0,0,0,0,0,0,0,0,0,0,0,null,14,-7,3,4,7,0,3,2,2,0]
["17.10","Servente (inclusive adicional de periculosidade)","A4",12,63,756,null,0,0,0,0,0,0,0,0,0,0,0,0,0,0,0,null,176,-113,90,-27,63,0,{"$f":"2*(3+3)+3*4","v":24},{"$f":"2*(1+1)+3*4","v":16},{"$f":"2*(2+2)+3*5","v":23},0]
["17.11","Vigia (inclusive adicional de periculosidade)","A4",12,0,0,null,0,0,0,0,0,0,0,0,0,0,0,0,0,0,0,null,4,-4,2,-2,0,0,0,0,0,0]
["Total Geral - Equipe com Vínculo Mensalista (R$):",{"$nulls":15},{"$f":"SUM(Q15:Q108)","v":0},0,0,0,0,{"$f":"SUM(V14:V108)","v":0}]
[{"$nulls":4},{"$f":"SUBTOTAL(9,E13:E109)","v":329},{"$f":"SUBTOTAL(9,F13:F109)","v":3948},{"$nulls":17},{"$f":"SUM(X14:X109)","v":539},-210,305,24,329,56,96,52,{"$f":"SUM(AF14:AF109)","v":77},48]
[{"$nulls":4},214,{"$nulls":20},{"$f":"Z110/X110","v":0.56586270871985156},null,{"$f":"AB110/X110","v":0.61038961038961037}]
["NOME DO INFORMANTE:",{"$nulls":19},"QUALIFICAÇÃO:"]
[]
["ASSINATURA:",{"$nulls":19},"DATA:"]
[]
["OBSERVAÇÕES:"]
["1. Considerado a carga horária de 176 horas/mês"]
["2. Os cálculos de cada parcela que compõe o salário completo foram calculadas isoladamente. (Salário Base + Adicional de Periculosidade (quando houver) + Adicional Noturno (quando houver) + Adicional de Horas Extras (quando houver) +  Encargos Sociais)"]
["3. Adicional de Periculosidade 30%: foi previsto para todos os profissionais eletricitários (Operação e Manutenção) que trabalham em contato com rede elétrica (nas estações de bombeamento, sub-estações, etc.) "]
["4. Hora Noturna: Hora Diurna x 20%"]
["5. Adicional Noturno: *Considerado 120 horas/profissional/mês (Total de 8h noturnas: Período de 22h as 5h = 8h noturnas + 1h até as 6h => Súmula 60 do TST)    *(Incide sobre Salário Base + Periculosidade => Súmula 191 do TST)"]
["6. Período noturno – 22 às 5 horas, o valor da hora tem 52 minutos e 30 segundos; logo, nesse período, há 8 horas"]
["6. Foi considerado intervalo intrajornada para todos os profissionais que trabalham em escala 12h x 36h "]
["7. Foi considerado para o cálculo de horas extras os percentuais de: *5% para as horas remuneradas a 50%  sobre o valor da hora normal; e *2,5% para as horas trabalhadas remuneradas a 100% sobre o valor da hora normal"]
["8. Horas Extras: Foi estimado um percentual de 20% de horas extras no total de contrato para todos os profissionais da manutenção. Essas horas só serão pagas se houver demanda."]

{"sheet":"Mem_Calculo_EQUIPE","index":10,"n_rows":149,"n_cols":7,"rows_kept":149,"cut":false,"hidden":false,"merged":[[150,0,150,6],[151,0,151,6],[146,0,146,5],[147,0,147,5],[144,0,144,5],[145,0,145,5],[82,1,82,6],[90,1,90,6],[114,1,114,6],[148,0,148,6],[149,0,149,6],[109,1,109,6],[97,1,97,6],[101,1,101,6],[105,1,105,6],[0,1,0,6],[1,1,1,6],[2,1,2,6],[4,0,5,6],[7,0,7,6],[51,1,51,6],[66,1,66,6],[45,1,45,6],[11,1,11,6],[16,1,16,6],[20,1,20,6],[24,1,24,6],[40,1,40,6]]}
[null,"Ministério do Desenvolvimento Regional  - MDR"]
[null,"Companhia de Desenvolvimento dos Vales do São Francisco e do Parnaíba"]
[null,"Gerência de Operação do PISF - Centro de Controle e Operação (AD / GOI / CCO)"]
[]
["SERVIÇOS DE OPERAÇÃO E MANUTENÇÃO DAS INFRAESTRUTURAS DO EIXO LESTE DO PROJETO DE INTEGRAÇÃO DO RIO SÃO FRANCISCO COM AS BACIAS HIDROGRÁFICAS DO NORDESTE SETENTRIONAL – PISF"]
[]
[]
["MEMORIAL DE CÁLCULO - EQUIPE DE MÃO DE OBRA"]
[]
[]
["ITEM","DESCRIÇÃO","CLASSE","LOTAÇÃO","MOBILIZAÇÃO","QUANTIDADE","OBSERVAÇÕES"]
["1.","COORDENAÇÃO GERAL"]
["1.1","Coordenador - Engenheiro Sênior (Civil / Eletricista / Mecânico) - Esp. Manutenção Sist Abast/Ger","P0","Coordenação (à definir)","Escritório",1]
["1.2","Assistente Administrativo","A1","Coordenação (à definir)","Escritório",1]
["1.3","Auxiliar Administrativo","A3","Coordenação (à definir)","Escritório",1]
[]
["2.","COORDENAÇÃO DA OPERAÇÃO"]
["2.1","Coordenador - Engenheiro Sênior (Civil / Eletricista / Mecânico) - Esp. Manutenção Sist Abast/Ger","P1","Coordenação (à definir)","Escritório",1]
["2.2","Auxiliar Administrativo","A3","Coordenação (à definir)","Escritório",1]
[]
["3.","COORDENAÇÃO DA MANUTENÇÃO"]
["3.1","Coordenador - Engenheiro Sênior (Civil / Eletricista / Mecânico) - Esp. Manutenção Sist Abast/Ger","P1","Coordenação (à definir)","Escritório",1]
["3.2","Auxiliar Administrativo","A3","Coordenação (à definir)","Escritório",1]
[]
["4.","COORDENAÇÃO ADMINISTRAÇÃO E LOGÍSTICA"]
["4.1","Almoxarife","A1","Coordenação (à definir)","Pode utilizar o escritório",1]
["4.2","Auxiliar Administrativo","A3","Coordenação (à definir)","Escritório",1]
["4.3","Motorista","A3","Coordenação (à definir)","Não utilliza o Escritório",2]
["4.4","Coordenador - Chefe de Escritório","AS","Coordenação (à definir)","Escritório",1]
["4.5","Técnico Pleno - Analista em Tecnologia da Informação","T1","Coordenação (à definir)","Escritório",1]
["4.6","Auxiliar de Almoxarifado","A3","Lote 09 (Floresta/PE)","Pode utilizar o escritório",1]
["4.7","Motorista","A3","Lote 09 (Floresta/PE)","Não utiliza o Escritório",1]
["4.8","Servente","A4","Lote 09 (Floresta/PE)","Não utilliza o Escritório",4,"Equipe: 04/(canteiro)"]
["4.9","Auxiliar de Almoxarifado","A3","Lote 10 (Custódia/PE)","Pode utilizar o escritório",1]
["4.10","Motorista","A3","Lote 10 (Custódia/PE)","Não utilliza o Escritório",1]
["4.11","Servente","A4","Lote 10 (Custódia/PE)","Não utilliza o Escritório",4,"Equipe: 04/(canteiro)"]
["4.12","Auxiliar de Almoxarifado","A3","Lote 12 (Sertânia/PE)","Pode utilizar o escritório",1]
["4.13","Motorista","A3","Lote 12 (Sertânia/PE)","Não utilliza o Escritório",1]
["4.14","Servente","A4","Lote 12 (Sertânia/PE)","Não utilliza o Escritório",4,"Equipe: 04/(canteiro)"]
[]
["5.","COORDENAÇÃO SEGURANÇA E MEDICINA DO TRABALHO"]
["5.1","Engenheiro de Segurança e Medicina do Trabalho","P1","Coordenação (à definir)","Escritório",1]
["5.2","Médico do Trabalho","P1","Coordenação (à definir)","Escritório",1]
["5.3","Técnico de Segurança e Medicina do Trabalho","T2","Coordenação (à definir)","Pode utilizar o escritório",2]
[]
["6.","PLANEJAMENTO E CONTROLE DA OPERAÇÃO"]
["6.1","Engenheiro Pleno - Civil - Especialista em Hidráulica","P1","Coordenação (à definir)","Planeja / Utiliza - Escritório",1]
["6.2","Engenheiro Pleno - Civil - Especialista em Hidrologia","P1","Coordenação (à definir)","Planeja / Utiliza - Escritório",1]
["6.3","Engenheiro Pleno - Eletricista","P1","Coordenação (à definir)","Planeja / Utiliza - Escritório",1]
["6.4","Engenheiro Junior - Civil","P3","Coordenação (à definir)","Planeja / Utiliza - Escritório",1]
[]
["7.","PLANEJAMENTO E CONTROLE DA MANUTENÇÃO"]
["7.1","Engenheiro Pleno - Eletricista - Especialista em Equipamentos e Sistemas Elétricos","P1","Coordenação (à definir)","Planeja / Utiliza - Escritório",1]
["7.2","Engenheiro Pleno - Eletricista - Especialista em Subestação Pátio, L. Transmissão e L. Distribuição","P1","Coordenação (à definir)","Planeja / Utiliza - Escritório",1]
["7.3","Engenheiro Pleno - Eletricista - Especialista em Sistema de Proteção, Controle e Supervisão (SPCS)","P1","Coordenação (à definir)","Planeja / Utiliza - Escritório",1]
["7.4","Engenheiro Pleno - Mecânico","P1","Coordenação (à definir)","Planeja / Utiliza - Escritório",1]
["7.5","Engenheiro Pleno - Civil","P1","Coordenação (à definir)","Planeja / Utiliza - Escritório",1]
["7.6","Engenheiro Pleno - Mecatrônica - Especialista em Automação","P1","Coordenação (à definir)","Planeja / Utiliza - Escritório",1]
["7.7","Engenheiro Pleno - Telecomunicações","P1","Coordenação (à definir)","Planeja / Utiliza - Escritório",1]
["7.8","Geólogo  (Geotecnia)","P1","Coordenação (à definir)","Planeja / Utiliza - Escritório",1,"Profissional para atender aos serviços de Segurança de Barragem"]
["7.9","Técnico Sênior - Manutenção Elétrica -  Especialista em Equipamentos e Sistemas Elétricos","T0","Coordenação (à definir)","Pode utilizar o escritório",1]
["7.10","Técnico Sênior - Manutenção Elétrica -  Especialista em Subestação Pátio, L. Transmissão e L. Distribuição","T0","Coordenação (à definir)","Pode utilizar o escritório",1]
["7.11","Técnico Sênior - Manutenção Elétrica -  Especialista em Sistema de Proteção, Controle e Supervisão (SPCS)","T0","Coordenação (à definir)","Pode utilizar o escritório",1]
["7.12","Técnico Sênior - Manutenção Mecânica","T0","Coordenação (à definir)","Pode utilizar o escritório",1]
["7.13","Técnico Sênior - Manutenção Civil","T0","Coordenação (à definir)","Pode utilizar o escritório",1]
[]
["8.","OPERAÇÃO"]
["8.1","Técnico Auxiliar","T3","Coordenação (à definir)","Não utilliza o Escritório",{"$f":"1*(4+4+5)","v":13},"Equipe: 01/barragem"]
["8.2","Técnico Auxiliar - Leiturista","T3","Coordenação (à definir)","Não utilliza o Escritório",4]
["8.3","Técnico Pleno - Eletrotécnico - Operador Estação de Bombeamento ","T1","Lote 09 (Floresta/PE)","Não utilliza o Escritório",{"$f":"6+6","v":12}]
["8.4","Técnico Pleno - Eletrotécnico - Operador Subestação","T1","Lote 09 (Floresta/PE)","Não utilliza o Escritório",{"$f":"6+6","v":12}]
["8.5","Técnico Junior - Mecânico - Operador Estação de Bombeamento ","T2","Lote 09 (Floresta/PE)","Não utilliza o Escritório",{"$f":"6+6","v":12}]
["8.6","Técnico Junior - Eletrotécnico - Operador Subestação","T2","Lote 09 (Floresta/PE)","Não utilliza o Escritório",{"$f":"6+6","v":12}]
["8.7","Técnico Pleno - Eletrotécnico - Operador Estação de Bombeamento ","T1","Lote 10 (Custódia/PE)","Não utilliza o Escritório",4]
["8.8","Técnico Pleno - Eletrotécnico - Operador Subestação","T1","Lote 10 (Custódia/PE)","Não utilliza o Escritório",4]
["8.9","Técnico Junior - Mecânico - Operador Estação de Bombeamento ","T2","Lote 10 (Custódia/PE)","Não utilliza o Escritório",4]
["8.10","Técnico Junior -  Eletrotécnico - Operador Subestação","T2","Lote 10 (Custódia/PE)","Não utilliza o Escritório",4]
["8.11","Técnico Pleno - Eletrotécnico - Operador Estação de Bombeamento ","T1","Lote 12 (Sertânia/PE)","Não utilliza o Escritório",8]
["8.12","Técnico Pleno - Eletrotécnico - Operador Subestação","T1","Lote 12 (Sertânia/PE)","Não utilliza o Escritório",8]
["8.13","Técnico Junior -  Mecânico - Operador Estação de Bombeamento ","T2","Lote 12 (Sertânia/PE)","Não utilliza o Escritório",8]
["8.14","Técnico Junior - Eletrotécnico - Operador Subestação","T2","Lote 12 (Sertânia/PE)","Não utilliza o Escritório",8]
[]
["9.","MANUTENÇÃO - MECÂNICA"]
["9.1","Técnico Pleno - Mecânico","T1","Lote 09 (Floresta/PE)","Pode utilizar o escritório",1]
["9.2","Técnico Auxiliar - Mecânico","T3","Lote 09 (Floresta/PE)","Não utilliza o Escritório",2]
["9.3","Técnico Pleno - Mecânico","T1","Lote 10 (Custódia/PE)","Pode utilizar o escritório",1]
["9.4","Técnico Auxiliar - Mecânico","T3","Lote 10 (Custódia/PE)","Não utilliza o Escritório",1]
["9.5","Técnico Pleno - Mecânico","T1","Lote 12 (Sertânia/PE)","Pode utilizar o escritório",1]
["9.6","Técnico Auxiliar - Mecânico","T3","Lote 12 (Sertânia/PE)","Não utilliza o Escritório",1]
[]
["10.","MANUTENÇÃO - EQUIPAMENTOS E SISTEMAS ELÉTRICOS"]
["10.1","Técnico Pleno - Eletrotécnico - Especialista em Baixa e Média Tensão","T1","Lote 09 (Floresta/PE)","Pode utilizar o escritório",1]
["10.2","Técnico Auxiliar","T3","Lote 09 (Floresta/PE)","Não utilliza o Escritório",2]
["10.3","Técnico Pleno - Eletrotécnico - Especialista em Baixa e Média Tensão","T1","Lote 10 (Custódia/PE)","Pode utilizar o escritório",1]
["10.4","Técnico Pleno - Eletrotécnico - Especialista em Baixa e Média Tensão","T1","Lote 12 (Sertânia/PE)","Pode utilizar o escritório",1]
["10.5","Técnico Auxiliar","T3","Lote 12 (Sertânia/PE)","Não utilliza o Escritório",2]
[]
["11.","MANUTENÇÃO - SUBESTAÇÃO - PÁTIOS"]
["11.1","Eletrotécnico - Especialista Subestação 230 Kv (inclusive adicional de periculosidade)","T1","Lote 09 (Floresta/PE)","Não utilliza o Escritório",1]
["11.2","Eletricista (inclusive adicional de periculosidade)","T3","Lote 09 (Floresta/PE)","Não utilliza o Escritório",1]
[]
["12.","MANUTENÇÃO - LINHAS DE TRANSMISSÃO 230 KV E 69KV"]
["12.1","Eletrotécnico - Especialista Inspeção em Linha de Transmissão 230 / 269 Kv (inclusive adicional de periculosidade)","T1","Lote 10 (Custódia/PE)","Não utilliza o Escritório",1]
["12.2","Auxiliar Eletrotécnico (inclusive adicional de periculosidade)","T4","Lote 10 (Custódia/PE)","Não utilliza o Escritório",1]
[]
["13.","MANUTENÇÃO - LINHAS DE DISTIBUIÇÃO - 13,8KV E 6,9 KV"]
["13.1","Eletrotécnico - Especialista em Linha de Distribuição 13,8 Kv (inclusive adicional de periculosidade)","T1","Lote 12 (Sertânia/PE)","Não utilliza o Escritório",1]
["13.2","Eletricista (inclusive adicional de periculosidade)","T3","Lote 12 (Sertânia/PE)","Não utilliza o Escritório",1]
[]
["14.","MANUTENÇÃO SDSC"]
["14.1","Técnico Automação - Especialista em SDSC (inclusive adicional de periculosidade)","T1","Lote 09 (Floresta/PE)","Não utilliza o Escritório",1]
["14.2","Técnico Automação - Especialista em SDSC (inclusive adicional de periculosidade)","T1","Lote 10 (Custódia/PE)","Não utilliza o Escritório",1]
["14.3","Técnico Automação - Especialista em SDSC (inclusive adicional de periculosidade)","T1","Lote 12 (Sertânia/PE)","Não utilliza o Escritório",1]
[]
["15.","MANUTENÇÃO - CIVIL"]
["15.1","Topógrafo","T1","Coordenação (à definir)","Pode utilizar o escritório",1]
["15.2","Auxiliar de Topografia","T4","Coordenação (à definir)","Não utilliza o Escritório",2]
["15.3","Servente (com adicional de periculosidade)","A4","Lote 09 (Floresta/PE)","Não utilliza o Escritório",{"$f":"2*(3+3)+3*4","v":24},"Equipe: 02/(EB + SE) + 03/barragem"]
["15.4","Técnico Sênior - Encarregado de Campo","T0","Lote 09 (Floresta/PE)","Pode utilizar o escritório",1]
["15.5","Tecnico Edificações - Inspeção","T2","Lote 09 (Floresta/PE)","Pode utilizar o escritório",1]
["15.6","Técnico Junior - Cadista","T2","Lote 09 (Floresta/PE)","Pode utilizar o escritório",1]
["15.7","Pedreiro","T3","Lote 09 (Floresta/PE)","Não utilliza o Escritório",3]
["15.8","Carpinteiro","T3","Lote 09 (Floresta/PE)","Não utilliza o Escritório",1]
["15.9","Ferreiro","T3","Lote 09 (Floresta/PE)","Não utilliza o Escritório",1]
["15.10","Eletricista","T3","Lote 09 (Floresta/PE)","Não utilliza o Escritório",1]
["15.11","Servente (com adicional de periculosidade)","A4","Lote 10 (Custódia/PE)","Não utilliza o Escritório",{"$f":"2*(1+1)+3*4","v":16},"Equipe: 02/(EB + SE) + 03/barragem"]
["15.12","Técnico Sênior - Encarregado de Campo","T0","Lote 10 (Custódia/PE)","Pode utilizar o escritório",1]
["15.13","Tecnico Edificações - Inspeção","T2","Lote 10 (Custódia/PE)","Pode utilizar o escritório",1]
["15.14","Técnico Junior - Cadista","T2","Lote 10 (Custódia/PE)","Pode utilizar o escritório",1]
["15.15","Pedreiro","T3","Lote 10 (Custódia/PE)","Não utilliza o Escritório",1]
["15.16","Carpinteiro","T3","Lote 10 (Custódia/PE)","Não utilliza o Escritório",1]
["15.17","Ferreiro","T3","Lote 10 (Custódia/PE)","Não utilliza o Escritório",1]
["15.18","Eletricista","T3","Lote 10 (Custódia/PE)","Não utilliza o Escritório",2]
["15.19","Servente (com adicional de periculosidade)","A4","Lote 12 (Sertânia/PE)","Não utilliza o Escritório",{"$f":"2*(2+2)+3*5","v":23},"Equipe: 02/(EB + SE) + 03/barragem"]
["15.20","Técnico Sênior - Encarregado de Campo","T0","Lote 12 (Sertânia/PE)","Pode utilizar o escritório",1]
["15.21","Técnico Junior - Cadista","T2","Lote 12 (Sertânia/PE)","Pode utilizar o escritório",1]
["15.22","Tecnico Edificações - Inspeção","T2","Lote 12 (Sertânia/PE)","Pode utilizar o escritório",1]
["15.23","Pedreiro","T3","Lote 12 (Sertânia/PE)","Não utilliza o Escritório",2]
["15.24","Carpinteiro","T3","Lote 12 (Sertânia/PE)","Não utilliza o Escritório",1]
["15.25","Ferreiro","T3","Lote 12 (Sertânia/PE)","Não utilliza o Escritório",1]
["15.26","Eletricista","T3","Lote 12 (Sertânia/PE)","Não utilliza o Escritório",1]
[]
[]
[]
["NOME DO INFORMANTE:",{"$nulls":5},"QUALIFICAÇÃO:"]
[]
["ASSINATURA:",{"$nulls":5},"DATA:"]
[]
["OBSERVAÇAO:"]

{"sheet":"Encargos Sociais e Benefícios","index":11,"n_rows":75,"n_cols":3,"rows_kept":75,"cut":false,"hidden":false,"merged":[[76,0,76,2],[74,0,75,2],[4,0,5,2],[7,0,7,2],[68,0,68,1],[69,0,69,1],[70,0,70,1],[71,0,71,1],[72,0,72,2],[65,0,65,1],[37,0,37,1],[43,0,43,1],[44,0,44,1],[45,0,45,1],[48,0,48,1],[49,0,49,1],[58,0,58,2],[0,1,0,2],[1,1,1,2],[2,1,2,2],[73,0,73,2],[50,0,50,1],[55,0,55,1],[36,0,36,1],[12,0,12,1],[22,0,22,1],[23,0,23,1],[24,0,24,1],[35,0,35,1]]}
[null,"Ministério do Desenvolvimento Regional  - MDR"]
[null,"Companhia de Desenvolvimento dos Vales do São Francisco e do Parnaíba"]
[null,"Gerência de Operação do PISF - Centro de Controle e Operação (AD / GOI / CCO)"]
[]
["SERVIÇOS DE OPERAÇÃO E MANUTENÇÃO DAS INFRAESTRUTURAS DO EIXO LESTE DO PROJETO DE INTEGRAÇÃO DO RIO SÃO FRANCISCO COM AS BACIAS HIDROGRÁFICAS DO NORDESTE SETENTRIONAL – PISF"]
[]
[]
[" ENCARGOS SOCIAIS E TRABALHISTAS E BENEFÍCIOS"]
[]
[]
["ITEM","DESCRIÇÃO","Mensalista Diurno"]
[]
["GRUPO \"A\"",null,"%"]
["A1","INSS (Art. 22 inciso I da Lei 8.212/91) ",0.2]
["A2","SESC/SESI (Art. 3° da Lei 8036/90)",1.4999999999999999E-2]
["A3","SENAC/SENAI (Decreto 2.318/86)",0.01]
["A4","INCRA  (Lei 7787 de 30/06/890e DL 1146/70)",2E-3]
["A5","SEBRAE (Art. 8° Lei 8029/90 e 8154 de 28/12/90)",6.0000000000000001E-3]
["A6","Salário Educação (Art. 3° inciso I Decreto 87.043/)",2.5000000000000001E-2]
["A7","Seguro contra Acidentes de Trabalho  (Decreto 3.048/1999, Anexo V e Decreto 6.957/2009)  ",0.03]
["A8","FGTS (Art. 15 da Lei 8030/90 art. 7° inciso III CF/88)",0.08]
["A8","SECONCI","-"]
[{"$f":"\"TOTAL - \"&A13&\" - (%):\"","v":"TOTAL - GRUPO \"A\" - (%):"},null,{"$f":"SUM(C14:C21)","v":0.36800000000000005}]
[]
["GRUPO \"B\"",null,"%"]
["B1","Repouso semanal remunerado","-"]
["B2","Feriados","-"]
["B3","Auxílio Enfermidade",7.1000000000000004E-3]
["B4","13º Salário",8.3299999999999999E-2]
["B5","Licença Paternidade Faltas justificadas",5.9999999999999995E-4]
["B6","Faltas Justificadas",5.5999999999999999E-3]
["B7","Dias de Chuva","-"]
["B8","Auxílio Acidente de Trabalho",8.9999999999999998E-4]
["B9","Férias Gozadas",5.8999999999999997E-2]
["B10","Salário Maternidade",2.0000000000000001E-4]
[{"$f":"\"TOTAL - \"&A25&\" - (%):\"","v":"TOTAL - GRUPO \"B\" - (%):"},null,{"$f":"SUM(C26:C35)","v":0.15669999999999998}]
[]
["GRUPO \"C\"",null,"%"]
["C1","Aviso Prévio Indenizado",3.7100000000000001E-2]
["C2","Aviso Prévio Trabalhado",8.9999999999999998E-4]
["C3","Férias Indenizadas",4.58E-2]
["C4","Depósito Rescisão sem Justa Causa",3.8100000000000002E-2]
["C5","Indenização Adicional",3.0999999999999999E-3]
[{"$f":"\"TOTAL - \"&A38&\" - (%):\"","v":"TOTAL - GRUPO \"C\" - (%):"},null,{"$f":"SUM(C39:C43)","v":0.125}]
[]
["GRUPO \"D\"",null,"%"]
["D1","Reincidência de Grupo A sobre Grupo B",{"$f":"C23*C36","v":5.7665599999999997E-2}]
["D2","Reincidência de Grupo A sobre C2 e Reincidência de A8 sobre C1",{"$f":"(C23*C40)+(C21*C39)","v":3.2992000000000004E-3}]
[{"$f":"\"TOTAL - \"&A46&\" - (%):\"","v":"TOTAL - GRUPO \"D\" - (%):"},null,{"$f":"SUM(C47:C48)","v":6.09648E-2}]
[]
["GRUPO \"E\"",null,"%"]
["E1","Auxílio Alimentação",0.04]
["E2","Equipamento de Proteção Individual - EPI",1.2999999999999999E-2]
["E3","Consultas e exames Médicos",5.0000000000000001E-3]
["E4","Seguro de Vida",3.0000000000000001E-3]
[{"$f":"\"TOTAL - \"&A51&\" - (%):\"","v":"TOTAL - GRUPO \"E\" - (%):"},null,{"$f":"SUM(C52:C55)","v":6.0999999999999999E-2}]
[]
[]
[{"$f":"\"RESUMO - \"&A$8","v":"RESUMO -  ENCARGOS SOCIAIS E TRABALHISTAS E BENEFÍCIOS"}]
["ITEM","DESCRIÇÃO","%"]
[1,{"$f":"A13","v":"GRUPO \"A\""},{"$f":"C23","v":0.36800000000000005}]
[2,{"$f":"A25","v":"GRUPO \"B\""},{"$f":"C36","v":0.15669999999999998}]
[3,{"$f":"A38","v":"GRUPO \"C\""},{"$f":"C44","v":0.125}]
[4,{"$f":"A46","v":"GRUPO \"D\""},{"$f":"C49","v":6.09648E-2}]
[5,{"$f":"A51","v":"GRUPO \"E\""},{"$f":"C56","v":6.0999999999999999E-2}]
[{"$f":"\"TOTAL - \"&A59&\" - (%):\"","v":"TOTAL - RESUMO -  ENCARGOS SOCIAIS E TRABALHISTAS E BENEFÍCIOS - (%):"},null,{"$f":"SUM(C61:C65)","v":0.77166480000000015}]
[]
[]
["NOME DO INFORMANTE:",null,"QUALIFICAÇÃO:"]
[]
["ASSINATURA:",null,"DATA:"]
[]
["OBSERVAÇÃO:"]
["1. Fonte: Sistema Nacional de Pesquisa de Custos e Índices da Construção (Tablea SINAPI - Composição de Encargos Sociais)."]
["2. Os percentuais dos encargos previdenciários e FGTS, a serem preenchidos na coluna %, são aqueles estabelecidos pela legislação vigente, incidentes sobre a remuneração"]

{"sheet":"Viagens_Diárias","index":12,"n_rows":44,"n_cols":7,"rows_kept":44,"cut":false,"hidden":false,"merged":[[10,1,11,1],[12,2,12,6],[23,0,23,5],[30,0,30,4],[30,5,30,6],[10,0,11,0],[10,2,11,2],[10,3,11,3],[10,4,11,4],[10,5,10,6],[14,2,14,6],[17,0,17,5],[19,2,19,6],[21,0,21,5],[38,0,38,6],[43,0,43,6],[44,0,44,6],[39,0,39,6],[35,0,35,4],[35,5,35,6],[36,0,36,4],[36,5,36,6],[37,0,37,6],[40,0,41,6],[42,0,42,6],[33,0,33,4],[33,5,33,6],[34,0,34,4],[34,5,34,6],[26,0,26,6],[27,2,27,4],[27,5,27,6],[29,2,29,4],[29,5,29,6],[28,2,28,4],[28,5,28,6],[0,2,0,6],[1,2,1,6],[2,2,2,6],[4,0,5,6],[7,0,7,6]]}
[null,null,"Ministério do Desenvolvimento Regional  - MDR"]
[null,null,"Companhia de Desenvolvimento dos Vales do São Francisco e do Parnaíba"]
[null,null,"Gerência de Operação do PISF - Centro de Controle e Operação (AD / GOI / CCO)"]
[]
["SERVIÇOS DE OPERAÇÃO E MANUTENÇÃO DAS INFRAESTRUTURAS DO EIXO LESTE DO PROJETO DE INTEGRAÇÃO DO RIO SÃO FRANCISCO COM AS BACIAS HIDROGRÁFICAS DO NORDESTE SETENTRIONAL – PISF"]
[]
[]
["VIAGENS / DIÁRIAS"]
[]
[]
["ITEM","CÓDIGO","DESCRIÇÃO","UNIDADE","QUANTIDADE","VALOR (R$)"]
[{"$nulls":5},"UNITARIO","TOTAL"]
[null,null,{"$f":"A8","v":"VIAGENS / DIÁRIAS"}]
[]
["1.",null,"DESPESAS COM VIAGENS COMERCIAIS"]
["1.1",null,"Viagem por via aerea","un",{"$f":"6*2","v":12},null,{"$f":"ROUND(E16*F16,2)","v":0}]
["1.2",null,"Viagem por via terrestre (comercial)","un",{"$f":"12*2","v":24},null,{"$f":"ROUND(E17*F17,2)","v":0}]
[{"$f":"\"TOTAL - \"&C15&\" - (R$):\"","v":"TOTAL - DESPESAS COM VIAGENS COMERCIAIS - (R$):"},{"$nulls":5},{"$f":"SUBTOTAL(9,G15:G17)","v":0}]
[]
["2.",null,"DESPESAS COM DIÁRIAS"]
["2.1",null,"Diárias nacionais","un",{"$f":"SUM(E16:E17)/2*3","v":54},null,{"$f":"ROUND(E21*F21,2)","v":0}]
[{"$f":"\"TOTAL - \"&C20&\" - (R$):\"","v":"TOTAL - DESPESAS COM DIÁRIAS - (R$):"},{"$nulls":5},{"$f":"SUBTOTAL(9,G20:G21)","v":0}]
[]
[{"$f":"\"TOTAL - \"&C13&\" - (R$):\"","v":"TOTAL - VIAGENS / DIÁRIAS - (R$):"},{"$nulls":5},{"$f":"SUBTOTAL(9,G13:G23)","v":0}]
[]
[]
[{"$f":"\"RESUMO - \"&A$8","v":"RESUMO - VIAGENS / DIÁRIAS"}]
["ITEM",null,"DESCRIÇÃO",null,null,"VALOR TOTAL (R$)"]
[1,null,{"$f":"C15","v":"DESPESAS COM VIAGENS COMERCIAIS"},null,null,{"$f":"G18","v":0}]
[2,null,{"$f":"C20","v":"DESPESAS COM DIÁRIAS"},null,null,{"$f":"G22","v":0}]
[{"$f":"\"TOTAL GERAL - \"&A$8&\" - (R$):\"","v":"TOTAL GERAL - VIAGENS / DIÁRIAS - (R$):"},{"$nulls":4},{"$f":"SUM(F29:G30)","v":0}]
[]
[]
["NOME DO INFORMANTE:",{"$nulls":4},"QUALIFICAÇÃO:"]
[]
["ASSINATURA:",{"$nulls":4},"DATA:"]
[]
["OBSERVAÇÃO:"]
["1. Os produtos serão pagos por demanda (Conforme efetiva utilização, mediante autorização prévia da fiscalização)"]
["2. O valor estimado para as passagens aéreas foi calculado conforme \"MEMORIAL DE CÁLCULO - VIAGENS\""]
["3. O valor adotado para a diária é o valor praticado pela Codevasf, conforme \"Tabela de Diárias da Codevasf\", considerando: diária completa; demais localidades; e empregados de nível superior, médio e operacional."]
[]
["4. Os quantitativos foram estimados de acordo com a quantidae de pessoal lotada no campo, e baseadas na quantidade de viagens que a equipe da Codevasf utiliza."]
["5. Os valores previstos são o máximo que serão pagos pela Codevasf durante todo o período do contrato."]

{"sheet":"CPU_Viagens","index":13,"n_rows":93,"n_cols":7,"rows_kept":93,"cut":false,"hidden":false,"merged":[[93,0,93,6],[82,1,82,4],[82,5,82,6],[91,0,91,6],[92,0,92,6],[87,0,87,4],[87,5,87,6],[88,0,88,4],[88,5,88,6],[89,0,89,4],[89,5,89,6],[90,0,90,6],[81,5,81,6],[83,0,83,4],[83,5,83,6],[86,0,86,4],[86,5,86,6],[81,1,81,4],[76,0,76,5],[79,0,79,6],[80,1,80,4],[80,5,80,6],[12,1,12,6],[10,4,10,6],[49,0,49,5],[51,1,51,6],[10,3,11,3],[10,0,11,0],[10,1,11,1],[10,2,11,2],[0,1,0,6],[1,1,1,6],[2,1,2,6],[4,0,5,6],[7,0,7,6]]}
[null,"Ministério do Desenvolvimento Regional  - MDR"]
[null,"Companhia de Desenvolvimento dos Vales do São Francisco e do Parnaíba"]
[null,"Gerência de Operação do PISF - Centro de Controle e Operação (AD / GOI / CCO)"]
[]
["SERVIÇOS DE OPERAÇÃO E MANUTENÇÃO DAS INFRAESTRUTURAS DO EIXO LESTE DO PROJETO DE INTEGRAÇÃO DO RIO SÃO FRANCISCO COM AS BACIAS HIDROGRÁFICAS DO NORDESTE SETENTRIONAL – PISF"]
[]
[]
["MEMORIAL DE CÁLCULO - VIAGENS"]
[]
[]
["ITEM","ORIGEM","DESTINO","COMPANHIA","VALOR (R$)"]
[{"$nulls":4},"TAXA","TRECHO","TOTAL"]
["1.","PASSAGENS AÉREAS"]
["1.1","Brasília (BSB)","Curitiba (CWB)","Azul",71,387,{"$f":"F14+E14","v":458}]
["1.2","Brasília (BSB)","Rio de Janeiro (GIG)","Azul",71,333,404]
["1.3","Brasília (BSB)","São Paulo (GRU)","Azul",71,164,235]
["1.4","Brasília (BSB)","Juazeiro do Norte (JDO)","Azul",91,604,695]
["1.5","Brasília (BSB)","Petrolina (PNZ)","Azul",85,544,629]
["1.6","Brasília (BSB)","Porto Alegre (POA)","Azul",77,467,544]
["1.7","Brasília (BSB)","Recife (REC)","Azul",71,292,363]
["1.8","Brasília (BSB)","Salvador (SSA)","Latam",73,418,491]
["1.9","Curitiba (CWB)","Rio de Janeiro (GIG)","Gol",73,200,273]
["1.10","Curitiba (CWB)","São Paulo (GRU)","Latam",73,117,190]
["1.11","Curitiba (CWB)","Juazeiro do Norte (JDO)","Azul",84,510,594]
["1.12","Curitiba (CWB)","Petrolina (PNZ)","Gol",109,755,864]
["1.13","Curitiba (CWB)","Porto Alegre (POA)","Azul",73,287,360]
["1.14","Curitiba (CWB)","Recife (REC)","Azul",108,746,854]
["1.15","Curitiba (CWB)","Salvador (SSA)","Azul",82,486,568]
["1.16","Rio de Janeiro (GIG)","São Paulo (GRU)","Gol",72,204,276]
["1.17","Rio de Janeiro (GIG)","Juazeiro do Norte (JDO)","Azul",80,497,577]
["1.18","Rio de Janeiro (GIG)","Petrolina (PNZ)","Azul",104,740,844]
["1.19","Rio de Janeiro (GIG)","Porto Alegre (POA)","Azul",81,505,586]
["1.20","Rio de Janeiro (GIG)","Recife (REC)","Azul",77,459,536]
["1.21","Rio de Janeiro (GIG)","Salvador (SSA)","Latam",87,550,637]
["1.22","São Paulo (GRU)","Juazeiro do Norte (JDO)","Gol",72,396,468]
["1.23","São Paulo (GRU)","Petrolina (PNZ)","Gol",98,654,752]
["1.24","São Paulo (GRU)","Porto Alegre (POA)","Latam",72,262,334]
["1.25","São Paulo (GRU)","Recife (REC)","Azul",80,478,558]
["1.26","São Paulo (GRU)","Salvador (SSA)","Azul",72,192,264]
["1.27","Juazeiro do Norte (JDO)","Petrolina (PNZ)","Azul",256,2294,2550]
["1.28","Juazeiro do Norte (JDO)","Porto Alegre (POA)","Azul",88,614,702]
["1.29","Juazeiro do Norte (JDO)","Recife (REC)","Azul",66,130,196]
["1.30","Juazeiro do Norte (JDO)","Salvador (SSA)","Azul",66,333,399]
["1.31","Petrolina (PNZ)","Porto Alegre (POA)","Azul",96,695,791]
["1.32","Petrolina (PNZ)","Recife (REC)","Azul",66,218,284]
["1.33","Petrolina (PNZ)","Salvador (SSA)","Passaredo",65,235,300]
["1.34","Porto Alegre (POA)","Recife (REC)","Latam",89,568,657]
["1.35","Porto Alegre (POA)","Salvador (SSA)","Latam",80,474,554]
["1.36","Recife (REC)","Salvador (SSA)","Azul",73,193,266]
[{"$f":"\"VALOR MÉDIO - \"&B13&\" - (R$):\"","v":"VALOR MÉDIO - PASSAGENS AÉREAS - (R$):"},{"$nulls":5},{"$f":"ROUND(AVERAGE(G13:G49),2)","v":557.03}]
[]
["2.","PASSAGENS TERRESTRES"]
["2.1","Brasília (BSB)","Curitiba (CWB)","Real Expresso",0,275.89999999999998,{"$f":"F53+E53","v":275.89999999999998}]
["2.2","Brasília (BSB)","Rio de Janeiro (GIG)","Util",0,196.67,{"$f":"F54+E54","v":196.67}]
["2.3","Brasília (BSB)","São Paulo (GRU)","Real Expresso",0,289,289]
["2.4","Brasília (BSB)","Juazeiro do Norte (JDO)","Guanabara",0,311.47000000000003,311.47000000000003]
["2.5","Brasília (BSB)","Petrolina (PNZ)","Guanabara",0,288.47000000000003,288.47000000000003]
["2.6","Brasília (BSB)","Porto Alegre (POA)","Real Expresso",0,416.42,416.42]
["2.7","Brasília (BSB)","Recife (REC)","Expresso São Luiz",0,407.91,407.91]
["2.8","Brasília (BSB)","Salvador (SSA)","Rápido Federal",0,309.01,309.01]
["2.9","Curitiba (CWB)","Rio de Janeiro (GIG)","Penha",0,202.64,202.64]
["2.10","Curitiba (CWB)","São Paulo (GRU)","Eucatur",0,54.02,54.02]
["2.11","Curitiba (CWB)","Porto Alegre (POA)","Catarinense",0,159.99,{"$f":"F63+E63","v":159.99}]
["2.12","Rio de Janeiro (GIG)","São Paulo (GRU)","Kaissara",0,109.99,109.99]
["2.13","Rio de Janeiro (GIG)","Porto Alegre (POA)","Penha",0,405.97,405.97]
["2.14","Rio de Janeiro (GIG)","Recife (REC)","Itapemirim",0,419.99,419.99]
["2.15","Rio de Janeiro (GIG)","Salvador (SSA)","Kaissara",0,359.98,359.98]
["2.16","São Paulo (GRU)","Porto Alegre (POA)","Penha",0,239.79,239.79]
["2.17","São Paulo (GRU)","Recife (REC)","Itapemirim",0,400.19,400.19]
["2.18","Juazeiro do Norte (JDO)","Recife (REC)","Cruzeiro",0,137.5,137.5]
["2.19","Petrolina (PNZ)","Recife (REC)","Cruzeiro",0,150.30000000000001,150.30000000000001]
["2.20","Petrolina (PNZ)","Salvador (SSA)","Marte",0,89.99,89.99]
["2.21","Recife (REC)","Salvador (SSA)","Guanabara",0,99.9,99.9]
["2.22","Brasília (BSB)","Salgueiro (SGI)","Guanabara",0,344.77,{"$f":"F74+E74","v":344.77}]
["2.23","Petrolina (PNZ)","Salgueiro (SGI)","Cruzeiro",0,56.2,56.2]
["2.24","Recife (REC)","Salgueiro (SGI)","Cruzeiro",0,102.3,102.3]
[{"$f":"\"VALOR MÉDIO - \"&B52&\" - (R$):\"","v":"VALOR MÉDIO - PASSAGENS TERRESTRES - (R$):"},{"$nulls":5},{"$f":"ROUND(AVERAGE(G52:G76),2)","v":242.85}]
[]
[]
[{"$f":"\"RESUMO - \"&A$8","v":"RESUMO - MEMORIAL DE CÁLCULO - VIAGENS"}]
["ITEM","DESCRIÇÃO",null,null,null,"VALOR TOTAL (R$)"]
[1,{"$f":"B13","v":"PASSAGENS AÉREAS"},null,null,null,{"$f":"G50","v":557.03}]
[2,{"$f":"B52","v":"PASSAGENS TERRESTRES"},null,null,null,{"$f":"G77","v":242.85}]
[{"$f":"\"MÉDIA GERAL - \"&A$8&\" - (R$):\"","v":"MÉDIA GERAL - MEMORIAL DE CÁLCULO - VIAGENS - (R$):"},{"$nulls":4},{"$f":"ROUND(AVERAGE(F82:G83),2)","v":399.94}]
[]
[]
["NOME DO INFORMANTE:",{"$nulls":4},"QUALIFICAÇÃO:"]
[]
["ASSINATURA:",{"$nulls":4},"DATA:"]
[]
["OBSERVAÇÃO:"]
["1. Fonte de Preço: www.decolar.com. Considerando menores preços e companhias aéreas para registro do preço."]
["2. Data de pesquisa: 09/10/2019 . Período Pesquisado: 1ª Semana de Novembro/2019"]

{"sheet":"Veiculos","index":14,"n_rows":36,"n_cols":7,"rows_kept":36,"cut":false,"hidden":false,"merged":[[0,2,0,6],[1,2,1,6],[2,2,2,6],[4,0,5,6],[7,0,7,6],[36,0,36,6],[19,0,19,5],[22,0,22,6],[23,2,23,4],[23,5,23,6],[24,2,24,4],[32,0,32,6],[33,0,33,6],[24,5,24,6],[25,0,25,4],[25,5,25,6],[30,0,30,4],[31,0,31,4],[28,5,28,6],[29,5,29,6],[30,5,30,6],[12,2,12,6],[28,0,28,4],[29,0,29,4],[35,0,35,6],[10,1,11,1],[34,0,34,6],[10,0,11,0],[10,2,11,2],[10,3,11,3],[10,4,11,4],[10,5,10,6],[31,5,31,6]]}
[null,null,"Ministério do Desenvolvimento Regional  - MDR"]
[null,null,"Companhia de Desenvolvimento dos Vales do São Francisco e do Parnaíba"]
[null,null,"Gerência de Operação do PISF - Centro de Controle e Operação (AD / GOI / CCO)"]
[]
["SERVIÇOS DE OPERAÇÃO E MANUTENÇÃO DAS INFRAESTRUTURAS DO EIXO LESTE DO PROJETO DE INTEGRAÇÃO DO RIO SÃO FRANCISCO COM AS BACIAS HIDROGRÁFICAS DO NORDESTE SETENTRIONAL – PISF"]
[]
[]
["VEÍCULOS AUTOMOTORES"]
[]
[]
["ITEM","CÓDIGO","DESCRIÇÃO","UNIDADE","QUANTIDADE","VALOR (R$)"]
[{"$nulls":5},"UNITARIO","TOTAL"]
["1.",null,"VEÍCULOS AUTOMOTORES"]
["1.1","B3","Veículo Leve - Tipo Hatch 1.4 Flex (85 CV)","un x mês",{"$f":"SUMIF(#REF!,Veiculos!C14,#REF!)","v":{"$error":"#REF!"}},null,{"$f":"ROUND(E14*F14,2)","v":{"$error":"#REF!"}}]
["1.2","B4","Veículo Leve - Tipo Sedan 1.6 Flex (115 CV)","un x mês",{"$f":"SUMIF(#REF!,Veiculos!C15,#REF!)","v":{"$error":"#REF!"}},null,{"$error":"#REF!"}]
["1.3","B11","Veículo Tipo Pick Up Cabine Dupla 4 x 4 (163 CV)","un x mês",{"$f":"SUMIF(#REF!,Veiculos!C16,#REF!)","v":{"$error":"#REF!"}},null,{"$error":"#REF!"}]
["1.4","B7","Veículo - Tipo Microônibus - 28 assentos (150 CV) - COM MOTORISTA","un x mês",{"$f":"SUMIF(#REF!,Veiculos!C17,#REF!)","v":{"$error":"#REF!"}},null,{"$error":"#REF!"}]
["1.5","B8","Veículo - Tipo Ônibus - 45 assentos (218 CV) - COM MOTORISTA","un x mês",{"$f":"SUMIF(#REF!,Veiculos!C18,#REF!)","v":{"$error":"#REF!"}},null,{"$error":"#REF!"}]
["1.6","B6","Veículo Utilitário - Tipo Van - 16 assentos (129 CV) - COM MOTORISTA","un x mês",{"$f":"SUMIF(#REF!,Veiculos!C19,#REF!)","v":{"$error":"#REF!"}},null,{"$error":"#REF!"}]
[{"$f":"\"TOTAL - \"&C13&\" - (R$):\"","v":"TOTAL - VEÍCULOS AUTOMOTORES - (R$):"},{"$nulls":5},{"$f":"SUBTOTAL(9,G13:G19)","v":{"$error":"#REF!"}}]
[]
[]
[{"$f":"\"RESUMO - \"&A$8","v":"RESUMO - VEÍCULOS AUTOMOTORES"}]
["ITEM",null,"DESCRIÇÃO",null,null,"VALOR TOTAL (R$)"]
[1,null,{"$f":"C13","v":"VEÍCULOS AUTOMOTORES"},null,null,{"$f":"G20","v":{"$error":"#REF!"}}]
[{"$f":"\"TOTAL GERAL - \"&A23&\" - (R$):\"","v":"TOTAL GERAL - RESUMO - VEÍCULOS AUTOMOTORES - (R$):"},{"$nulls":4},{"$f":"SUM(F25:G25)","v":{"$error":"#REF!"}}]
[]
[]
["NOME DO INFORMANTE:",{"$nulls":4},"QUALIFICAÇÃO:"]
[]
["ASSINATURA:",{"$nulls":4},"DATA:"]
[]
["OBSERVAÇÃO:"]
[{"$f":"#REF!","v":{"$error":"#REF!"}}]
[{"$f":"#REF!","v":{"$error":"#REF!"}}]
[{"$f":"#REF!","v":{"$error":"#REF!"}}]

{"sheet":"Frentes_Moveis","index":15,"n_rows":38,"n_cols":7,"rows_kept":38,"cut":false,"hidden":false,"merged":[[31,0,31,6],[12,2,12,6],[16,0,16,5],[19,0,19,6],[20,5,20,6],[21,5,21,6],[22,5,22,6],[20,2,20,4],[21,2,21,4],[22,0,22,4],[29,0,29,6],[25,0,25,4],[26,0,26,4],[27,0,27,4],[28,0,28,4],[26,5,26,6],[27,5,27,6],[28,5,28,6],[7,0,7,6],[30,0,30,6],[10,0,11,0],[10,2,11,2],[10,3,11,3],[10,4,11,4],[10,5,10,6],[10,1,11,1],[4,0,5,6],[0,2,0,6],[1,2,1,6],[2,2,2,6],[25,5,25,6]]}
[null,null,"Ministério do Desenvolvimento Regional  - MDR"]
[null,null,"Companhia de Desenvolvimento dos Vales do São Francisco e do Parnaíba"]
[null,null,"Gerência de Operação do PISF - Centro de Controle e Operação (AD / GOI / CCO)"]
[]
["SERVIÇOS DE OPERAÇÃO E MANUTENÇÃO DAS INFRAESTRUTURAS DO EIXO LESTE DO PROJETO DE INTEGRAÇÃO DO RIO SÃO FRANCISCO COM AS BACIAS HIDROGRÁFICAS DO NORDESTE SETENTRIONAL – PISF"]
[]
[]
["FRENTES MÓVEIS DE LIMPEZA E CONSERVAÇÃO"]
[]
[]
["ITEM","ITEM","DESCRIÇÃO","UNIDADE","QUANTIDADE","VALOR (R$)"]
[{"$nulls":5},"UNITARIO","TOTAL"]
["1.",null,"FRENTES MÓVEIS DE LIMPEZA E CONSERVAÇÃO"]
["1.1","00303 - ORSE (5)","Tenda Piramidal 5m x 5m (para refeitório)","un x mês",{"$f":"8*12","v":96},null,{"$f":"ROUND(E14*F14,2)","v":0}]
["1.2","00303 - ORSE (3)","Tenda Piramidal 3m x 3m ","un x mês",{"$f":"8*12","v":96},null,{"$f":"ROUND(E15*F15,2)","v":0}]
["1.3","10390 - ORSE/SE","Banheiro Químico, com 03 limpezas semanais","un x mês",{"$f":"7*3*12","v":252},null,{"$f":"ROUND(E16*F16,2)","v":0}]
[{"$f":"\"TOTAL - \"&C13&\" - (R$):\"","v":"TOTAL - FRENTES MÓVEIS DE LIMPEZA E CONSERVAÇÃO - (R$):"},{"$nulls":5},{"$f":"SUBTOTAL(9,G14:G16)","v":0}]
[]
[]
[{"$f":"\"RESUMO - \"&A$8","v":"RESUMO - FRENTES MÓVEIS DE LIMPEZA E CONSERVAÇÃO"}]
["ITEM",null,"DESCRIÇÃO",null,null,"VALOR TOTAL (R$)"]
["01",null,{"$f":"C13","v":"FRENTES MÓVEIS DE LIMPEZA E CONSERVAÇÃO"},null,null,{"$f":"G17","v":0}]
[{"$f":"\"TOTAL GERAL - \"&A$8&\" - (R$):\"","v":"TOTAL GERAL - FRENTES MÓVEIS DE LIMPEZA E CONSERVAÇÃO - (R$):"},{"$nulls":4},{"$f":"SUM(F22)","v":0}]
[]
[]
["NOME DO INFORMANTE:",{"$nulls":4},"QUALIFICAÇÃO:"]
[]
["ASSINATURA:",{"$nulls":4},"DATA:"]
[]
["OBSERVAÇÃO:"]
[]
[]
[]
[]
[null,"Código","Descrição","R$/m²","R$/un","R$/(un x mês)"]
[null,"00303 - ORSE (5)","Tenda Piramidal 5m x 5m (para refeitório)",187.27,{"$f":"(5*5)*D36","v":4681.75},{"$f":"ROUND(E36/12,2)","v":390.15}]
[null,"00303 - ORSE (3)","Tenda Piramidal 3m x 3m ",{"$f":"D36","v":187.27},{"$f":"(3*3)*D37","v":1685.43},{"$f":"ROUND(E37/12,2)","v":140.44999999999999}]
[null,"10390 - ORSE/SE","Banheiro Químico, com limpezas diárias",null,null,535.9]

{"sheet":"Materiais_Consumo","index":16,"n_rows":201,"n_cols":7,"rows_kept":201,"cut":false,"hidden":false,"merged":[[129,0,129,5],[131,2,131,6],[10,1,11,1],[10,2,11,2],[10,3,11,3],[14,2,14,6],[71,0,71,5],[73,2,73,6],[10,4,11,4],[10,5,10,6],[10,0,11,0],[12,2,12,6],[0,2,0,6],[1,2,1,6],[2,2,2,6],[4,0,5,6],[7,0,7,6],[177,0,177,5],[179,2,179,6],[182,0,182,5],[200,0,200,6],[184,0,184,5],[193,0,193,4],[193,5,193,6],[187,0,187,6],[188,2,188,4],[192,2,192,4],[192,5,192,6],[191,2,191,4],[191,5,191,6],[190,2,190,4],[190,5,190,6],[188,5,188,6],[189,2,189,4],[202,0,202,6],[196,0,197,4],[196,5,196,6],[197,5,197,6],[198,0,199,4],[198,5,198,6],[199,5,199,6],[189,5,189,6],[201,0,201,6]]}
[null,null,"Ministério do Desenvolvimento Regional  - MDR"]
[null,null,"Companhia de Desenvolvimento dos Vales do São Francisco e do Parnaíba"]
[null,null,"Gerência de Operação do PISF - Centro de Controle e Operação (AD / GOI / CCO)"]
[]
["SERVIÇOS DE OPERAÇÃO E MANUTENÇÃO DAS INFRAESTRUTURAS DO EIXO LESTE DO PROJETO DE INTEGRAÇÃO DO RIO SÃO FRANCISCO COM AS BACIAS HIDROGRÁFICAS DO NORDESTE SETENTRIONAL – PISF"]
[]
[]
["MATERIAL DE CONSUMO - ALMOXARIFADOS"]
[]
[]
["ITEM","CÓDIGO","DESCRIÇÃO","UNIDADE","QUANTIDADE","VALOR (R$)"]
[{"$nulls":5},"UNITARIO","TOTAL"]
[null,null,{"$f":"A8","v":"MATERIAL DE CONSUMO - ALMOXARIFADOS"}]
[]
["1.",null,"MATERIAL DE CONSUMO - MECÂNICA"]
["1.1","04791 - SINAPI","Adesivo Acrílico / Cola de contato","un",480,null,{"$f":"ROUND(E16*F16,2)","v":0}]
["1.2","05318 - SINAPI","Água Raz - galão  5 l","un",112,null,{"$f":"ROUND(E17*F17,2)","v":0}]
["1.3","F030000301 - EMBASA/BA","Alcool Comum 90º GL","l",1200,null,0]
["1.4",null,"Antiferrugem aerosol WD-40 - tubo de 300 ml","un",289,null,0]
["1.5",null,"Antiespumante – antiespumante a base de silicone","l",223,null,0]
["1.6","00337 - SINAPI","Arame recozido n.º 18","kg",2400,null,0]
["1.7","00122 - SINAPI","Cola de PVC com 850 g","un",144,null,0]
["1.8",null,"Cola Ultra Gray 70g","un",144,null,0]
["1.9",null,"Cola para junta de motores com 73g","un",1200,null,0]
["1.10",null,"Convertedor de ferrugem","un",445,null,0]
["1.11","038200 - SINAPI","Corda de bombeiro 12mm em nylon trançado (rolo de 100,00m)","m",3200,null,0]
["1.12","004221 - SINAPI","Diesel comum (l)","l",4800,null,0]
["1.13","026019 - SINAPI","Disco corte abrasivo 7\" x 1/8\" x 7/8\"","un",434,null,0]
["1.14","025931 - SINAPI","Disco de corte diamantado - 7\", para esmerilhadeira, segmentado, para concreto","un",434,null,0]
["1.15","026018 - SINAPI","Disco de corte para estrutura metálica 300 x 3,2 x 19,05 mm","un",434,null,0]
["1.16","026019 - SINAPI","Disco de desbaste para estrutura metálica de 9\" x 1/4\" x 7/8\" ( 225 x 6,25 x 21,87 mm)","un",434,null,0]
["1.17","010997 - SINAPI","Eletrodos Revestido AWS-E7018, DN 4 mm","kg",320,null,0]
["1.18","10997 - SINAPI/PE","Eletrodos Revestido AWS-E7018, DN 6 mm","kg",320,null,0]
["1.19","000012 - SINAPI","Escova de aço para remoção da graxa envelhecida dos cabos de aço","un",160,null,0]
["1.20","000013 - SINAPI","Estopa - embalagem 20 kg","kg",294,null,0]
["1.21","000404 - SINAPI","Fita auto fusão 19 mm x 10 m","un",194,null,0]
["1.22","012815 - SINAPI","Fita crepe adesiva 25mm x 50mm ","un",194,null,0]
["1.23","020111 - SINAPI","Fita isolante 19 mm x 20 m","un",194,null,0]
["1.24","004222 - SINAPI","Gasolina Comum","l",2400,null,0]
["1.25",null,"Graxa a base de lítio NGLI 2","kg",478,null,0]
["1.26",null,"Graxa a base de lítio NGLI 3","kg",478,null,0]
["1.27",null,"Graxa com dissulfeto de molibidênio (MoS2) - Lata 500 g","un",478,null,0]
["1.28",null,"Graxa GMA - 2","kg",478,null,0]
["1.29",null,"Graxa de Alta Resistência a Carga, Pressão LGEP 2/1. Aplicação: graxa para motor e bomba","kg",478,null,0]
["1.30",null,"Graxa de Alta Resistência a Carga, Pressão LGEP 2/1. Aplicação: Engrenagens de roda e engrenagens expostas","kg",478,null,0]
["1.31",null,"Hidróxido de cálcio ","kg",600,null,0]
["1.32",null,"Hipoclorito de sódio","kg",1200,null,0]
["1.33","8216 - ORSE","Lâmina de serra para metal  Starret ou similar","un",667,null,0]
["1.34","I1660 - SEINFRA/CE","Lençol de borracha manta 3/16” 4,8mm","m²",400,null,0]
["1.35",null,"Líquido penetrante visível lavável à água (Ensaios de Líquido Penetrante)","un",98,null,0]
["1.36","003767 - SINAPI","Lixa nº120","un",2400,null,0]
["1.37",null,"Lona de borracha com alma 1,0 – 4,8 mm esp.","m",45,null,0]
["1.38","003777 - SINAPI/PE","Lona plástica - 4 x 100 m - 12 kg","m²",{"$f":"800*4","v":3200},null,0]
["1.39","037459 - SINAPI","Mangueira Cristal, Lisa PVC transparente, 3/4\" x 2 mm","m",1600,null,0]
["1.40",null,"Mangueira FLG-62/1 0 - 150 PSI 1/4\" NPT","m",800,null,0]
["1.41","7696 - ORSE","Massa calafetar cinza-Durepox ou similiar","kg",334,null,0]
["1.42",null,"Óleo - Translação pórtico e ponte e direção do carro - 20 l -  Óleo EP 220","l",334,null,0]
["1.43",null,"Óleo Hidràulico para os componentes não protegido dos Servomotor Hidráulico - Óleo EP 320","l",334,null,0]
["1.44",null,"Óleo Lubrificante Redutor - Óleo SAE 90","l",334,null,0]
["1.45",null,"Óleo lubrificante, para engrenagem., EP-5, viscosidade (CSt) ( - 40ºC) = 22 - tambor 20 l","l",334,null,0]
["1.46",null,"PAC – Policloreto de alumínio (5 l)","l",967,null,0]
["1.47",null,"Papelão grafitado 1,50 m x 1,60 m Esp 2.4","m",45,null,0]
["1.48",null,"Pasta de Limpeza","kg",967,null,0]
["1.49",null,"Polímero aniônico","kg",967,null,0]
["1.50","004224 - SINAPI","Querosene para limpeza ","l",967,null,0]
["1.51",null,"Revelador não aquoso D70 (Ensaios de Líquido Penetrante)","un",98,null,0]
["1.52",null,"Sílica Gel","kg",98,null,0]
["1.53","039961 - SINAPI","Silicone (acético branca) - Tubo de 280g","un",480,null,0]
["1.54",null,"Trava química","un",192,null,0]
["1.55","004869 - SBC","Vaselina sólida anti-inflamável","kg",480,null,{"$f":"ROUND(E70*F70,2)","v":0}]
[]
[{"$f":"\"TOTAL - \"&C15&\" - (R$):\"","v":"TOTAL - MATERIAL DE CONSUMO - MECÂNICA - (R$):"},{"$nulls":5},{"$f":"SUBTOTAL(9,G15:G71)","v":0}]
[]
["2.",null,"MATERIAL DE CONSUMO - ELÉTRICA"]
["2.1","00181 - ORSE","Anilha Identificação - 0,5 a 6mm² (pacote com 100 unidades)","un",10,null,{"$f":"ROUND(E75*F75,2)","v":0}]
["2.2","00181 - ORSE","Anilha Identificação - 10 a 16mm² (pacote com 100 unidades)","un",10,null,0]
["2.3","03875 - ORSE","Anilha Identificação - 25 a 70mm² (pacote com 100 unidades)","un",10,null,0]
["2.4","03875 - ORSE","Anilha Identificação - 95 a 120mm² (pacote com 100 unidades)","un",10,null,0]
["2.5","03531 - ORSE","Ar comprimido seco  Aerossol 300ml","un",400,null,0]
["2.6","00993 - SINAPI","Cabo cobre flexível classe 4 ou 5 isolação PVC/A M 1,68 e cobertura PVC-ST1 antichama BWF-B 0,6/1 kV 1,5mm²","m",6000,null,0]
["2.7","01022 - SINAPI","Cabo cobre flexível classe 4 ou 5 isolação PVC/A M 1,68 e cobertura PVC-ST1 antichama BWF-B 0,6/1 kV 2,5mm²","m",6000,null,0]
["2.8","01003 - SINAPI","Cabo cobre flexível classe 4 ou 5 isolação PVC/A M 1,68 e cobertura PVC-ST1 antichama BWF-B 0,6/1 kV 4mm²","m",2000,null,0]
["2.9","00994 - SINAPI","Cabo cobre flexível classe 4 ou 5 isolação PVC/A M 1,68 e cobertura PVC-ST1 antichama BWF-B 0,6/1 kV 6mm²","m",2000,null,0]
["2.10","01020 - SINAPI","Cabo cobre flexível classe 4 ou 5 isolação PVC/A M 1,68 e cobertura PVC-ST1 antichama BWF-B 0,6/1 kV 10mm²","m",1000,null,0]
["2.11","00995 - SINAPI","Cabo cobre flexível classe 4 ou 5 isolação PVC/A M 1,68 e cobertura PVC-ST1 antichama BWF-B 0,6/1 kV 16mm²","m",1000,null,0]
["2.12","00996 - SINAPI","Cabo cobre flexível classe 4 ou 5 isolação PVC/A M 1,68 e cobertura PVC-ST1 antichama BWF-B 0,6/1 kV 25mm²","m",600,null,0]
["2.13","01019 - SINAPI","Cabo cobre flexível classe 4 ou 5 isolação PVC/A M 1,68 e cobertura PVC-ST1 antichama BWF-B 0,6/1 kV 35mm²","m",500,null,0]
["2.14","01018 - SINAPI","Cabo cobre flexível classe 4 ou 5 isolação PVC/A M 1,68 e cobertura PVC-ST1 antichama BWF-B 0,6/1 kV 50mm²","m",500,null,0]
["2.15","00977 - SINAPI","Cabo cobre flexível classe 4 ou 5 isolação PVC/A M 1,68 e cobertura PVC-ST1 antichama BWF-B 0,6/1 kV 70mm²","m",500,null,0]
["2.16","00998 - SINAPI","Cabo cobre flexível classe 4 ou 5 isolação PVC/A M 1,68 e cobertura PVC-ST1 antichama BWF-B 0,6/1 kV 95mm²","m",200,null,0]
["2.17","01017 - SINAPI","Cabo cobre flexível classe 4 ou 5 isolação PVC/A M 1,68 e cobertura PVC-ST1 antichama BWF-B 0,6/1 kV 120mm²","m",200,null,0]
["2.18","25005 - SINAPI","Cabo de alumínio nu bitola 1/0 AWG (kg)","kg",600,null,0]
["2.19","00842 - SINAPI","Cabo de alumínio nu bitola 4/0 AWG (kg)","kg",1200,null,0]
["2.20","00863 - SINAPI","Cabo de cobre nu, eletrolítico, têmpera meio duro, #35mm² (m)","m",500,null,0]
["2.21","00867 - SINAPI","Cabo de cobre nu, eletrolítico, têmpera meio duro, #50mm² (m)","m",500,null,0]
["2.22","00864 - SINAPI","Cabo de cobre nu, eletrolítico, têmpera meio duro, #70mm² (m)","m",500,null,0]
["2.23","09720 - ORSE","Conector para haste aterramento #35mm² GTDU","un",50,null,0]
["2.24","09720 - ORSE","Conector para haste aterramento #50mm² GTDU","un",40,null,0]
["2.25","09720 - ORSE","Conector para haste aterramento #70mm² GTDU","un",40,null,0]
["2.26","11602 - ORSE","Filtro de ventiladores de painéis","un",180,null,0]
["2.27",null,"Filtro dos motores do eixo leste EBV4, 5 e 6 (fabricante Aeroglass-ref 11140737)","un",48,null,0]
["2.28",null,"Filtro dos motores do eixo leste EBV1, 2 e 3 (fabricante Aeroglass-modelo FMT_C2015 inox - 345x925x25mm)","un",64,null,0]
["2.29","02643 - ORSE","Fita isolante de borracha autofusão impermeável à prova dágua , até 69 kV (alta tensão)- 19mm x 10m","un",756,null,0]
["2.30","020111 - SINAPI","Fita isolante adesiva antichama 19mm x 20m","un",1512,null,0]
["2.31","01118 - ORSE","Interruptor simples com 01 tecla","un",4,null,0]
["2.32","01119 - ORSE","Interruptor simples com 02 teclas","un",4,null,0]
["2.33","38070 - SINAPI","Interruptor tipo three-way (paralelos) com 02 teclas","un",4,null,0]
["2.34",null,"Limpador de contatos elétricos 300ml","un",200,null,0]
["2.35","004221 - SINAPI","Diesel comum (l)","l",9720,null,0]
["2.36",null,"Pano para limpeza"," kg ",50,null,0]
["2.37","11443 - ORSE","Pincel - kit 03 pincéis 1/2\" 1\" 1.1/2\"","un",76,null,0]
["2.38",null,"Recarga de gás SF6 (hexafluoreto de enxofre) -52,16 kg","un",2,null,0]
["2.39",null,"Sabão líquido neutro (5 l)","un",54,null,0]
["2.40","02922 - ORSE","Solvente/Desengraxante de alta rigidez dielétrica  1l","un",36,null,0]
["2.41","12377 - ORSE*","Terminal isolado tipo agulha para condutores de 0,5 a 1,5mm² (pct c/ 100)","un",300,null,0]
["2.42","12377 - ORSE*","Terminal isolado tipo agulha para condutores de 1,5 a 2,5 mm² (pct c/ 100)","un",300,null,0]
["2.43","07948 - ORSE*","Terminal isolado tipo agulha para condutores de 4 a 6 mm² (pct c/ 100)","un",300,null,0]
["2.44","04669 - ORSE","Terminal de compressão – 10mm²","un",400,null,0]
["2.45","04670 - ORSE","Terminal de compressão – 16mm²","un",400,null,0]
["2.46","02676 - ORSE","Terminal de compressão – 25mm²","un",200,null,0]
["2.47","02677 - ORSE","Terminal de compressão – 35mm²","un",200,null,0]
["2.48","03559 - ORSE","Terminal de compressão – 50mm²","un",100,null,0]
["2.49","06911 - ORSE","Terminal de compressão – 70mm²","un",100,null,0]
["2.50","03153 - ORSE","Terminal de compressão – 95mm²","un",50,null,0]
["2.51","04673 - ORSE","Terminal de compressão – 120mm²","un",50,null,0]
["2.52","01587 - SINAPI","Terminal de pressão – 35mm²","un",50,null,0]
["2.53","01588 - SINAPI","Terminal de pressão – 50mm²","un",40,null,0]
["2.54","01589 - SINAPI","Terminal de pressão – 70mm²","un",40,null,{"$f":"ROUND(E128*F128,2)","v":0}]
[]
[{"$f":"\"TOTAL - \"&C74&\" - (R$):\"","v":"TOTAL - MATERIAL DE CONSUMO - ELÉTRICA - (R$):"},{"$nulls":5},{"$f":"SUBTOTAL(9,G74:G129)","v":0}]
[]
["3.",null,"MATERIAL DE CONSUMO - CIVIL"]
["3.1","00034 - SINAPI","Aço D=10 mm CA 50","kg",3112,null,{"$f":"ROUND(E133*F133,2)","v":0}]
["3.2","00031 - SINAPI","Aço D=12 mm CA 50","kg",3112,null,0]
["3.3","00039 - SINAPI","Aço D=5.0 mm CA 60","kg",3112,null,0]
["3.4","00032 - SINAPI","Aço D=6.3 mm CA 50","kg",3112,null,0]
["3.5","00033 - SINAPI","Aço D=8.0 mm CA 50","kg",3112,null,0]
["3.6","00340 - SINAPI","Arame farpado nº. 16 galvanizado Simples","m",2223,null,0]
["3.7","00334 - SINAPI","Arame galvanizado 8BWG, d=4,19mm","kg",240,null,0]
["3.8","00337 - SINAPI","Arame recozido n.º 18","kg",134,null,0]
["3.9","00367 - SINAPI","Areia grossa comercial, posto em obra","m³",178,null,0]
["3.10","6884 - ORSE","Argamassa para grouteamento ","kg",1112,null,0]
["3.11","004729 - SINAPI","Pedra britada comercial (n.º 0 a 5)","m³",223,null,0]
["3.12","04513 - SINAPI","Caibro de 5x5cm ","m",1334,null,0]
["3.13","001106 - SINAPI","Cal hidratada","kg",889,null,0]
["3.14","001379 - SINAPI","Cimento CPII-32","kg",111112,null,0]
["3.15","001358 - SINAPI","Compensado resinado 17mm","m²",96,null,0]
["3.16","002692 - SINAPI","Desmoldante","l",86,null,0]
["3.17","004221 - SINAPI","Diesel comum (l)","l",56000,null,0]
["3.18","020111 - SINAPI","Fita isolante adesiva antichama 19mm x 20m","un",16,null,0]
["3.19"," M2018 - SICRO3/PE","Gastalho 10x2,5cm","m",1334,null,0]
["3.20","005076 - SINAPI","Grampo para cerca galvanizado 1 x 9","kg",96,null,0]
["3.21","003681 - SINAPI","Junta de dilatação (O-22 ou similar)","m",134,null,0]
["3.22","014077 - SINAPI","Junta de dilatação - Perfil elastomerico pre-formado em epmd, para junta de dilatacao de pisos com pouca solicitacao, 15 mm de largura, movimentacao de 11 a 19 mm","m",134,null,0]
["3.23","38780 - SINAPI/PE","Lâmpada fluorescente compacta, branca 20 W, base E27 (127/220 V)","un",134,null,0]
["3.24","038780 - SINAPI","Lâmpada fluorecente de 20W","un",134,null,0]
["3.25","003751 - SINAPI","Lâmpada vapor mercúrio 400 W (base E40)","un",16,null,0]
["3.26","003767 - SINAPI","Lixa nº120","un",40,null,0]
["3.27","003777 - SINAPI","Lona plástica - 4 x 100m - 12kg","m²",{"$f":"2*4","v":8},null,0]
["3.28","025865 - SINAPI","Manta termoplástica PEAD, geomembrana lisa, e=2 mm","m²",734,null,0]
["3.29","004051 - SINAPI","Massa corrida - latão 18 l","un",23,null,0]
["3.30","2866 - ORSE","Mastique elástico base silicone","l",67,null,0]
["3.31","004108 - SINAPI","Mourão de concreto reto para cercas","un",224,null,0]
["3.32",null,"Perfil para fixação das geomembrana Barra de 6m ","m",134,null,0]
["3.33","11442 - ORSE","Pincel 1\"","un",89,null,0]
["3.34","005075 - SINAPI","Prego 18x30","kg",214,null,0]
["3.35","038390 - SINAPI","Rolo de lã de carneiro - 20cm ","un",89,null,0]
["3.36","038393 - SINAPI","Rolo de espuma poliéster 23 cm com cabo","un",89,null,0]
["3.37","012296 - SINAPI","Soquete de porcelana base E27, para uso ao tempo, para lâmpadas","un",16,null,0]
["3.38","0093 - SINAPI","Tábua de madeira de lei, 2,5x15cm (1x6) não aparelhada","m",223,null,0]
["3.39","005318 - SINAPI*","Thinner/águarras - 5 l","un",9,null,0]
["3.40","07258 - SINAPI","Tijolo comum (5,5x10x20) cm","un",10667,null,0]
["3.41","00154 - SINAPI","Tinta Alcatrão de Hulha -  galão de 3,6 litros","l",9,null,0]
["3.42","35691 - SINAPI","Tinta Latex  PVA","l",221,null,0]
["3.43","38386 - SINAPI","Trincha de 2 \"","un",89,null,0]
["3.44","38400 - SINAPI","Vassourão 40cm com cabo","un",110,null,{"$f":"ROUND(E176*F176,2)","v":0}]
[]
[{"$f":"\"TOTAL - \"&C132&\" - (R$):\"","v":"TOTAL - MATERIAL DE CONSUMO - CIVIL - (R$):"},{"$nulls":5},{"$f":"SUBTOTAL(9,G132:G177)","v":0}]
[]
["4.",null,{"$f":"CPU_MANUTENCAO_CANTEIRO!C13","v":"MANUTENÇÃO DE CANTEIRO - ESCRITÓRIO"}]
["4.1",null,"Taxa de manutenção de canteiro, incluindo despesas com material de expediente, material de limpeza, água, energia, comunicação, entre outras","un x mês",{"$f":"3*12","v":36},null,{"$f":"ROUND(E181*F181,2)","v":0}]
[]
[{"$f":"\"TOTAL - \"&C180&\" - (R$):\"","v":"TOTAL - MANUTENÇÃO DE CANTEIRO - ESCRITÓRIO - (R$):"},{"$nulls":5},{"$f":"SUBTOTAL(9,G180:G182)","v":0}]
[]
[{"$f":"\"TOTAL - \"&A8&\" - (R$):\"","v":"TOTAL - MATERIAL DE CONSUMO - ALMOXARIFADOS - (R$):"},{"$nulls":5},{"$f":"SUBTOTAL(9,G15:G184)","v":0}]
[]
[]
[{"$f":"\"RESUMO - \"&A$8","v":"RESUMO - MATERIAL DE CONSUMO - ALMOXARIFADOS"}]
["ITEM",null,"DESCRIÇÃO",null,null,"VALOR TOTAL (R$)"]
[1,null,{"$f":"C15","v":"MATERIAL DE CONSUMO - MECÂNICA"},null,null,{"$f":"G72","v":0}]
[2,null,{"$f":"C74","v":"MATERIAL DE CONSUMO - ELÉTRICA"},null,null,{"$f":"G130","v":0}]
[3,null,{"$f":"C132","v":"MATERIAL DE CONSUMO - CIVIL"},null,null,{"$f":"G178","v":0}]
[4,null,{"$f":"C180","v":"MANUTENÇÃO DE CANTEIRO - ESCRITÓRIO"},null,null,{"$f":"G183","v":0}]
[{"$f":"\"TOTAL GERAL - \"&A188&\" -  (R$):\"","v":"TOTAL GERAL - RESUMO - MATERIAL DE CONSUMO - ALMOXARIFADOS -  (R$):"},{"$nulls":4},{"$f":"SUM(F190:G193)","v":0}]
[]
[]
["NOME DO INFORMANTE:",{"$nulls":4},"QUALIFICAÇÃO:"]
[]
["ASSINATURA:",{"$nulls":4},"DATA:"]
[]
["OBSERVAÇÃO:"]

{"sheet":"CPU_MANUTENCAO_CANTEIRO","index":17,"n_rows":99,"n_cols":7,"rows_kept":99,"cut":false,"hidden":false,"merged":[[98,0,98,6],[99,0,99,6],[100,0,100,6],[89,2,89,4],[89,5,89,6],[94,0,95,4],[94,5,94,6],[95,5,95,6],[96,0,97,4],[96,5,96,6],[97,5,97,6],[90,2,90,4],[91,0,91,4],[91,5,91,6],[90,5,90,6],[88,2,88,4],[88,5,88,6],[82,0,82,5],[86,2,86,4],[86,5,86,6],[87,2,87,4],[87,5,87,6],[14,2,14,6],[71,0,71,5],[85,0,85,6],[12,2,12,6],[10,5,10,6],[10,0,11,0],[10,1,11,1],[10,2,11,2],[10,3,11,3],[10,4,11,4],[73,2,73,6],[80,0,80,5],[0,2,0,6],[1,2,1,6],[2,2,2,6],[4,0,5,6],[7,0,7,6]]}
[null,null,"Ministério do Desenvolvimento Regional  - MDR"]
[null,null,"Companhia de Desenvolvimento dos Vales do São Francisco e do Parnaíba"]
[null,null,"Gerência de Operação do PISF - Centro de Controle e Operação (AD / GOI / CCO)"]
[]
["SERVIÇOS DE OPERAÇÃO E MANUTENÇÃO DAS INFRAESTRUTURAS DO EIXO LESTE DO PROJETO DE INTEGRAÇÃO DO RIO SÃO FRANCISCO COM AS BACIAS HIDROGRÁFICAS DO NORDESTE SETENTRIONAL – PISF"]
[]
[]
["MANUTENÇÃO DE CANTEIRO - ESCRITÓRIO"]
[]
[]
["ITEM","CÓDIGO","DESCRIÇÃO","UNIDADE","QUANTIDADE","VALOR (R$)"]
[{"$nulls":5},"UNITARIO","TOTAL"]
[null,null,{"$f":"A8","v":"MANUTENÇÃO DE CANTEIRO - ESCRITÓRIO"}]
[]
["1.",null,"MATERIAL DE CONSUMO - ESCRITÓRIO"]
["1.1",null,"Açúcar ","kg",125,null,{"$f":"ROUND(E16*F16,2)","v":0}]
["1.2",null,"Água Mineral (20 l) ","un",623,null,0]
["1.3","13003 - SINAPI","Água Sanitária 1000 ml ","un",52,null,0]
["1.4",null,"Alcool Comum 90º GL","l",52,null,0]
["1.5",null,"Bobina papel para ploter A0 ","un",3,null,0]
["1.6",null,"Café torrado e moído ","un",156,null,0]
["1.7",null,"Caneta esfereográfica Azul ","un",63,null,0]
["1.8",null,"Capa para encadernação Azul ","un",125,null,0]
["1.9",null,"Capa para encadernação Transparente ","un",249,null,0]
["1.10",null,"Cartucho colorido para impressora ","un",249,null,0]
["1.11",null,"Cartucho preto para impressora ","un",42,null,0]
["1.12",null,"Classificador elástico ","un",32,null,0]
["1.13",null,"Clips nº 02 (caixa com 100 unidades)","cx",28,null,0]
["1.14",null,"Clips nº 04 (caixa com 100 unidades)","cx",28,null,0]
["1.15",null,"Clips nº 06 (caixa com 100 unidades)","cx",28,null,0]
["1.16",null,"Clips nº 08 (caixa com 100 unidades)","cx",28,null,0]
["1.17","I0814 - SEINFRA/CE","Cola branca PVA","kg",5,null,0]
["1.18",null,"Copo descartável 200 ml  (pacote c/ 50 und)","un",102,null,0]
["1.19",null,"Copo descartável 50 ml  (pacote c/ 50 und)","un",102,null,0]
["1.20",null,"Corretivo à base d'agua 18 ml ","un",47,null,0]
["1.21",null,"Desinfetante  5L","un",262,null,0]
["1.22","I7373 - SEINFRA/CE","Detergente 5L","l",{"$f":"11*5","v":55},null,0]
["1.23",null,"DVD Regravável ","un",327,null,0]
["1.24",null,"Envelope de papel tamanho A3","un",131,null,0]
["1.25",null,"Envelope de papel tamanho A4","un",327,null,0]
["1.26",null,"Envelope de papel tamanho A5 - 200 x 280 mm","un",327,null,0]
["1.27",null,"Espiral 7mm ","un",104,null,0]
["1.28",null,"Espiral 9mm ","un",104,null,0]
["1.29",null,"Esponja de prato ","un",104,null,0]
["1.30",null,"Estilete 18mm","un",11,null,0]
["1.31",null,"Fita adesiva 48/100","un",42,null,0]
["1.32",null,"Fita adesiva transparente ","un",42,null,0]
["1.33","I1178 - SEINFRA/CE*","Fita crepe branca 45 x 50m ","un",21,null,0]
["1.34",null,"Flanela ","un",16,null,0]
["1.35",null,"Grampeador grande de mesa P/40F","un",63,null,0]
["1.36",null,"Grampo 26/6 ","un",13,null,0]
["1.37",null,"Grampo tipo trilho ","un",7,null,0]
["1.38",null,"Lápis grafite ","un",75,null,0]
["1.39",null,"Livro de ata com 100 páginas numeradas ","un",19,null,0]
["1.40",null,"Marca texto ","un",78,null,0]
["1.41",null,"Pacote de lã de aço 60 g ","un",32,null,0]
["1.42",null,"Pano de chão ","un",42,null,0]
["1.43",null,"Pano de prato ","un",13,null,0]
["1.44","I6039 - SEINFRA/CE*","Papel A4-resma de 500 folhas","un",52,null,0]
["1.45",null,"Papel higiênico","un",476,null,0]
["1.46",null,"Papel Toalha ","un",130,null,0]
["1.47",null,"Pasta arquivo de A a Z Ofício","un",104,null,0]
["1.48",null,"Pasta suspensa ","un",104,null,0]
["1.49",null,"Perfurador de papel 2 furos até 30 fls","un",21,null,0]
["1.50",null,"Régua 30cm Acrílico Cristal","un",21,null,0]
["1.51",null,"Rodo de borracha ","un",28,null,0]
["1.52","I1841 - SEINFRA/CE*","Sabão em pó 500g ","un",42,null,0]
["1.53",null,"Sabonetes líquido ","l",262,null,0]
["1.54",null,"Tinta para carimbo ","un",5,null,0]
["1.55",null,"Vassoura ","un",28,null,0]
[]
[{"$f":"\"TOTAL - \"&C15&\" - (R$):\"","v":"TOTAL - MATERIAL DE CONSUMO - ESCRITÓRIO - (R$):"},{"$nulls":5},{"$f":"SUBTOTAL(9,G15:G71)","v":0}]
[]
["2.",null,"OUTRAS DESPESAS DE MANUTENÇÃO"]
["2.1","10558 - ORSE","Internet - dispêndio mensal","mês",{"$f":"3*12","v":36},null,{"$f":"ROUND(E75*F75,2)","v":0}]
["2.2","10557 - ORSE","Telefonia fixa - dispêndio mensal","mês",{"$f":"3*12","v":36},null,0]
["2.3","10557 - ORSE","Telefonia móvel - dispêndio mensal","mês",{"$f":"3*2*12","v":72},null,0]
["2.4","10555 - ORSE","Energia Elétrica - dispêndio mensal","mês",{"$f":"3*12","v":36},null,0]
["2.5","10554 - ORSE","Água - dispêndio mensal","mês",36,null,0]
[]
[{"$f":"\"TOTAL - \"&C74&\" - (R$):\"","v":"TOTAL - OUTRAS DESPESAS DE MANUTENÇÃO - (R$):"},{"$nulls":5},{"$f":"SUBTOTAL(9,G74:G80)","v":0}]
[]
[{"$f":"\"TOTAL - \"&C13&\" - (R$):\"","v":"TOTAL - MANUTENÇÃO DE CANTEIRO - ESCRITÓRIO - (R$):"},{"$nulls":5},{"$f":"SUBTOTAL(9,G13:G82)","v":0}]
[]
[]
[{"$f":"\"COMPOSIÇÃO MENSAL - \"&A$8","v":"COMPOSIÇÃO MENSAL - MANUTENÇÃO DE CANTEIRO - ESCRITÓRIO"}]
["ITEM",null,"DESCRIÇÃO",null,null,"VALOR"]
[1,null,{"$f":"\"TOTAL - \"&C15&\" - (R$)\"","v":"TOTAL - MATERIAL DE CONSUMO - ESCRITÓRIO - (R$)"},null,null,{"$f":"G72","v":0}]
[2,null,{"$f":"\"TOTAL - \"&C74&\" - (R$)\"","v":"TOTAL - OUTRAS DESPESAS DE MANUTENÇÃO - (R$)"},null,null,{"$f":"G81","v":0}]
[3,null,"NÚMERO DE CANTEIROS PREVISTOS - (UN)",null,null,3]
[4,null,"PRAZO PREVISTO PARA EXECUÇÃO CONTRATUAL - (MÊS)",null,null,12]
[{"$f":"\"TAXA MÉDIA - \"&A8&\" -  (R$ / UN x MÊS):\"","v":"TAXA MÉDIA - MANUTENÇÃO DE CANTEIRO - ESCRITÓRIO -  (R$ / UN x MÊS):"},{"$nulls":4},{"$f":"ROUND((F88+F89)/(F90*F91),2)","v":0}]
[]
[]
["NOME DO INFORMANTE:",{"$nulls":4},"QUALIFICAÇÃO:"]
[]
["ASSINATURA:",{"$nulls":4},"DATA:"]
[]
["OBSERVAÇÃO:"]

{"sheet":"Ferramentas","index":18,"n_rows":286,"n_cols":9,"rows_kept":286,"cut":false,"hidden":false,"merged":[[14,2,14,6],[99,2,99,6],[212,2,212,6],[0,2,0,6],[1,2,1,6],[2,2,2,6],[4,0,5,6],[7,0,7,6],[10,5,10,6],[10,4,11,4],[10,3,11,3],[10,2,11,2],[10,0,11,0],[10,1,11,1],[12,2,12,6],[278,0,278,4],[278,5,278,6],[273,0,273,6],[276,2,276,4],[277,2,277,4],[275,5,275,6],[276,5,276,6],[277,5,277,6],[275,2,275,4],[268,0,268,5],[274,5,274,6],[274,2,274,4],[210,0,210,5],[97,0,97,5],[270,0,270,5],[285,0,285,6],[287,0,287,6],[281,5,281,6],[282,5,282,6],[283,5,283,6],[284,5,284,6],[286,0,286,6],[281,0,281,4],[282,0,282,4],[283,0,283,4],[284,0,284,4]]}
[null,null,"Ministério do Desenvolvimento Regional  - MDR"]
[null,null,"Companhia de Desenvolvimento dos Vales do São Francisco e do Parnaíba"]
[null,null,"Gerência de Operação do PISF - Centro de Controle e Operação (AD / GOI / CCO)"]
[]
["SERVIÇOS DE OPERAÇÃO E MANUTENÇÃO DAS INFRAESTRUTURAS DO EIXO LESTE DO PROJETO DE INTEGRAÇÃO DO RIO SÃO FRANCISCO COM AS BACIAS HIDROGRÁFICAS DO NORDESTE SETENTRIONAL – PISF"]
[]
[]
["FERRAMENTAS"]
[]
[]
["ITEM","CÓDIGO","DESCRIÇÃO","UNIDADE","QUANTIDADE","VALOR (R$)"]
[{"$nulls":5},"UNITARIO","TOTAL"]
[null,null,{"$f":"A8","v":"FERRAMENTAS"}]
[]
["1.",null,"FERRAMENTAS - MECÂNICA"]
["1.1",null,"Alavanca para mecânico 38,4 cm ","un",4,null,{"$f":"ROUND(E16*F16,2)","v":0}]
["1.2","11240 - ORSE","Alicate de bico com isolamento para 1000V","un",7,null,{"$f":"ROUND(E17*F17,2)","v":0}]
["1.3","38470 - SINAPI","Alicate de corte diagonal","un",7,null,0]
["1.4","38471 - SINAPI","Alicate para anéis externo pontas retas","un",7,null,0]
["1.5","38471 - SINAPI","Alicate para anéis externos ponta curva 90°","un",7,null,0]
["1.6","38471 - SINAPI","Alicate para anéis internos","un",7,null,0]
["1.7","11275 - ORSE","Alicate de pressão, 10\", 250mm","un",7,null,0]
["1.8","11240 - ORSE",{"$f":"C115","v":"Alicate universal, 8\", com isolação 1000 V"},"un",7,null,0]
["1.9","10585 - ORSE","Arco de Serra manual (com serra)","un",4,null,0]
["1.10",null,"Cabo de força com encaixe de ½”, ¾” e 1”","un",4,null,0]
["1.11","5090 - SINAPI","Cadeado 30mm","un",7,null,0]
["1.12","00425 - ORSE","Cadeado 40mm","un",7,null,0]
["1.13",null,"Calibrador de folgas de 0,03 mm - 0,50 mm","un",4,null,0]
["1.14",null,"Canivete sem ponta","un",7,null,0]
["1.15",null,"Chave ajustável n.º 08","un",7,null,0]
["1.16",null,"Chave combinada 1\" x 5/16\"","un",7,null,0]
["1.17",null,"Chave combinada 22 mm","un",7,null,0]
["1.18",null,"Chave combinada n.º 5/16\"","un",7,null,0]
["1.19",null,"Chave cruzada 8 x 150","un",7,null,0]
["1.20",null,"Chave de boca 3/4\" x 25/32\"","un",7,null,0]
["1.21",null,"Chave de boca 5/16\" x 1/4\"","un",7,null,0]
["1.22",null,"Chave de fenda 1/4x10","un",7,null,0]
["1.23",null,"Chave de fenda 1/8x3","un",7,null,0]
["1.24",null,"Chave de fenda 3/16x6","un",7,null,0]
["1.25",null,"Chave de fenda 3/8x10","un",7,null,0]
["1.26",null,"Chave de fenda 8x150","un",7,null,0]
["1.27",null,"Chave de fenda cruzada (Philips) 1/4\" x 1. 1/2\"","un",7,null,0]
["1.28",null,"Chave de fenda tipo toco 1/4\" x 1. 1/2\"","un",7,null,0]
["1.29",null,"Chave grifo n.º 8","un",4,null,0]
["1.30",null,"Chave grifo n.º 18","un",4,null,0]
["1.31",null,"Chave Philips","un",7,null,0]
["1.32",null,"Chave soquete tipo canhão 1/2\"","un",3,null,0]
["1.33",null,"Chave soquete tipo canhão 1/4\"","un",3,null,0]
["1.34",null,"Chave soquete tipo canhão 11/32\"","un",3,null,0]
["1.35",null,"Chave soquete tipo canhão 3/8\"","un",3,null,0]
["1.36",null,"Chave soquete tipo canhão 7/16\"","un",3,null,0]
["1.37",null,"Chave soquete tipo canhão 9/16\"","un",3,null,0]
["1.38","12 - SINAPI","Escova de aço, com cabo, *4 X 15* fileiras de cerdas","un",3,null,0]
["1.39",null,"Espátula n.º 38A-23","un",7,null,0]
["1.40","38380 - SINAPI","Esquadro Profissional 12\" (em aço)","un",4,null,0]
["1.41",null,"Extensão 20m","un",4,null,0]
["1.42",null,"Faca reta desencapadora com isolamento para 1000V","un",7,null,0]
["1.43",null,"Funil para troca de óleo","un",4,null,0]
["1.44",null,"Jogo de broca de aço de 6 a 19mm (concreto parede)","un",7,null,0]
["1.45",null,"Jogo de chave catraca","un",4,null,0]
["1.46",null,"Jogo de chave combinada de nº 6 a nº 50","un",7,null,0]
["1.47",null,"Jogo de chave hexagonal (Allen) em polegada","un",7,null,0]
["1.48",null,"Jogo de chave hexagonal (Allen) nº 03 a 17mm","un",7,null,0]
["1.49",null,"Jogo de chave Phillips com isolamento para 1000V","un",7,null,0]
["1.50",null,"Jogo de chave soquete 22 mm a 50 mm","un",4,null,0]
["1.51",null,"Jogo de chaves de fenda com isolamento para 1000V","un",7,null,0]
["1.52",null,"Jogo de macho para reparo de roscas","un",4,null,0]
["1.53",null,"Lanterna grande - 10 Million","un",4,null,0]
["1.54",null,"Lima chata paralela murça 6\"","un",7,null,0]
["1.55",null,"Lima paralela bastarda 6\"","un",7,null,0]
["1.56",null,"Lima redonda murça 6\"","un",7,null,0]
["1.57",null,"Limas diversas","un",7,null,0]
["1.58",null,"Mala de ferramenta com 05 gavetas","un",7,null,0]
["1.59","4729 - ORSE","Marreta 1kg","un",7,null,0]
["1.60",null,"Marreta 2 kg","un",4,null,0]
["1.61",null,"Marreta de 5kg com cabo de madeira","un",4,null,0]
["1.62",null,"Martelo bola  1kg","un",7,null,0]
["1.63",null,"Martelo de borracha 32 Cm","un",7,null,0]
["1.64",null,"Nível a laser com base magnética e tripé","un",4,null,0]
["1.65",null,"Nível de mão – metálico e magnético","un",4,null,0]
["1.66",null,"Pé-de-cabra","un",4,null,{"$f":"ROUND(E81*F81,2)","v":0}]
["1.67","38377 - SINAPI","Prumo de centro","un",4,null,0]
["1.68",null,"Punção de centro 100 x 4 mm","un",7,null,0]
["1.69",null,"Punção de centro 150 x 6 mm","un",7,null,0]
["1.70",null,"Saca pino 03 mm","un",7,null,0]
["1.71",null,"Saca pino 08mm","un",7,null,0]
["1.72",null,"Saca pino 17 mm","un",7,null,0]
["1.73",null,"Saca pino paralelo 150x4","un",7,null,0]
["1.74",null,"Saca pino paralelo 150x6","un",7,null,0]
["1.75",null,"Saca pino paralelo 150x8","un",7,null,0]
["1.76",null,"Saca polia 10\"","un",3,null,0]
["1.77",null,"Soquete 65","un",3,null,0]
["1.78",null,"Soquete 70","un",3,null,0]
["1.79",null,"Soquete 75/55","un",3,null,0]
["1.80",null,"Talhadeira para mecânica","un",7,null,0]
["1.81",null,"Torquímetro de estalo 50 - 400 N.m","un",3,null,0]
["1.82",null,"Trena Metálica 8 m","un",4,null,0]
[{"$f":"\"TOTAL - \"&C15&\" - (R$):\"","v":"TOTAL - FERRAMENTAS - MECÂNICA - (R$):"},{"$nulls":5},{"$f":"SUBTOTAL(9,G15:G97)","v":0}]
[]
["2.",null,"FERRAMENTAS - ELÉTRICA",{"$nulls":4},""]
["2.1",null,"Adaptador universal de tomadas","un",46,null,{"$f":"ROUND(E101*F101,2)","v":0},11.446666666666667]
["2.2",null,"Alavanca reta, 1,75 m","un",10,null,0,228.65]
["2.3",null,"Alicate bico chato/pato, 6\"","un",13,null,0,73.61]
["2.4","38470 - SINAPI","Alicate cortador de cabos diagonal, 6\"","un",23,null,0,12.68]
["2.5",null,"Alicate cortador de cabos frontal, 6\"","un",13,null,0,54.33]
["2.6",null,"Alicate/Tesoura cortador manual de cabos de até 300mm², 225mm","un",13,null,0,608.93000000000006]
["2.7","38547 - SINAPI","Alicate crimpador, RJ-11/RJ-45, 200mm","un",2,null,0,49.99]
["2.8","38547 - SINAPI","Alicate crimpador,  RG-59 e RG-6, 130mm","un",2,null,0,39]
["2.9","11272 - ORSE","Alicate crimpador para terminais 1,0 a 10mm², 220mm","un",13,null,0,75.900000000000006]
["2.10","11272 - ORSE","Alicate crimpador para terminais 10 a 120mm², 620mm","un",1,null,0,371.17666666666668]
["2.11","11272 - ORSE","Alicate crimpador 11\", 280mm","un",2,null,0,148.9]
["2.12",null,"Alicate crimpador, hidráulico, prensa terminal,  com matriz de 10 a 300mm²","un",1,null,0,417.19666666666672]
["2.13","11275 - ORSE","Alicate de pressão, 10\", 250mm","un",13,null,0,31.316666666666663]
["2.14","11240 - ORSE","Alicate profissional universal, 8\". Material: Cromo Vanadium","un",13,null,0,29.31]
["2.15","11240 - ORSE","Alicate universal, 8\", com isolação 1000 V","un",10,null,0,31.89]
["2.16",null,"Aluguel Notebook - tipo 1 (i7, 1T, 8GB, S.O. 10 e Office última versão)","un",2,null,0,450]
["2.17",null,"Andaime modular isolante 2x1m, com conexões em aluminio fundido - Altura de 15 m.","un",1,null,0,164369.99]
["2.18","10585 - ORSE","Arco de Serra manual (com serra)","un",23,null,0,22.593333333333334]
["2.19",null,"Bastão/Vara de manobra 35 kV, Ø 32 mm, 3,0 m, 2 m isolante","un",2,null,0,357]
["2.20",null,"Bastão isolante universal Ø 38 mm, 6 m, com 2 cabeçotes","un",2,null,0,695]
["2.21",null,"Bastão de resgate - 35 kV, 220 mm","un",2,null,0,721.66666666666663]
["2.22",null,"Bastão-garra comprimento do isolante 3 m","un",2,null,0,398]
["2.23",null,"Bastão tensor com luva ajustável Ø 51 mm, 72,5 kV, 2,30 m","un",2,null,0,149.77000000000001]
["2.24",null,"Bastão com gancho tipo \"J\" 90cm","un",2,null,0,149.77000000000001]
["2.25",null,"Banqueta isolante, 500x500x300 mm, 40 kV","un",2,null,0,439.11666666666662]
["2.26",null,"Berço simples para cadeia de isoladores 230 kV para até 6 isoladores de até Ø 254 mm","un",2,null,0,54.14]
["2.27","38374 - SINAPI","Balancim (Ref. RE402-0099 ou similar) para escada perfil de fibra de vidro extensiva","un",2,null,0,103.31]
["2.28",null,"Binóculo Profissional Ampliação 8 à 24x 50mm","un",2,null,0,449.51]
["2.29",null,"Chave de boca ajustável 8\"","un",10,null,0,39.644999999999996]
["2.30",null,"Chave de boca ajustável 12\"","un",10,null,0,77.989999999999995]
["2.31",null,"Chave de boca ajustável 18\"","un",10,null,0,228.89500000000001]
["2.32","00425 - ORSE","Cadeado 40mm","un",27,null,0,17.850000000000001]
["2.33",null,"Caixa de ferramentas para eletricista NR10 com 34 peças - Equipes de Manutenção","un",6,null,0,77.394999999999996]
["2.34",null,"Caixa de ferramentas para eletricista NR10 com 34 peças para operadores EB","un",6,null,0,77.394999999999996]
["2.35",null,"Caixa de ferramentas com 40 peças (Para técnicos de automação e telecom)","un",2,null,0,772.39666666666665]
["2.36",null,"Caixa de ferramentas tipo sanfonada, confeccionada  em chapa de aço, com rodas e puxador","un",13,null,0,161.94499999999999]
["2.37",null,"Câmera fotográfica digital 20MP, 5x Zoom Óptico","un",2,null,0,526.26666666666665]
["2.38",null,"Chave com catraca 4 bocas 8x9x10x11 mm (Ref. 44637101 ou similar)","un",10,null,0,117.50666666666666]
["2.39",null,"Conjunto de aterramento rápido e temporário para cubículos até 35kV","un",2,null,0,1045]
["2.40",null,"Conjunto de aterramento rápido e temporário para redes isoladas até 1kV","un",2,null,0,365]
["2.41",null,"Conjunto de aterramento temporário para subestações até 36kV","un",2,null,0,934.5]
["2.42",null,"Conjunto de chaves básicas para eletricista com 06 peças","un",10,null,0,71.966666666666683]
["2.43",null,"Detector de Tensão por contato 1kV","un",23,null,0,623.75]
["2.44",null,"Detector unipolar de tensão por aproximação - 10 a 40KV","un",13,null,0,578]
["2.45",null,"Encerado de lona (3x2 m)","un",10,null,0,30.433333333333334]
["2.46",null,"Escada perfil \"U\" de fibra de vidro extensiva - altura esticada 8,40 m - 15 kV","un",10,null,0,918.26666666666677]
["2.47",null,"Escada de fibra de vidro tipo \"A\" (subestações) - 10 degraus","un",2,null,0,808.14]
["2.48","12 - SINAPI","Escova com cerdas de aço para condutores","un",10,null,0,33,"ESCOVA DE ACO, COM CABO, *4  X 15* FILEIRAS DE CERDAS"]
["2.49",null,"Facão para mato, 18 pol","un",10,null,0,20]
["2.50",null,"Farol de punho","un",10,null,0,85.48]
["2.51",null,"Ferramenta universal para bastão de manobra - Adaptador de ferramentas","un",2,null,0,69]
["2.52",null,"Ferramenta universal para bastão de manobra - Adaptador de peças","un",2,null,0,49]
["2.53",null,"Ferramenta universal para bastão de manobra - Adaptador universal","un",2,null,0,174]
["2.54",null,"Ferramenta universal para bastão de manobra - Cabeçote com gancho duplo","un",2,null,0,49]
["2.55",null,"Ferramenta universal para bastão de manobra - Cabeçote multi-uso","un",2,null,0,81.5]
["2.56",null,"Ferramenta universal para bastão de manobra - Cabeçote para grampo de aterramento","un",2,null,0,95.85]
["2.57",null,"Ferramenta universal para bastão de manobra - Chave com catraca","un",2,null,0,445]
["2.58",null,"Ferramenta universal para bastão de manobra - Desconector para chave fusível","un",2,null,0,32.07]
["2.59",null,"Ferramenta universal para bastão de manobra - Escova em \"V\" para limpeza de condutor","un",2,null,0,255.89]
["2.60",null,"Ferramenta universal para bastão de manobra - Extrator de cartucho","un",2,null,0,200]
["2.61",null,"Ferramenta universal para bastão de manobra - Extrator de contrapino por impulso","un",2,null,0,135]
["2.62",null,"Ferramenta universal para bastão de manobra - Gancho tração espiral","un",2,null,0,70]
["2.63",null,"Ferramenta universal para bastão de manobra - Garfo ajustador de concha","un",2,null,0,170]
["2.64",null,"Ferramenta universal para bastão de manobra - Garra de amarração","un",2,null,0,115]
["2.65",null,"Ferramenta universal para bastão de manobra - Instalador de Contrapino","un",2,null,{"$f":"ROUND(E165*F165,2)","v":0},330]
["2.66",null,"Ferramenta universal para bastão de manobra - Jogo para Tensionadores Duplos - jugo duplo com corrente lado morto","un",2,null,0,83.03]
["2.67",null,"Ferramenta universal para bastão de manobra - Jogo para Tensionadores Duplos -jugo duplo lado vivo","un",2,null,0,86.69]
["2.68",null,"Ferramenta universal para bastão de manobra - Jogo para Tensionadores Simples - balancim trinangular chapa dupla","un",2,null,0,79.680000000000007]
["2.69",null,"Ferramenta universal para bastão de manobra - Sacador de contrapino em alavanca","un",2,null,0,158]
["2.70",null,"Ferramenta universal para bastão de manobra - Suporte de concha","un",2,null,0,135]
["2.71",null,"Ferramenta universal para bastão de manobra - Suporte flexível para soquete hexagonal","un",2,null,0,200]
["2.72",null,"Ferramenta universal para bastão de manobra - Tenaz multi-angular","un",2,null,0,210]
["2.73",null,"Ferramenta universal para bastão de manobra - Tenaz para isolador","un",2,null,0,250]
["2.74",null,"Foice 33mm (Com Cabo 110cm)","un",10,null,0,28.51]
["2.75",null,"Fumigador para apicultura","un",10,null,0,122.76]
["2.76",null,"Furadeira elétrica de impacto 1/2\" Ø 13mm, 800W, 1050 A, 2800 rpm e 220V","un",10,null,0,278.93333333333334]
["2.77",null,"Grampo de aterramento com parafuso olhal T (linhas)","un",3,null,0,88.5]
["2.78",null,"Jogo de chave canhão com 12 unidades","un",10,null,0,220.37666666666667]
["2.79",null,"Jogo de chave combinada com 16 unidades (sextavado/boca fixa) de 1/4\" a 1.1/4\" (6,35 mm a 31,75 mm)","un",10,null,0,279.68]
["2.80",null,"Jogo de soquetes estriado com encaixe 1/2\" com 38 soquetes - 10-32mmn","un",10,null,0,856.62666666666667]
["2.81",null,"Jogo tensionador simples com munhão","un",2,null,0,79.680000000000007]
["2.82",null,"Jogo de chaves biela 12 peças tipo L 8 a 19mm","un",10,null,0,116.40333333333335]
["2.83",null,"Jogo de chave de fenda e philips com haste protegida para eletricista com 07 peças","un",10,null,0,38.419999999999995]
["2.84",null,"Jogo de chave de fenda para bastão","un",2,null,0,225.69]
["2.85",null,"Kit de reparo eletrônico (ferro de solda, sugador de placa de circuito impresso, componentes sobressalentes)","un",2,null,0,140.34]
["2.86",null,"Kit ferramenta fibra óptica (clivador +alicate decapador + alicate stripper + bolsa + 2 chaves allen + recipiente para álcool + guia) + Medidor de potência para fibra óptica (Power Meter Medidor Potência Fibra Óptica + Caneta Laser 10W)","un",2,null,0,436.99333333333334]
["2.87",null,"Kit ferramentas telecom ( tipo TRAMONTINA PRO 44970053 ou similar)","un",2,null,0,1564.05]
["2.88","11396 - ORSE","Lanterna tática grande - 5.500.000 lumens","un",10,null,0,102.4]
["2.89",null,"Lima chata murça 8\" com cabo","un",1,null,0,43.016666666666673]
["2.90",null,"Lima chata bastarda 10\"","un",1,null,0,43.636666666666663]
["2.91",null,"Luva de cobertura punho 15cm","un",13,null,0,25.494999999999997]
["2.92",null,"Luva isolante classe 00 - 2,5kV","un",13,null,0,152]
["2.93",null,"Luva isolante classe 0 - 5kV","un",13,null,0,207.495]
["2.94",null,"Luva isolante classe 3 - 30kV","un",13,null,0,768.5]
["2.95",null,"Marreta de 5kg com cabo de madeira","un",10,null,0,61.805]
["2.96",null,"Martelete Perfurador/Rompedor Profissional 220V, 800W, 870 RPM","un",1,null,0,532.45000000000005]
["2.97",null,"Martelo-bola 1kg","un",10,null,0,57.556666666666672]
["2.98",null,"Martelo universal (de unha) 25mm","un",10,null,0,30.4]
["2.99",null,"Kit para enchimento e complementação de gás SF6, composto de adaptador, mangueira, regulador e manômetro padrão","un",1,null,0,765.0009]
[2100,null,"Pá-de-bico com cabo de madeira","un",10,null,0,26.55]
[2101,null,"Parafusadeira/Furadeira elétrica com fio - 220V, 400W","un",10,null,0,226.48666666666668]
[2102,null,"Plataforma de fibra de vidro antiderrapente  para andaime modular isolante, com conexoes em aluminio fundido 2x1m","un",2,null,0,152.47]
[2103,null,"Punho saca fusível NH tamanho 000 a 4, 1kV","un",10,null,0,58.673333333333339]
[2104,null,"Sela com extensor colar de 38mm","un",2,null,0,1058]
[2105,null,"Separador de fases horizontal 15kV  polietileno de alta densidade na cor cinza (cx 110-690 mm ; cx 66-850 mm)","un",4,null,0,869.12]
[2106,null,"Soprador térmico 2000W, 220V","un",1,null,0,187.96333333333334]
[2107,null,"Talha manual Tirfor 1.600kgf/cm² com alavanca","un",1,null,0,1224.425]
[2108,null,"Testador de bastão de manobra para isolador","un",1,null,0,3780]
[2109,null,"Teste de Bateria Digital com Impressora Térmica Embutida","un",6,null,0,1102.3833333333334]
[2110,null,"Testador Teste Crimpagem Cabo Rede Lan Rj45 Rj11","un",2,null,0,69.296666666666667]
[{"$f":"\"TOTAL - \"&C100&\" - (R$):\"","v":"TOTAL - FERRAMENTAS - ELÉTRICA - (R$):"},{"$nulls":5},{"$f":"SUBTOTAL(9,G100:G210)","v":0},310761.22000000003]
[]
["3.",null,"FERRAMENTAS - CIVIL",{"$nulls":4},""]
["3.1",null," Alavanca para construção civil","un",30,null,{"$f":"ROUND(E214*F214,2)","v":0}]
["3.2",null," Ansinho ","un",30,null,0]
["3.3","10585 - ORSE","Arco de Serra manual (com serra)","un",12,null,0]
["3.4","10 - SINAPI"," Balde 10 l ","un",60,null,0]
["3.5",null,"Binóculo Profissional Ampliação 8 à 24x 50mm","un",10,null,0]
["3.6",null,"Câmera fotográfica digital 20MP, 5x Zoom Óptico","un",6,null,0]
["3.7",null," Carrinho para transporte de motor de popa ","un",12,null,0]
["3.8","2711 - SINAPI"," Carro de mão ","un",120,null,0]
["3.9",null," Cavador articulado ","un",30,null,0]
["3.10",null," Chibanca ","un",105,null,0]
["3.11",null," Colher de pedreiro nº 9 ","un",5,null,0]
["3.12",null," Conjunto de ferramentas básicas para encanador ","un",3,null,0]
["3.13",null," Conjunto de ferramentas básicas para pedreiro ","un",5,null,0]
["3.14",null," Corda de bombeiro 12mm em nylon trançado (rolo de 100 m) ","un",9,null,0]
["3.15",null," Desempenadeira de aço dentada ","un",9,null,0]
["3.16",null," Desempenadeira de aço lisa ","un",9,null,0]
["3.17",null," Disco corte abrasivo 18\" ","un",6,null,0]
["3.18","38403 - SINAPI"," Enxada estreita de 240 x 230 mm, sem cabo ","un",105,null,0]
["3.19","38477 - SINAPI"," Escada articulada multifuncional 16 degraus ","un",12,null,0,null,"ESCADA EXTENSIVEL EM ALUMINIO COM 6,00 M ESTENDIDA"]
["3.20","12 - SINAPI","Escova de aco, com cabo, *4 x 15* fileiras de cerdas ","un",12,null,0]
["3.21","38367 - SINAPI","Espátula aço inox, 8cm - cabo de madeira ","un",12,null,0]
["3.22","38368 - SINAPI","Espátula de plástico lisa, largura 10 cm ","un",12,null,0]
["3.23",null," Esponja de limpeza ","un",105,null,0]
["3.24","38380 - SINAPI","Esquadro 90º x 30cm (12\") ","un",6,null,0]
["3.25",null," Estrovenga ","un",105,null,0]
["3.26",null,"Facão para mato, 18 pol","un",107,null,0]
["3.27",null,"Foice 33mm","un",107,null,0]
["3.28",null," Fumigador para apicultura ","un",15,null,0]
["3.29",null," Lanterna grande - 10 Million ","un",12,null,0]
["3.30",null," Machado ","un",45,null,0]
["3.31",null," Mangueira de ¾ 50 MTS ","un",15,null,0]
["3.32",null," Mangueira de nível ","un",18,null,0]
["3.33","11269 - ORSE"," Marreta de 1/2 kg com cabo ","un",12,null,0]
["3.34",null," Marreta de 2kg ","un",12,null,0]
["3.35",null,"Marreta de 5kg com cabo de madeira","un",12,null,0]
["3.36",null," Martelo com unha ","un",12,null,0]
["3.37",null," Martelo de borracha 32 Cm","un",5,null,0]
["3.38",null," Nível c/ bolha ajustável de inclinação, bolha fixa e prumo – 250mm ","un",5,null,0]
["3.39",null," Nível de bolha de madeira ","un",5,null,0]
["3.40",null," Pá quadrada ","un",105,null,0]
["3.41",null," Pé-de-cabra ","un",30,null,0]
["3.42",null," Picareta com cabo ","un",105,null,0]
["3.43",null," Pistola para pintura ","un",5,null,0]
["3.44",null," Ponteiro de aço ","un",30,null,0]
["3.45","38377 - SINAPI"," Prumo de centro ","un",5,null,0]
["3.46","38376 - SINAPI"," Prumo de parede ","un",5,null,0]
["3.47",null," Rastelo (ASG) ","un",30,null,0]
["3.48",null,"Refletor redondo em alumínio anodizado para lâmpada vapor de mercúrio/sódio, corpo em aluminio com pintura epoxi, para lâmpada E-27 de 300 W, com suporte redondo e alça regulável para fixação. ","un",30,null,0]
["3.49",null," Régua de alumínio - 2,00m ","un",5,null,0]
["3.50",null," Serrote 40cm ","un",12,null,0]
["3.51",null," Talhadeira de aço chato 10\" ","un",30,null,0]
["3.52",null," Torqueza ","un",15,null,0]
["3.53",null,"Trena Metálica 8 m","un",20,null,0]
["3.54",null," Trena de Fita 20m ","un",3,null,0]
["3.55",null," Trena de Fita 50m ","un",3,null,0]
[{"$f":"\"TOTAL - \"&C213&\" - (R$):\"","v":"TOTAL - FERRAMENTAS - CIVIL - (R$):"},{"$nulls":5},{"$f":"SUBTOTAL(9,G213:G268)","v":0}]
[]
[{"$f":"\"TOTAL - \"&C13&\" - (R$):\"","v":"TOTAL - FERRAMENTAS - (R$):"},{"$nulls":5},{"$f":"SUBTOTAL(9,G13:G270)","v":0}]
[]
[]
[{"$f":"\"RESUMO - \"&A$8","v":"RESUMO - FERRAMENTAS"}]
["ITEM",null,"DESCRIÇÃO",null,null,"VALOR TOTAL (R$)"]
["01",null,{"$f":"C15","v":"FERRAMENTAS - MECÂNICA"},null,null,{"$f":"G98","v":0}]
["02",null,{"$f":"C100","v":"FERRAMENTAS - ELÉTRICA"},null,null,{"$f":"G211","v":0}]
["03",null,{"$f":"C213","v":"FERRAMENTAS - CIVIL"},null,null,{"$f":"G269","v":0}]
[{"$f":"\"TOTAL GERAL - \"&A274&\" -  (R$):\"","v":"TOTAL GERAL - RESUMO - FERRAMENTAS -  (R$):"},{"$nulls":4},{"$f":"SUM(F276:G278)","v":0}]
[]
[]
["NOME DO INFORMANTE:",{"$nulls":4},"QUALIFICAÇÃO:"]
[]
["ASSINATURA:",{"$nulls":4},"DATA:"]
[]
["OBSERVAÇÃO:"]

{"sheet":"Equipamentos","index":19,"n_rows":284,"n_cols":7,"rows_kept":284,"cut":false,"hidden":false,"merged":[[10,1,11,1],[59,0,59,5],[73,0,73,5],[151,2,151,4],[151,5,151,6],[10,0,11,0],[10,2,11,2],[10,3,11,3],[10,4,11,4],[10,5,10,6],[14,2,14,6],[61,2,61,6],[75,2,75,6],[76,2,76,6],[133,2,133,6],[12,2,12,6],[160,5,160,6],[161,5,161,6],[162,0,162,6],[158,0,158,4],[159,0,159,4],[160,0,160,4],[161,0,161,4],[158,5,158,6],[159,5,159,6],[152,5,152,6],[145,0,145,5],[143,0,143,5],[150,0,150,6],[155,0,155,4],[166,0,166,6],[165,0,165,6],[163,0,164,6],[153,5,153,6],[0,2,0,6],[1,2,1,6],[2,2,2,6],[4,0,5,6],[7,0,7,6],[154,2,154,4],[154,5,154,6],[155,5,155,6],[131,0,131,5],[153,2,153,4],[147,0,147,5],[152,2,152,4]]}
[null,null,"Ministério do Desenvolvimento Regional  - MDR"]
[null,null,"Companhia de Desenvolvimento dos Vales do São Francisco e do Parnaíba"]
[null,null,"Gerência de Operação do PISF - Centro de Controle e Operação (AD / GOI / CCO)"]
[]
["SERVIÇOS DE OPERAÇÃO E MANUTENÇÃO DAS INFRAESTRUTURAS DO EIXO LESTE DO PROJETO DE INTEGRAÇÃO DO RIO SÃO FRANCISCO COM AS BACIAS HIDROGRÁFICAS DO NORDESTE SETENTRIONAL – PISF"]
[]
[]
["EQUIPAMENTOS"]
[]
[]
["ITEM","CÓDIGO","DESCRIÇÃO","UNIDADE","QUANTIDADE","VALOR (R$)"]
[{"$nulls":5},"UNITARIO","TOTAL"]
[null,null,{"$f":"A8","v":"EQUIPAMENTOS"}]
[]
["1.",null,"EQUIPAMENTOS - MECÂNICA"]
["1.1","COT_AFER","Aferidor de manômetro de 0 a 150 bar ","un x mês",{"$f":"1*12","v":12},null,{"$f":"ROUND(E16*F16,2)","v":0}]
["1.2","COT_ALMO_FLEX","Almotolia de bico flexível 500ml","un x mês",{"$f":"3*12","v":36},null,{"$f":"ROUND(E17*F17,2)","v":0}]
["1.3","COT_ALMO_RIG","Almotolia de bico rígido 500ml","un x mês",{"$f":"3*12","v":36},null,0]
["1.4","COT_ANDA","Andaime metálico tipo fachadeiro Dim: Largura= 1,20m / Altura por peça= 2,00m. (Altura Total=10m - 5 peças por conjunto)","m²",{"$f":"12*12","v":144},null,0]
["1.5","COT_BANC_OFIC","Bancada para oficina (Dim: 1,2m x 2,5m) ","un x mês",{"$f":"6*12","v":72},null,0]
["1.6","COT_BOMB_GRAX","Bomba de graxa manual 5kg ","un x mês",{"$f":"3*12","v":36},null,0]
["1.7","13914 - SINAPI/PE","Talha Manual de Corrente com Alavanca 1,5 t Elevação 1,5m (Catraca 1,5 ton) ","un x mês",{"$f":"1*12","v":12},null,0]
["1.8","COT_CHAV_46","Chave de impacto 46mm boca/estria ","un x mês",{"$f":"2*12","v":24},null,0]
["1.9","COT_CHAV_55","Chave de impacto 55mm boca/estria ","un x mês",{"$f":"2*12","v":24},null,0]
["1.10","COT_CHAV_60","Chave de impacto 60mm boca/estria ","un x mês",24,null,0]
["1.11","COT_CHAV_65","Chave de impacto 65mm boca/estria ","un x mês",24,null,0]
["1.12","COT_CHAV_70","Chave de impacto 70mm boca/estria ","un x mês",24,null,0]
["1.13","COT_CHAV_75","Chave de impacto 75mm boca/estria","un x mês",{"$f":"2*12*2","v":48},null,0]
["1.15","COT_CHAV_85","Chave de impacto 85mm boca/estria","un x mês",{"$f":"2*12*2","v":48},null,0]
["1.17","COT_CINT_3T","Cinta para elevação de carga (comprimento: 3m / capacidade de carga: 3t)","un x mês",{"$f":"1.5*12","v":18},null,0]
["1.18","COT_CINT_20T","Cinta para elevação de carga  (comprimento: 6m / capacidade de carga: 20t)","un x mês",{"$f":"1.5*12","v":18},null,0]
["1.19","COT_CORT","Cortador a frio para tubos - Cortador Tubo Ferro Ferrari 1/8\" - 2\"","un x mês",{"$f":"2*12","v":24},null,0]
["1.20","COT_CURV","Curvador de tubos (Até 1”) - Curvador e Dobrador De Tubos Manual","un x mês",{"$f":"2*12","v":24},null,0]
["1.21","38476 - SINAPI/PE","Escada de abrir com 2 x 8 degraus (2,40m) em alumínio ","un x mês",{"$f":"4*12","v":48},null,0]
["1.22","38477 - SINAPI/PE","Escada de marinheiro extensível em duraluníno com 10 x 20 degraus (3,00m / 6,00m) ","un x mês",{"$f":"3*12","v":36},null,0]
["1.23","COT_ESCA_07","Escada metálica de 07 degraus ","un x mês",{"$f":"3*12","v":36},null,0]
["1.24","COT_ESCA_16","Escada articulada multifuncional 4x4 16 degraus","un x mês",{"$f":"1*12","v":12},null,0]
["1.25","COT_ESME","Esmerilhadeira angular de 4 ½” ","un x mês",{"$f":"2*12","v":24},null,0]
["1.26","11359 - SINAPI/PE","Esmerilhadeira angular de 7” ","un x mês",{"$f":"2*12","v":24},null,0]
["1.27","I9378 - SEINFRA/CE","Furadeira Manual 650W 1050 – 1450 RPM 220V Ø 13mm","un x mês",{"$f":"2*12","v":24},null,0]
["1.28","COT_INDU","Indutor elétrico para aquecimento de rolamentos (JM 500) ","un x mês",{"$f":"1*12","v":12},null,0]
["1.29","COT_LIXA","Lixadeira 4 1/2\" ","un x mês",{"$f":"2*12","v":24},null,0]
["1.30","COT_MACA_20T","Macaco de comando a distância 20 t - Macaco Hidráulico 20 Toneladas Tipo Garrafa","un x mês",{"$f":"2*12","v":24},null,0]
["1.31","COT_MACA_50T","Macaco de comando a distância 50 t - Macaco Hidráulico 50 Toneladas Tipo Garrafa","un x mês",24,null,0]
["1.32","COT_MACA_2T","Macaco tipo elevador capacidade de 2 t - Macaco Hidráulico 2 Toneladas tipo Garrafa","un x mês",24,null,0]
["1.33","COT_MACA_GIR","Macaco tipo girafa de 2 t - Guincho Hidráulico 2 Toneladas com Prolongador","un x mês",24,null,0]
["1.34","40403 - SINAPI/PE","Máquina de solda elétrica de 250 A com kit.","un x mês",24,null,0]
["1.35","COT_MORS","Morsa para bancada nº 08 ","un x mês",{"$f":"6*12","v":72},null,0]
["1.36","E9630-DNIT/PE","Conjunto Motor bomba 7,5 CV, 380 V, Q=75,6 m3/h e H=17 mca. (Poço de rebaixamento da EBV-3)","un x mês",{"$f":"1*12","v":12},null,0]
["1.37","COT_BOMB_SUB","Bomba Submersível 5 Cv Trifásica 380V, Q=2 - 52 m3/h e H= 3-25 mca.(Poço de rebaixamento do Res. de areias (Estrutura de Controle)","un x mês",{"$f":"1*12","v":12},null,0]
["1.38","COT_MOTO_ESMER","Motoesmeril de 1cv - 3.500 RPM ","un x mês",{"$f":"6*12","v":72},null,0]
["1.39","COT_MULT","Multiplicador de Torque Manual 2700 N.m/2000 lb.ft CDI GA190","un x mês",{"$f":"1*12","v":12},null,0]
["1.40","7252 - SINAPI/PE","Nível de precisão  ","un x mês",{"$f":"1*12","v":12},null,0]
["1.41","COT_PARA","Parafusadeira elétrica a bateria ","un x mês",{"$f":"2*12","v":24},null,0]
["1.42","COT_PREN","Prensa hidráulica de 10 ton ","un x mês",{"$f":"2*12","v":24},null,0]
["1.43","E9207-DNIT/PE","Retífica elétrica ","un x mês",24,null,0]
["1.44","E9748-DNIT/PE","Rosqueadeira ( para tubos de ½” a 4”) -Rosqueadeira Elétrica 1/2 A 4 Pol. 750w 220v-Br Motors-Brr124bsp","un x mês",{"$f":"1*12","v":12},null,0]
["1.45","10809 - SINAPI/PE","Talha capacidade 3t","un x mês",24,null,0]
["1.46","COT_TIFO","Tifor 3t","un x mês",24,null,0]
[{"$f":"\"TOTAL - \"&C15&\":\"","v":"TOTAL - EQUIPAMENTOS - MECÂNICA:"},{"$nulls":5},{"$f":"SUBTOTAL(9,G15:G59)","v":0}]
[]
["2.",null,"EQUIPAMENTOS - ELÉTRICA"]
["2.1","COT_ANAL","Analisador de grandezas elétricas trifásico, display LCD colorido 5,6\", TRMS 1.000 V, corrente 3.000A ","un x mês",{"$f":"1*12","v":12},null,{"$f":"ROUND(E63*F63,2)","v":0}]
["2.2","COT_BANC_TESTE","Bancada de teste, amperimetro 150A, voltímetro 40V ","un x mês",12,null,0]
["2.3","COT_BANC_PROT","Bancada protegida contra eletricidade estática ","un x mês",12,null,0]
["2.4","COT_DATA","Data Logger de 4 a 20 mA (verificação de intermitência em instrumentação) ","un x mês",12,null,0]
["2.5","13761 - SINAPI/PE","Estação de solda com temperatura ajustável e proteção antiestático ","un x mês",12,null,0]
["2.6","10236 - ORSE/SE","Fonte de alimentação com tensão variável de 0 a 30Vcc de 3 A ","un x mês",12,null,0]
["2.7","COT_FONT","Fonte de bancada 12 V ","un x mês",12,null,0]
["2.8","I9378 - SEINFRA/CE","Furadeira Manual 650W 1050 – 1450 RPM 220V Ø 13mm","un x mês",12,null,0]
["2.9","COT_GERA","Gerador de corrente e tensão de 0 a 20 mA e 0 a 10V, precisão de 0,1% ","un x mês",12,null,0]
["2.10","COT_KIT ","Kit para enchimento e complementação para gás SF6, composto de adaptador ,regulador, mangueira e manômetro padrão ","un x mês",12,null,0]
["2.11","COT_TTR ","TTR - medidor digital de relação de espiras, escala de medição 0,8000:1 a 8.000,0: 1 ","un x mês",12,null,0]
[{"$f":"\"TOTAL - \"&C62&\":\"","v":"TOTAL - EQUIPAMENTOS - ELÉTRICA:"},{"$nulls":5},{"$f":"SUBTOTAL(9,G62:G73)","v":0}]
[]
["3.",null,"EQUIPAMENTOS - CIVIL"]
["3.1",null,"MANUTENÇÃO"]
["3.1.1","4085 - SINAPI/PE","Bomba elétrica submersa para drenagem 5cv Flyght 3\" 12.3 m³/h (acompanhada com os mangotes, incluindo quadro de comando compatível com o modelo de bomba, 250 m de cabo flexível trifásico, isolado, tensão 600 V/1000 V, em conformidade com NBR 7288).","un x mês",{"$f":"2*12","v":24},null,{"$f":"ROUND(E78*F78,2)","v":0}]
["3.1.2","COT_ANDA","Andaime metálico tipo fachadeiro Dim: Largura= 1,20m / Altura por peça= 2,00m. (Altura Total=10m - 5 peças por conjunto)","m²",{"$f":"12*12","v":144},null,0]
["3.1.3","COT_BETO","Betoneira, capacidade nominal 400 l, capacidade de mistura 310 l, motor a diesel potência 5 cv, sem carregador.","un x mês",{"$f":"3*12","v":36},null,0]
["3.1.4","36398 - SINAPI/PE","Betoneira, capacidade nominal 600 l, capacidade de mistura 440 l,  motor a diesel potência 10 cv, com carregador.","un x mês",{"$f":"3*12","v":36},null,0]
["3.1.5","746 - SINAPI/PE","Lavadora de alta pressão a diesel, partida elétrica, motor de 10 hp","un x mês",{"$f":"1*12","v":12},null,0]
["3.1.6","COT_BOMB_DRAGA","Bomba draga autoescorvante 3”x 3” , motor: 4 tempos, potência: 6,5cv, cilindrada: 196 cm³, ignição eletrônica, consumo aproximadamente: 1,7 l/h, capacidade do tanque: 3,6 l.","un x mês",{"$f":"2*12","v":24},null,0]
["3.1.7","COT_BOMB_4CV","Locação de bomba submersível para drenagem e esgotamento, motor elétrico trifásico, potência de  4 cv, diâmetro de recalque de 3\". Faixa de operação: Q= 60 m³/h (± 1 m³/h) e AMT=2 m; Q= 11 m³/h (± 1 m³/h) e AMT = 23 m (± 1 m).","un x mês",{"$f":"2*12","v":24},null,0]
["3.1.8","COT_BOMBA_2CV","Locação de bomba submersível para drenagem e esgotamento, motor elétrico trifásico, potência de 2 cv, diâmetro de recalque de  2\". Faixa de operação: Q= 35 m³/h (± 3 m³/h) e AMT=2 m; Q=13 m³/h (± 3 m³/h) e AMT = 17 m (± 3 m).","un x mês",{"$f":"2*12","v":24},null,0]
["3.1.9","E9579-DNIT/PE","Caminhão basculante, capacidade de carga  15,0 t e volume 10,0 m³ .","un x mês",{"$f":"3*12","v":36},null,0]
["3.1.10","E9506-DNIT/PE","Caminhao basculante, capacidade de carga  9,0 t e volume 6,0 m³ .","un x mês",{"$f":"3*12","v":36},null,0]
["3.1.11","E9592-DNIT/PE","Caminhão Carroceria - de madeira, capacidade de carga 15,0 t","un x mês",36,null,0]
["3.1.12","COT_CAMI","Caminhão Comboio para lubrificação e abastecimento (melosa), convencional totalmente equipado (Capacidade de Combustível: 5.000 l, Capacidade de Lubrificante: 500 l, Capacidade de Graxa: 200 kg, Capacidade de Água: 300 l, Recipiente para Óleo Usado: 200 l, Compressor de Ar e Bomba- d’agua).","un x mês",{"$f":"1*12","v":12},null,0]
["3.1.13","E9686-DNIT/PE","Caminhão guindauto com capacidade de carga até 10,0 t.","un x mês",{"$f":"3*12","v":36},null,0]
["3.1.14","E9605-DNIT/PE","Caminhão tanque, capacidade de volume  6000 l e potência 136,0 hp .","un x mês",{"$f":"3*12","v":36},null,0]
["3.1.15","4262 - SINAPI/PE","Pá carregadeira sobre rodas, potência líquida 128 hp, capacidade da caçamba de 1,7 a 2,8 m³, peso operacional de 11.632 kg.","un x mês",{"$f":"2*12","v":24},null,0]
["3.1.16","E9666-DNIT/PE","Transportes de máquinas e equipamentos por caminhão cavalo mecânico com carreta-prancha capacidade 20t","un x mês",{"$f":"1*12","v":12},null,0]
["3.1.17","E9107-DNIT/PE","Compactador de solo a percussão (soquete), com motor gasolina de 4 tempos, peso entre 55 e 65 kg, força de impacto de 1.000 a 1.500 kgf, frequência de 600 a 700 golpes por minuto,velocidade de trabalho entre 10 e 15 m/min, potência entre 2 e 3 hp.","un x mês",{"$f":"9*12","v":108},null,0]
["3.1.18","E9556-DNIT/PE","Compactador de solo, tipo placa vibratória reversível, com motor a diesel, peso entre 700 e 820 kg, força centrífuga entre 6.200 e 10.000 kgf, largura de trabalho entre 650 e 720 mm, frequência de vibração entre 3.000 e 3.500 rpm, velocidade de trabalho entre 25 e 30 m/min, potência entre 13,0 e 15,0 hp.","un x mês",{"$f":"5*12","v":60},null,0]
["3.1.19","E9513-DNIT/PE","Compressor de ar rebocável, vazão 400 pcm, pressão efetiva de trabalho 102 psi, motor diesel, potência 110 cv.","un x mês",{"$f":"1*12","v":12},null,0]
["3.1.20","E9661-DNIT/PE","Compressor de ar rebocável, vazão 189 pcm, pressão efetiva de trabalho 102 psi, motor diesel, potência  63 cv.","un x mês",{"$f":"1*12","v":12},null,0]
["3.1.21","COT_CONJ_160","Conjunto motorbomba com 160 kW de potência no motor elétrico (25 mca x 0,5 m³/s) para esgotamento, com respectivos mangotes de sucção e descarga a serem especificados em função dos diâmetros. ","un x mês",12,null,0]
["3.1.22","COT_CONJ_30","Conjunto motorbomba com 30 kW de potência no motor elétrico (25 mca x 0,1 m³/s) para esgotamento, com respectivos mangotes de sucção e descarga a serem especificados em função dos diâmetros. ","un x mês",12,null,0]
["3.1.23","E9528-DNIT/PE","Empilhadeira sobre pneus com torre de três estágios, 4,80 m de elevação, com deslocador lateral dos garfos, motor glp 2.4 l, capacidade nominal de carga de 2,5 t.","un x mês",12,null,0]
["3.1.24","E9017-DNIT/PE","Escavadeira hidráulica sobre esteiras, caçamba 0,62 m³, peso operacional 12,61 t, potência líquida 95 hp.","un x mês",12,null,0]
["3.1.25","COT_ESCAV","Escavadeira hidráulica sobre esteiras, caçamba  0,80 m³, peso operacional 17 t, potência bruta 111 hp.","un x mês",{"$f":"2*12","v":24},null,0]
["3.1.26","E9521-DNIT/PE","Grupo gerador de 4 KVA, 220v, trifásico, silenciado, com 100 metros de cabos e 01 QTA. ","un x mês",{"$f":"2*12","v":24},null,0]
["3.1.27","E9066-DNIT/PE","Grupo gerador de 10 KVA, 220v, trifásico, silenciado, com 100 metros de cabos e 01 QTA. ","un x mês",24,null,0]
["3.1.28","COT_GRUP_15KVA","Grupo gerador, potência nominal 15 kVA (emergência), incluindo instalação, cabeamento, base de concreto e demais materiais necessários.","un x mês",24,null,0]
["3.1.29","E9066-DNIT/PE","Grupo gerador de 15 kVA, 220V, trifásico, silenciado, com 100 metros de cabos e 01 QTA. ","un x mês",{"$f":"1*12","v":12},null,0]
["3.1.30","36500 - SINAPI/PE","Locação de grupo gerador acima de 125 até 180 kVA, motor diesel, rebocável, acionamento manual.","un x mês",{"$f":"1*12","v":12},null,0]
["3.1.31","39593 - SINAPI/PE","Grupo gerador diesel, com carenagem, potência standart entre 250 e 260 kVA, velocidade de 1800 rpm, frequência de 60 Hz.","un x mês",12,null,0]
["3.1.32","COT_PLAT","Plataforma Aérea, altura de trabalho 16,0 m, capacidade de carga 227 kg, fonte de energia: diesel, painel de controle na base e na plataforma, altura arriada: 2,0 m.","un x mês",{"$f":"2*12","v":24},null,0]
["3.1.33","40269 - SINAPI/PE","Serra circular de bancada, modelo pica-pau, diâmetro de 350 mm. Características do motor: trifásico, potência de 5 hp, frequência de 60 H.","un x mês",{"$f":"3*12","v":36},null,0]
["3.1.34","40403 - SINAPI/PE","Máquina de solda elétrica de 250 A com kit.","un x mês",{"$f":"3*12","v":36},null,0]
["3.1.35","E9568-DNIT/PE","Furadeira elétrica profissional.","un x mês",36,null,0]
["3.1.36","13192 - SINAPI/PE","Lixadeira elétrica angular para concreto, potência 1.400 W, prato diamantado de 5''.","un x mês",36,null,0]
["3.1.37","14619 - SINAPI/PE","Máquina para corte com disco abrasivo de diâmetro de 18'' (450 mm), com motor elétrico trifásico de 10 cv.","un x mês",{"$f":"3*12","v":36},null,0]
["3.1.38","40703 - SINAPI/PE","Martelete rompedor 33 kg.","un x mês",36,null,0]
["3.1.39","36533 - SINAPI/PE","Martelo demolidor pneumático manual, com redução de vibração, peso de 31,5 kg.","un x mês",36,null,0]
["3.1.40","37514 - SINAPI/PE","Minicarregadeira sobre rodas, potência líquida de 47 hp, capacidade nominal de operação de 646 kg.","un x mês",{"$f":"2*12","v":24},null,0]
["3.1.41","4090 - SINAPI/PE","Motoniveladora com escarificador (potência básica líquida -primeira marcha- 125 hp , peso bruto 13.843 kg, largura da lâmina de 3,7 m)","un x mês",{"$f":"2*12","v":24},null,0]
["3.1.42","13955 - SINAPI/PE","Motoserra portátil com motor a gosolina de 60 cc.","un x mês",{"$f":"3*12","v":36},null,0]
["3.1.43","4778 - SINAPI/PE","Perfuratriz pneumática manual de peso médio, 18 kg, comprimento de curso de 6 m, diâmetro do pistão de 5,5 cm","un x mês",{"$f":"1*12","v":12},null,0]
["3.1.44","E9526-DNIT/PE","Retroescavadeira sobre rodas com carregadeira, tração 4x4, potência líquida 72 hp, peso operacional mínimo de 7.140 kg, capacidade mínima da carregadeira de 0,79 m³ e da retroescavadeira mínima de 0,18 m³, profundidade de escavação máxima de 4,50 m.","un x mês",{"$f":"6*12","v":72},null,0]
["3.1.45","10664 - SINAPI/PE","Roçadeira deslocável, largura de trabalho de 1,3 m.","un x mês",{"$f":"1*12","v":12},null,0]
["3.1.46","10559 - SINAPI/PE","Roçadeira costal com motor a gasolina de  32 cc.","un x mês",{"$f":"6*12","v":72},null,0]
["3.1.47","E9685-DNIT/PE","Rolo compactador pé-de-carneiro vibratório, potência 125 hp, peso operacional sem/com lastro 11,95/13,30 t, impacto dinâmico 38,5/22,5 t, largura de trabalho 2,15 m.","un x mês",{"$f":"2*12","v":24},null,0]
["3.1.48","COT_TORR","Torre de iluminação 4000 W","un x mês",{"$f":"3*12","v":36},null,0]
["3.1.49","36511 - SINAPI/PE","Trator Agrícola para reboque de máquina roçadeira","un x mês",{"$f":"1*12","v":12},null,0]
["3.1.50","E9540-DNIT/PE","Trator de esteiras, potência de 150 hp, peso operacional de 16,7 t, com roda motriz elevada e lâmina com contato de 3,18 m³.","un x mês",{"$f":"1*12","v":12},null,0]
["3.1.51","39628 - SINAPI/PE","Motor a diesel para vibrador de imersão de 4,7 cv.","un x mês",12,null,0]
["3.1.52","39399 - SINAPI/PE","Vibrador de imersão, com ponteira de 35 mm, mangote de 5 m, sem motor.","un x mês",{"$f":"3*12","v":36},null,0]
["3.1.53","39400 - SINAPI/PE","Vibrador de imersão, com ponteira de 45 mm, mangote de 5 m, sem motor.","un x mês",{"$f":"3*12","v":36},null,0]
["3.1.54","39401 - SINAPI/PE","Vibrador de imersão, com ponteira de 60 mm, mangote de 5 m, sem motor.","un x mês",36,null,0]
[{"$f":"\"TOTAL - \"&C77&\":\"","v":"TOTAL - MANUTENÇÃO:"},{"$nulls":5},{"$f":"SUBTOTAL(9,G77:G131)","v":0}]
[]
["3.2",null,"SEGURANÇA DE BARRAGEM"]
["3.2.1","E9763-DNIT/PE","Grupo Gerador - 32,0 kVA, 220 V, trifásico, silenciado, com 100 metros de cabos e 01 QTA. ","un x mês",12,null,{"$f":"ROUND(E135*F135,2)","v":0}]
["3.2.2","4090 - SINAPI/PE","Motoniveladora com escarificador (potência básica líquida -primeira marcha- 125 hp , peso bruto 13.843 kg, largura da lâmina de 3,7 m)","un x mês",12,null,0]
["3.2.3","E9017-DNIT/PE","Escavadeira hidráulica sobre esteiras, caçamba 0,62 m³, peso operacional 12,61 t, potência líquida 95 hp.","un x mês",12,null,0]
["3.2.4","E9540-DNIT/PE","Trator de esteiras, potência de 150 hp, peso operacional de 16,7 t, com roda motriz elevada e lâmina com contato de 3,18 m³.","un x mês",12,null,0]
["3.2.5","E9666-DNIT/PE","Cavalo Mecânico com Reboque M. Benz Randon LS-1634/45 29,5 t, ou similar","un x mês",12,null,0]
["3.2.6","E9685-DNIT/PE","Rolo compactador pé-de-carneiro vibratório, potência 125 hp, peso operacional sem/com lastro 11,95/13,30 t, impacto dinâmico 38,5/22,5 t, largura de trabalho 2,15 m.","un x mês",12,null,0]
["3.2.7","E9043-DNIT/PE","Barco tipo Alumínio, 7 m de comprimento, Alumínio soldado, reforçado, borda sem corrimão, chapa de Alumínio 2,00 cm, boca 1,50 cm, borda 0,60 cm (inclusive barqueiro)","un x mês",144,null,0]
["3.2.8","A9382-DNIT/PE","Carreta Reboque (para embarcação)","un x mês",144,null,0]
["3.2.9","COT_MOTO_POP","Motor popa, tipo partida manual, potência 15 hp, aplicação barco Alumínio, características adicionais: válvulas automáticas descompressão, refrigerado a ar, quantidade marchas 2 und, quantidade cilíndro 2 und, capacidade tanque 23 l, tipo motor: 2 tempos, velocidade: 4.500 a 5.800 rpm.","un x mês",144,null,0]
[{"$f":"\"TOTAL - \"&C134&\" - (R$):\"","v":"TOTAL - SEGURANÇA DE BARRAGEM - (R$):"},{"$nulls":5},{"$f":"SUBTOTAL(9,G134:G143)","v":0}]
[]
[{"$f":"\"TOTAL - \"&C76&\" - (R$):\"","v":"TOTAL - EQUIPAMENTOS - CIVIL - (R$):"},{"$nulls":5},{"$f":"SUBTOTAL(9,G76:G144)","v":0}]
[]
[{"$f":"\"TOTAL - \"&C13&\" - (R$):\"","v":"TOTAL - EQUIPAMENTOS - (R$):"},{"$nulls":5},{"$f":"SUBTOTAL(9,G13:G146)","v":0}]
[]
[]
[{"$f":"\"RESUMO - \"&A$8","v":"RESUMO - EQUIPAMENTOS"}]
["ITEM",null,"DESCRIÇÃO",null,null,"VALOR TOTAL (R$)"]
["01",null,{"$f":"C15","v":"EQUIPAMENTOS - MECÂNICA"},null,null,{"$f":"G60","v":0}]
["02",null,{"$f":"C62","v":"EQUIPAMENTOS - ELÉTRICA"},null,null,{"$f":"G74","v":0}]
["03",null,{"$f":"C76","v":"EQUIPAMENTOS - CIVIL"},null,null,{"$f":"G146","v":0}]
[{"$f":"\"TOTAL GERAL - \"&A151&\" -  (R$):\"","v":"TOTAL GERAL - RESUMO - EQUIPAMENTOS -  (R$):"},{"$nulls":4},{"$f":"SUM(F153:G155)","v":0}]
[]
[]
["NOME DO INFORMANTE:",{"$nulls":4},"QUALIFICAÇÃO:"]
[]
["ASSINATURA:",{"$nulls":4},"DATA:"]
[]
["OBSERVAÇÃO:"]
["1. A unidade adotada na planilha (un x mês) foi de acordo com o cronograma de alocação de recursos materiais, onde foi feita a divisão de uso mensalmente de cada equipamento, por canteiro. Dessa forma, é possivel diluir o custo durante todo o período do contrato."]
[]
["2. Os preços apresentados inlcuem o custo de operadores, motoristas e demais mão de obra necesária para utilização do mesmo. Bem como combustível, quando requeridos."]
[]
[]
["1. Considerado a carga horária de 176 horas/mês"]
[]
[null,null,"Carga horária mensal:",176,{"$f":"582.5/(12*30*8)","v":0.20225694444444445}]
[]
[null,null,null,"Operativa","R$/h (Operativa)","R$/h (Improdutiva)","R$/mês"]
[null,"COT_AFER","Aferidor de manômetro de 0 a 150 bar ",1,null,null,382.30555555555554]
[null,"COT_ALMO_FLEX","Almotolia de bico flexível 500ml",1,null,null,2.6751851851851853]
[null,"COT_ALMO_RIG","Almotolia de bico rígido 500ml",1,null,null,1.8862962962962959]
[null,"COT_ANAL","Analisador de grandezas elétricas trifásico, display LCD colorido 5,6\", TRMS 1.000 V, corrente 3.000A ",1,null,null,2485.67]
[null,"COT_ANDA","Andaime metálico tipo fachadeiro Dim: Largura= 1,20m / Altura por peça= 2,00m. (Altura Total=10m - 5 peças por conjunto)",1,null,null,2.99]
[null,"COT_BANC_TESTE","Bancada de teste, amperimetro 150A, voltímetro 40V ",1,null,null,13.76]
[null,"COT_BANC_OFIC","Bancada para oficina (Dim: 1,2m x 2,5m) ",1,null,null,58.701481481481487]
[null,"COT_BANC_PROT","Bancada protegida contra eletricidade estática ",1,null,null,61.09]
[null,"E9043-DNIT/PE","Barco tipo Alumínio, 7 m de comprimento, Alumínio soldado, reforçado, borda sem corrimão, chapa de Alumínio 2,00 cm, boca 1,50 cm, borda 0,60 cm (inclusive barqueiro)",1,{"$f":"65.0627-28.9143","v":36.148400000000009},{"$f":"29.2579-28.9143","v":0.34359999999999857},{"$f":"ROUND($D$171*(D182*E182+(1-D182)*F182),2)-G258","v":6012.19}]
[null,"COT_BETO","Betoneira, capacidade nominal 400 l, capacidade de mistura 310 l, motor a diesel potência 5 cv, sem carregador.",1,null,null,271.98]
[null,"36398 - SINAPI/PE","Betoneira, capacidade nominal 600 l, capacidade de mistura 440 l,  motor a diesel potência 10 cv, com carregador.",1,{"$f":"18470.78/(12*30*8)","v":6.4134652777777772},null,{"$f":"ROUND($D$171*(D184*E184+(1-D184)*F184),2)","v":1128.77}]
[null,"COT_BOMB_GRAX","Bomba de graxa manual 5kg ",1,null,null,14.312222222222223]
[null,"COT_BOMB_DRAGA","Bomba draga autoescorvante 3”x 3” , motor: 4 tempos, potência: 6,5cv, cilindrada: 196 cm³, ignição eletrônica, consumo aproximadamente: 1,7 l/h, capacidade do tanque: 3,6 l.",1,null,null,51.68]
[null,"4085 - SINAPI/PE","Bomba elétrica submersa para drenagem 5cv Flyght 3\" 12.3 m³/h (acompanhada com os mangotes, incluindo quadro de comando compatível com o modelo de bomba, 250 m de cabo flexível trifásico, isolado, tensão 600 V/1000 V, em conformidade com NBR 7288).",1,3.19,null,561.44000000000005]
[null,"COT_BOMB_SUB","Bomba Submersível 5 Cv Trifásica 380V, Q=2 - 52 m3/h e H= 3-25 mca.(Poço de rebaixamento do Res. de areias (Estrutura de Controle)",1,null,null,905.89027777777778]
[null,"E9579-DNIT/PE","Caminhão basculante, capacidade de carga  15,0 t e volume 10,0 m³ .",1,153.78909999999999,47.097900000000003,27066.880000000001]
[null,"E9506-DNIT/PE","Caminhao basculante, capacidade de carga  9,0 t e volume 6,0 m³ .",1,107.3732,44.026699999999998,18897.68]
[null,"E9592-DNIT/PE","Caminhão Carroceria - de madeira, capacidade de carga 15,0 t",1,151.7799,46.107799999999997,26713.26]
[null,"COT_CAMI","Caminhão Comboio para lubrificação e abastecimento (melosa), convencional totalmente equipado (Capacidade de Combustível: 5.000 l, Capacidade de Lubrificante: 500 l, Capacidade de Graxa: 200 kg, Capacidade de Água: 300 l, Recipiente para Óleo Usado: 200 l, Compressor de Ar e Bomba- d’agua).",1,null,null,11000]
[null,"E9686-DNIT/PE","Caminhão guindauto com capacidade de carga até 10,0 t.",1,179.2911,71.666300000000007,31555.23]
[null,"E9605-DNIT/PE","Caminhão tanque, capacidade de volume  6000 l e potência 136,0 hp .",1,149.4898,45.9831,26310.2]
[null,"A9382-DNIT/PE","Carreta Reboque (para embarcação)",0,11.354699999999999,6.4650999999999996,1137.8599999999999]
[null,"E9666-DNIT/PE","Cavalo Mecânico com Reboque M. Benz Randon LS-1634/45 29,5 t, ou similar",1,229.38839999999999,69.866799999999998,40372.36]
[null,"COT_CHAV_46","Chave de impacto 46mm boca/estria ",1,null,null,6.8411111111111111]
[null,"COT_CHAV_55","Chave de impacto 55mm boca/estria ",1,null,null,12.591481481481482]
[null,"COT_CHAV_60","Chave de impacto 60mm boca/estria ",1,null,null,13.599444444444442]
[null,"COT_CHAV_65","Chave de impacto 65mm boca/estria ",1,null,null,24.81722222222222]
[null,"COT_CHAV_70","Chave de impacto 70mm boca/estria ",1,null,null,22.496296296296297]
[null,"COT_CHAV_75","Chave de impacto 75mm boca/estria",1,null,null,37.027592592592597]
[null,"COT_CHAV_85","Chave de impacto 85mm boca/estria",1,null,null,62.664444444444449]
[null,"COT_CINT_20T","Cinta para elevação de carga  (comprimento: 6m / capacidade de carga: 20t)",1,null,null,69.444444444444443]
[null,"COT_CINT_3T","Cinta para elevação de carga (comprimento: 3m / capacidade de carga: 3t)",1,null,null,6.4644444444444442]
[null,"E9107-DNIT/PE","Compactador de solo a percussão (soquete), com motor gasolina de 4 tempos, peso entre 55 e 65 kg, força de impacto de 1.000 a 1.500 kgf, frequência de 600 a 700 golpes por minuto,velocidade de trabalho entre 10 e 15 m/min, potência entre 2 e 3 hp.",1,4.2076000000000002,0.61329999999999996,740.54]
[null,"E9556-DNIT/PE","Compactador de solo, tipo placa vibratória reversível, com motor a diesel, peso entre 700 e 820 kg, força centrífuga entre 6.200 e 10.000 kgf, largura de trabalho entre 650 e 720 mm, frequência de vibração entre 3.000 e 3.500 rpm, velocidade de trabalho entre 25 e 30 m/min, potência entre 13,0 e 15,0 hp.",1,6.8049999999999997,1.4742,1197.68]
[null,"E9661-DNIT/PE","Compressor de ar rebocável, vazão 189 pcm, pressão efetiva de trabalho 102 psi, motor diesel, potência  63 cv.",1,40.253700000000002,8.5904000000000007,7084.65]
[null,"E9513-DNIT/PE","Compressor de ar rebocável, vazão 400 pcm, pressão efetiva de trabalho 102 psi, motor diesel, potência 110 cv.",1,69.402600000000007,14.301299999999999,12214.86]
[null,"E9630-DNIT/PE","Conjunto Motor bomba 7,5 CV, 380 V, Q=75,6 m3/h e H=17 mca. (Poço de rebaixamento da EBV-3)",1,0.49940000000000001,0.2913,87.89]
[null,"COT_CONJ_160","Conjunto motorbomba com 160 kW de potência no motor elétrico (25 mca x 0,5 m³/s) para esgotamento, com respectivos mangotes de sucção e descarga a serem especificados em função dos diâmetros. ",1,null,null,24444.44]
[null,"COT_CONJ_30","Conjunto motorbomba com 30 kW de potência no motor elétrico (25 mca x 0,1 m³/s) para esgotamento, com respectivos mangotes de sucção e descarga a serem especificados em função dos diâmetros. ",1,null,null,3361.11]
[null,"COT_CORT","Cortador a frio para tubos - Cortador Tubo Ferro Ferrari 1/8\" - 2\"",1,null,null,19.653703703703702]
[null,"COT_CURV","Curvador de tubos (Até 1”) - Curvador e Dobrador De Tubos Manual",1,null,null,78.407037037037028]
[null,"COT_DATA","Data Logger de 4 a 20 mA (verificação de intermitência em instrumentação) ",1,null,null,31.96]
[null,"E9528-DNIT/PE","Empilhadeira sobre pneus com torre de três estágios, 4,80 m de elevação, com deslocador lateral dos garfos, motor glp 2.4 l, capacidade nominal de carga de 2,5 t.",1,{"$f":" 80.6238-18.5817","v":62.042100000000005},{"$f":"38.0837-18.5817","v":19.501999999999999},10919.41]
[null,"COT_ESCA_16","Escada articulada multifuncional 4x4 16 degraus",1,null,null,19.143518518518519]
[null,"38476 - SINAPI/PE","Escada de abrir com 2 x 8 degraus (2,40m) em alumínio ",1,{"$f":"222.39/(12*30*8)","v":7.7218749999999989E-2},null,13.59]
[null,"38477 - SINAPI/PE","Escada de marinheiro extensível em duraluníno com 10 x 20 degraus (3,00m / 6,00m) ",1,{"$f":"629.83/(12*30*8)","v":0.21869097222222222},null,38.49]
[null,"COT_ESCA_07","Escada metálica de 07 degraus ",1,null,null,6.8944444444444448]
[null,"COT_ESCAV","Escavadeira hidráulica sobre esteiras, caçamba  0,80 m³, peso operacional 17 t, potência bruta 111 hp.",1,null,null,22831.67]
[null,"E9017-DNIT/PE","Escavadeira hidráulica sobre esteiras, caçamba 0,62 m³, peso operacional 12,61 t, potência líquida 95 hp.",1,121.39749999999999,63.2102,21365.96]
[null,"COT_ESME","Esmerilhadeira angular de 4 ½” ",1,null,null,8.4977777777777774]
[null,"11359 - SINAPI/PE","Esmerilhadeira angular de 7” ",1,{"$f":"582.5/(12*30*8)","v":0.20225694444444445},null,35.6]
[null,"13761 - SINAPI/PE","Estação de solda com temperatura ajustável e proteção antiestático ",1,{"$f":"2234.14/(12*30*8)","v":0.77574305555555556},null,136.53]
[null,"10236 - ORSE/SE","Fonte de alimentação com tensão variável de 0 a 30Vcc de 3 A ",1,{"$f":"163.8/(12*30*8)","v":5.6875000000000002E-2},null,10.01]
[null,"COT_FONT","Fonte de bancada 12 V ",1,null,null,12.13]
[null,"E9568-DNIT/PE","Furadeira elétrica profissional.",1,0.13700000000000001,9.0700000000000003E-2,24.11]
[null,"I9378 - SEINFRA/CE","Furadeira Manual 650W 1050 – 1450 RPM 220V Ø 13mm",1,0.08,0.12,14.08]
[null,"COT_GERA","Gerador de corrente e tensão de 0 a 20 mA e 0 a 10V, precisão de 0,1% ",1,null,null,47.27]
[null,"E9763-DNIT/PE","Grupo Gerador - 32,0 kVA, 220 V, trifásico, silenciado, com 100 metros de cabos e 01 QTA. ",1,23.264800000000001,3.3586,4094.6]
[null,"E9066-DNIT/PE","Grupo gerador de 10 KVA, 220v, trifásico, silenciado, com 100 metros de cabos e 01 QTA. ",1,9.6560000000000006,1.9661999999999999,1699.46]
[null,"E9066-DNIT/PE","Grupo gerador de 15 kVA, 220V, trifásico, silenciado, com 100 metros de cabos e 01 QTA. ",1,9.6560000000000006,1.9661999999999999,1699.46]
[null,"E9521-DNIT/PE","Grupo gerador de 4 KVA, 220v, trifásico, silenciado, com 100 metros de cabos e 01 QTA. ",1,2.7597999999999998,0.1865,485.72]
[null,"39593 - SINAPI/PE","Grupo gerador diesel, com carenagem, potência standart entre 250 e 260 kVA, velocidade de 1800 rpm, frequência de 60 Hz.",1,{"$f":"128425.92/(12*30*8)","v":44.592333333333336},null,7848.25]
[null,"COT_GRUP_15KVA","Grupo gerador, potência nominal 15 kVA (emergência), incluindo instalação, cabeamento, base de concreto e demais materiais necessários.",1,null,null,3831.28]
[null,"COT_INDU","Indutor elétrico para aquecimento de rolamentos (JM 500) ",1,null,null,2012.1599999999999]
[null,"COT_KIT ","Kit para enchimento e complementação para gás SF6, composto de adaptador ,regulador, mangueira e manômetro padrão ",1,null,null,542.9]
[null,"746 - SINAPI/PE","Lavadora de alta pressão a diesel, partida elétrica, motor de 10 hp",1,{"$f":"2200/(12*30*8)","v":0.76388888888888884},null,{"$f":"ROUND($D$171*(D239*E239+(1-D239)*F239),2)","v":134.44}]
[null,"COT_LIXA","Lixadeira 4 1/2\" ",1,null,null,21.661481481481484]
[null,"13192 - SINAPI/PE","Lixadeira elétrica angular para concreto, potência 1.400 W, prato diamantado de 5''.",1,{"$f":"3631.23/(12*30*8)","v":1.26084375},null,221.91]
[null,"COT_BOMB_4CV","Locação de bomba submersível para drenagem e esgotamento, motor elétrico trifásico, potência de  4 cv, diâmetro de recalque de 3\". Faixa de operação: Q= 60 m³/h (± 1 m³/h) e AMT=2 m; Q= 11 m³/h (± 1 m³/h) e AMT = 23 m (± 1 m).",1,null,null,394.24]
[null,"COT_BOMBA_2CV","Locação de bomba submersível para drenagem e esgotamento, motor elétrico trifásico, potência de 2 cv, diâmetro de recalque de  2\". Faixa de operação: Q= 35 m³/h (± 3 m³/h) e AMT=2 m; Q=13 m³/h (± 3 m³/h) e AMT = 17 m (± 3 m).",1,null,null,281.60000000000002]
[null,"36500 - SINAPI/PE","Locação de grupo gerador acima de 125 até 180 kVA, motor diesel, rebocável, acionamento manual.",1,{"$f":"65745.55/(12*30*8)","v":22.828315972222224},null,4017.78]
[null,"COT_MACA_20T","Macaco de comando a distância 20 t - Macaco Hidráulico 20 Toneladas Tipo Garrafa",1,null,null,10.920370370370371]
[null,"COT_MACA_50T","Macaco de comando a distância 50 t - Macaco Hidráulico 50 Toneladas Tipo Garrafa",1,null,null,39.440555555555555]
[null,"COT_MACA_2T","Macaco tipo elevador capacidade de 2 t - Macaco Hidráulico 2 Toneladas tipo Garrafa",1,null,null,3.088703703703704]
[null,"COT_MACA_GIR","Macaco tipo girafa de 2 t - Guincho Hidráulico 2 Toneladas com Prolongador",1,null,null,109.81425925925925]
[null,"40403 - SINAPI/PE","Máquina de solda elétrica de 250 A com kit.",1,{"$f":"412.53/(12*30*8)","v":0.14323958333333334},null,25.21]
[null,"14619 - SINAPI/PE","Máquina para corte com disco abrasivo de diâmetro de 18'' (450 mm), com motor elétrico trifásico de 10 cv.",1,{"$f":"10264.49/(12*30*8)","v":3.5640590277777777},null,627.27]
[null,"40703 - SINAPI/PE","Martelete rompedor 33 kg.",1,{"$f":"5791.5/(12*30*8)","v":2.0109374999999998},null,353.93]
[null,"36533 - SINAPI/PE","Martelo demolidor pneumático manual, com redução de vibração, peso de 31,5 kg.",1,{"$f":"12425.2/(12*30*8)","v":4.3143055555555554},null,759.32]
[null,"37514 - SINAPI/PE","Minicarregadeira sobre rodas, potência líquida de 47 hp, capacidade nominal de operação de 646 kg.",1,{"$f":"144877.5/(12*30*8)","v":50.3046875},null,8853.6299999999992]
[null,"COT_MORS","Morsa para bancada nº 08 ",1,null,null,15.273888888888889]
[null,"COT_MOTO_ESMER","Motoesmeril de 1cv - 3.500 RPM ",1,null,null,34.413611111111109]
[null,"4090 - SINAPI/PE","Motoniveladora com escarificador (potência básica líquida -primeira marcha- 125 hp , peso bruto 13.843 kg, largura da lâmina de 3,7 m)",1,{"$f":"547000/(24*30*8)","v":94.965277777777771},null,16713.89]
[null,"39628 - SINAPI/PE","Motor a diesel para vibrador de imersão de 4,7 cv.",1,{"$f":"2469.63/(12*30*8)","v":0.85751041666666672},null,150.91999999999999]
[null,"COT_MOTO_POP","Motor popa, tipo partida manual, potência 15 hp, aplicação barco Alumínio, características adicionais: válvulas automáticas descompressão, refrigerado a ar, quantidade marchas 2 und, quantidade cilíndro 2 und, capacidade tanque 23 l, tipo motor: 2 tempos, velocidade: 4.500 a 5.800 rpm.",1,null,null,349.93]
[null,"13955 - SINAPI/PE","Motoserra portátil com motor a gosolina de 60 cc.",1,{"$f":"2478.93/(12*30*8)","v":0.86073958333333322},null,151.49]
[null,"COT_MULT","Multiplicador de Torque Manual 2700 N.m/2000 lb.ft CDI GA190",1,null,null,517.34944444444454]
[null,"7252 - SINAPI/PE","Nível de precisão  ",1,"2,03",null,357.28]
[null,"4262 - SINAPI/PE","Pá carregadeira sobre rodas, potência líquida 128 hp, capacidade da caçamba de 1,7 a 2,8 m³, peso operacional de 11.632 kg.",1,{"$f":"366628/(12*30*8)","v":127.30138888888889},null,22405.040000000001]
[null,"COT_PARA","Parafusadeira elétrica a bateria ",1,null,null,19.775925925925929]
[null,"4778 - SINAPI/PE","Perfuratriz pneumática manual de peso médio, 18 kg, comprimento de curso de 6 m, diâmetro do pistão de 5,5 cm",1,"2,70",null,475.2]
[null,"COT_PLAT","Plataforma Aérea, altura de trabalho 16,0 m, capacidade de carga 227 kg, fonte de energia: diesel, painel de controle na base e na plataforma, altura arriada: 2,0 m.",1,null,null,4606.6099999999997]
[null,"COT_PREN","Prensa hidráulica de 10 ton ",1,null,null,30.551666666666662]
[null,"E9207-DNIT/PE","Retífica elétrica ",1,0.53220000000000001,0.29299999999999998,93.67]
[null,"E9526-DNIT/PE","Retroescavadeira sobre rodas com carregadeira, tração 4x4, potência líquida 72 hp, peso operacional mínimo de 7.140 kg, capacidade mínima da carregadeira de 0,79 m³ e da retroescavadeira mínima de 0,18 m³, profundidade de escavação máxima de 4,50 m.",1,86.189499999999995,44.981699999999996,15169.35]
[null,"10559 - SINAPI/PE","Roçadeira costal com motor a gasolina de  32 cc.",1,{"$f":"2529.89/(12*30*8)","v":0.87843402777777768},null,154.6]
[null,"10664 - SINAPI/PE","Roçadeira deslocável, largura de trabalho de 1,3 m.",1,{"$f":"6875.7/(12*30*8)","v":2.3873958333333332},null,420.18]
[null,"E9685-DNIT/PE","Rolo compactador pé-de-carneiro vibratório, potência 125 hp, peso operacional sem/com lastro 11,95/13,30 t, impacto dinâmico 38,5/22,5 t, largura de trabalho 2,15 m.",1,114.5548,50.952500000000001,20161.64]
[null,"E9748-DNIT/PE","Rosqueadeira ( para tubos de ½” a 4”) -Rosqueadeira Elétrica 1/2 A 4 Pol. 750w 220v-Br Motors-Brr124bsp",1,{"$f":"19.0307-18.5817","v":0.44899999999999807},{"$f":"18.8355-18.5817","v":0.25379999999999825},79.02]
["E9535-DNIT/PE","40269 - SINAPI/PE","Serra circular de bancada, modelo pica-pau, diâmetro de 350 mm. Características do motor: trifásico, potência de 5 hp, frequência de 60 H.",1,{"$f":"3531.36/(12*30*8)","v":1.2261666666666666},null,215.81]
["E9719-DNIT/PE","10809 - SINAPI/PE","Talha capacidade 3t",1,"1,11",null,195.36]
[null,"13914 - SINAPI/PE","Talha Manual de Corrente com Alavanca 1,5 t Elevação 1,5m (Catraca 1,5 ton) ",1,{"$f":"705.75/(12*30*8)","v":0.24505208333333334},null,43.13]
[null,"COT_TIFO","Tifor 3t",1,null,null,149.00425925925927]
[null,"COT_TORR","Torre de iluminação 4000 W",1,null,null,1500]
[null,"E9666-DNIT/PE","Transportes de máquinas e equipamentos por caminhão cavalo mecânico com carreta-prancha capacidade 20t",1,229.38839999999999,69.866799999999998,40372.36]
[null,"36511 - SINAPI/PE","Trator Agrícola para reboque de máquina roçadeira",1,{"$f":"187207.46/(12*8*30)","v":65.00259027777777},null,11440.46]
[null,"E9540-DNIT/PE","Trator de esteiras, potência de 150 hp, peso operacional de 16,7 t, com roda motriz elevada e lâmina com contato de 3,18 m³.",1,168.8509,71.157799999999995,29717.759999999998]
[null,"COT_TTR ","TTR - medidor digital de relação de espiras, escala de medição 0,8000:1 a 8.000,0: 1 ",1,null,null,223.72]
["E9069-DNIT/PE","39399 - SINAPI/PE","Vibrador de imersão, com ponteira de 35 mm, mangote de 5 m, sem motor.",1,{"$f":"804.74/(12*30*8)","v":0.27942361111111114},null,49.18]
["E9069-DNIT/PE","39400 - SINAPI/PE","Vibrador de imersão, com ponteira de 45 mm, mangote de 5 m, sem motor.",1,{"$f":"874.72/(12*30*8)","v":0.30372222222222223},null,53.46]
["E9069-DNIT/PE","39401 - SINAPI/PE","Vibrador de imersão, com ponteira de 60 mm, mangote de 5 m, sem motor.",1,{"$f":"981.23/(12*30*8)","v":0.34070486111111109},null,59.96]

{"sheet":"Instrumentos","index":20,"n_rows":74,"n_cols":7,"rows_kept":74,"cut":false,"hidden":false,"merged":[[14,2,14,6],[30,2,30,6],[51,2,51,6],[0,2,0,6],[1,2,1,6],[2,2,2,6],[4,0,5,6],[7,0,7,6],[28,0,28,5],[10,0,11,0],[10,2,11,2],[10,3,11,3],[10,4,11,4],[10,5,10,6],[10,1,11,1],[12,2,12,6],[49,0,49,5],[69,0,69,4],[60,0,60,6],[64,5,64,6],[65,5,65,6],[68,0,68,4],[61,2,61,4],[61,5,61,6],[62,2,62,4],[62,5,62,6],[65,0,65,4],[63,2,63,4],[63,5,63,6],[64,2,64,4],[68,5,68,6],[69,5,69,6],[76,0,76,6],[73,0,74,6],[57,0,57,5],[75,0,75,6],[55,0,55,5],[72,0,72,6],[70,0,70,4],[71,0,71,4],[70,5,70,6],[71,5,71,6]]}
[null,null,"Ministério do Desenvolvimento Regional  - MDR"]
[null,null,"Companhia de Desenvolvimento dos Vales do São Francisco e do Parnaíba"]
[null,null,"Gerência de Operação do PISF - Centro de Controle e Operação (AD / GOI / CCO)"]
[]
["SERVIÇOS DE OPERAÇÃO E MANUTENÇÃO DAS INFRAESTRUTURAS DO EIXO LESTE DO PROJETO DE INTEGRAÇÃO DO RIO SÃO FRANCISCO COM AS BACIAS HIDROGRÁFICAS DO NORDESTE SETENTRIONAL – PISF"]
[]
[]
["INSTRUMENTOS"]
[]
[]
["ITEM","CÓDIGO","DESCRIÇÃO","UNIDADE","QUANTIDADE","VALOR (R$)"]
[{"$nulls":5},"UNITARIO","TOTAL"]
[null,null,{"$f":"A8","v":"INSTRUMENTOS"}]
[]
["1.",null,"INSTRUMENTOS - MECÂNICA"]
["1.1",null,"Analisador de vibração VIB 496FFY VIBOTRON","un x mês",{"$f":"1*12","v":12},null,{"$f":"ROUND(E16*F16,2)","v":0}]
["1.2",null,"Base magnética para relógio comparador","un x mês",{"$f":"4*12","v":48},null,0]
["1.3",null,"Estetoscópio Kent","un x mês",{"$f":"2*12","v":24},null,0]
["1.4",null,"Micrômetro 100 à 200 externo","un x mês",{"$f":"2*12","v":24},null,0]
["1.5",null,"Micrômetro externo 0 – 100mm","un x mês",24,null,0]
["1.6",null,"Micrômetro interno 50 – 800mm","un x mês",24,null,0]
["1.7",null,"Nível ótico (Topcon AT-B2) ou similar","un x mês",{"$f":"1*12","v":12},null,0]
["1.8",null,"Paquímetro digital 0 – 150mm/0,01mm","un x mês",{"$f":"2*12","v":24},null,0]
["1.9",null,"Paquímetro universal 0 - 650mm/0,02mm","un x mês",{"$f":"2*12","v":24},null,0]
["1.10",null,"Relógio comparador 0 – 10/0,01mm digital","un x mês",{"$f":"4*12","v":48},null,0]
["1.11",null,"Tacômetro digital 0,1 - 1,0 RPM DT - 2234 A","un x mês",{"$f":"1*12","v":12},null,0]
["1.12",null,"Termômetro mira laser escala de -20 a 500ºC","un x mês",{"$f":"1*12","v":12},null,0]
["1.13",null,"Termovisor, com resolução Infravermelha de 120 x 90, Sensibilidade Térmica menor que 0,10 ºC, frequência da imagem de 9 Hz e faixa de temperatura –20 a 250 °C. ","un x mês",{"$f":"1*12","v":12},null,0]
[{"$f":"\"TOTAL - \"&C15&\" - (R$):\"","v":"TOTAL - INSTRUMENTOS - MECÂNICA - (R$):"},{"$nulls":5},{"$f":"SUBTOTAL(9,G15:G28)","v":0}]
[]
["2.",null,"INSTRUMENTOS - ELÉTRICA"]
["2.1",null,"Alicate Amperímetro (mod. 381 CA/CC True-rms 1000V CAT III (ou similar)","un x mês",{"$f":"13*12","v":156},null,{"$f":"ROUND(E32*F32,2)","v":0}]
["2.2",null,"Alicate amperímetro CA/CC de 600V, digital, CAT III FLUKE 305","un x mês",{"$f":"10*12","v":120},null,0]
["2.3",null,"Alicate Medidor de qualidade de energia (mod. Fluke 345 ou  similar) ","un x mês",{"$f":"2*12","v":24},null,0]
["2.4",null,"Calibrador de processos multifunção digital (mod. Fluke 725 ou  similar) ","un x mês",{"$f":"2*12","v":24},null,0]
["2.5",null,"Fasímetro, digital, categoria IV, 40~700Vca, 600V ","un x mês",{"$f":"10*12","v":120},null,0]
["2.6",null,"Freqüencímetro gitital de bancada , 1GHz de 8 dígitos ","un x mês",{"$f":"1*12","v":12},null,0]
["2.7",null,"Medidor de distância, laser, amplitude de medição 1mm a 80m ","un x mês",{"$f":"1*12","v":12},null,0]
["2.8",null,"Medidor de resistência de aterramento e resistividade do solo (Faixa de medição de 0,02Ω a 300KΩ; Alcance de até 2 K Ω) com 02 pinças ","un x mês",{"$f":"1*12","v":12},null,0]
["2.9",null,"Medidor de vazão portátil tipo Clamp-on ","un x mês",12,null,0]
["2.10",null,"Megôhmetro digital de 5 kV, alcance de até 1 TΩ, Interface USB, IP54 ","un x mês",{"$f":"2*12","v":24},null,0]
["2.11",null,"Multímetro digital, tensão DC/AC 50,000 mV a 1000V, 0,4% (True/RMS), frequencia 99,999Hz a 999,99KHz  \"FLUKE-87-V\" com pontas prova TWIST GUARD","un x mês",{"$f":"13*12","v":156},null,0]
["2.12",null,"Multímetro digital para teste de equipotencialização (medições de baixas resistências), 100V, 10A, 0,1 Ω a 50 Ω ","un x mês",{"$f":"13*12","v":156},null,0]
["2.13",null,"Osciloscópio portátil com frequência de trabalho de 100Mhz, LCD Colorido 7”,  CAT II 600V ","un x mês",{"$f":"1*12","v":12},null,0]
["2.14",null,"Power Meter (Medidor Potência Fibra Óptica) potência 1310 nm, 1490 nm e 1550 nm  + Caneta Laser 10w ","un x mês",{"$f":"2*12","v":24},null,0]
["2.15",null,"Termômetro mira laser escala de -30ºC a 500ºc ","un x mês",{"$f":"13*12","v":156},null,0]
["2.16",null,"Termovisor -20ºC a 350ºC, com camera de 5 megapixels, visor LCD de 3,5 polegadas ","un x mês",{"$f":"1*12","v":12},null,0]
["2.17",null,"Testador de cabos RJ45 / 11, frequencia 200kHz, display LCD 3 ½ digitos, 600V ","un x mês",{"$f":"2*12","v":24},null,0]
["2.18",null,"Verificador elétrico de tensão 1000V, sem contato com cabo (mod. T6-1000 Fluke ou similar) ","un x mês",{"$f":"13*12","v":156},null,{"$f":"ROUND(E49*F49,2)","v":0}]
[{"$f":"\"TOTAL - \"&C31&\" - (R$):\"","v":"TOTAL - INSTRUMENTOS - ELÉTRICA - (R$):"},{"$nulls":5},{"$f":"SUBTOTAL(9,G31:G49)","v":0}]
[]
["3.",null,"INSTRUMENTOS - CIVIL"]
["3.1",null,"GPS Geodésico portátil com visor 65K de cores legível sob luz solar, à prova d'água, geocaching informatizado e recurso de mapeamento ampliados.","un x mês",{"$f":"9*12","v":108},null,{"$f":"ROUND(E53*F53,2)","v":0}]
["3.2",null,"Estação Total com leitura direta de 1 segundo e precisão de 2\". Prumo óptico na alidade. Interface com principais softwares do mercado, à prova d'água e poeira conforme norma internacional: IEC529. Com kit completo, inclusive tripé com pernas extensíveis.","un x mês",{"$f":"1*12","v":12},null,0]
["3.3",null,"Nível automático com precisão de ± 1,0 mm/km duplo de nivelamento, aumento de imagem 32 vezes, limbo horizontal com escala de 1º, abertura da objetiva 45 mm, foco mínimo 1,60 m. Com tripé e mira.","un x mês",{"$f":"1*12","v":12},null,0]
[{"$f":"\"TOTAL - \"&C52&\" - (R$):\"","v":"TOTAL - INSTRUMENTOS - CIVIL - (R$):"},{"$nulls":5},{"$f":"SUBTOTAL(9,G52:G55)","v":0}]
[]
[{"$f":"\"TOTAL - \"&C13&\" - (R$):\"","v":"TOTAL - INSTRUMENTOS - (R$):"},{"$nulls":5},{"$f":"SUBTOTAL(9,G13:G57)","v":0}]
[]
[]
[{"$f":"\"RESUMO - \"&A$8","v":"RESUMO - INSTRUMENTOS"}]
["ITEM",null,"DESCRIÇÃO",null,null,"VALOR TOTAL (R$)"]
["01",null,{"$f":"C15","v":"INSTRUMENTOS - MECÂNICA"},null,null,{"$f":"G29","v":0}]
["02",null,{"$f":"C31","v":"INSTRUMENTOS - ELÉTRICA"},null,null,{"$f":"G50","v":0}]
["03",null,{"$f":"C52","v":"INSTRUMENTOS - CIVIL"},null,null,{"$f":"G56","v":0}]
[{"$f":"\"TOTAL GERAL - \"&A61&\" - (R$):\"","v":"TOTAL GERAL - RESUMO - INSTRUMENTOS - (R$):"},{"$nulls":4},{"$f":"SUM(F63:G65)","v":0}]
[]
[]
["NOME DO INFORMANTE:",{"$nulls":4},"QUALIFICAÇÃO:"]
[]
["ASSINATURA:",{"$nulls":4},"DATA:"]
[]
["OBSERVAÇÃO:"]
["1. A unidade adotada na planilha (un x mês) foi de acordo com o cronograma de alocação de recursos materiais, onde foi feita a divisão de uso mensalmente de cada equipamento, por canteiro. Dessa forma, é possivel diluir o custo durante todo o período do contrato."]

{"sheet":"Radios_Comunicadores","index":21,"n_rows":32,"n_cols":7,"rows_kept":32,"cut":false,"hidden":false,"merged":[[0,2,0,6],[1,2,1,6],[2,2,2,6],[4,0,5,6],[7,0,7,6],[21,0,21,6],[22,2,22,4],[22,5,22,6],[18,0,18,5],[10,0,11,0],[10,2,11,2],[10,3,11,3],[10,4,11,4],[10,5,10,6],[12,2,12,6],[10,1,11,1],[32,0,32,6],[33,0,33,6],[23,2,23,4],[23,5,23,6],[24,0,24,4],[24,5,24,6],[31,0,31,6],[27,0,27,4],[28,0,28,4],[29,0,29,4],[30,0,30,4],[27,5,27,6],[28,5,28,6],[29,5,29,6],[30,5,30,6]]}
[null,null,"Ministério do Desenvolvimento Regional  - MDR"]
[null,null,"Companhia de Desenvolvimento dos Vales do São Francisco e do Parnaíba"]
[null,null,"Gerência de Operação do PISF - Centro de Controle e Operação (AD / GOI / CCO)"]
[]
["SERVIÇOS DE OPERAÇÃO E MANUTENÇÃO DAS INFRAESTRUTURAS DO EIXO LESTE DO PROJETO DE INTEGRAÇÃO DO RIO SÃO FRANCISCO COM AS BACIAS HIDROGRÁFICAS DO NORDESTE SETENTRIONAL – PISF"]
[]
[]
["SISTEMA DE RÁDIO COMUNICAÇÃO"]
[]
[]
["ITEM","CÓDIGO","DESCRIÇÃO","UNIDADE","QUANTIDADE","VALOR (R$)"]
[{"$nulls":5},"UNITARIO","TOTAL"]
["1.",null,"SISTEMA DE RÁDIO COMUNICAÇÃO"]
["1.1",null,"Sistema de repetidoras VHF interligadas com link UHF - 4 antenas","un x mês",{"$f":"1*12","v":12},null,{"$f":"ROUND(E14*F14,2)","v":0}]
["1.2",null,"Rádio VHF portátil EP 450 (Reservatórios)","un x mês",{"$f":"13*12","v":156},null,{"$f":"ROUND(E15*F15,2)","v":0}]
["1.3",null,"Rádio VHF móvel digital para viatura","un x mês",{"$f":"SUM(Veiculos!E16:E19)","v":{"$error":"#REF!"}},null,{"$error":"#REF!"}]
["1.4",null,"Rádio VHF para instalação nas EB's, SE´s e Canteiros, composto por rádio base e sistema irradiante","un x mês",{"$f":"(3+6+6)*12","v":180},null,0]
["1.5",null,"Serviço de instalação e configuração de sistema de repetidoras e infraestrutura","un x mês",1,null,0]
[{"$f":"\"TOTAL - \"&C13&\" - (R$):\"","v":"TOTAL - SISTEMA DE RÁDIO COMUNICAÇÃO - (R$):"},{"$nulls":5},{"$f":"SUBTOTAL(9,G13:G18)","v":{"$error":"#REF!"}}]
[]
[]
[{"$f":"\"RESUMO - \"&A$8","v":"RESUMO - SISTEMA DE RÁDIO COMUNICAÇÃO"}]
["ITEM",null,"DESCRIÇÃO",null,null,"VALOR TOTAL (R$)"]
[1,null,{"$f":"C13","v":"SISTEMA DE RÁDIO COMUNICAÇÃO"},null,null,{"$f":"G19","v":{"$error":"#REF!"}}]
[{"$f":"\"TOTAL GERAL - \"&A22&\" - (R$):\"","v":"TOTAL GERAL - RESUMO - SISTEMA DE RÁDIO COMUNICAÇÃO - (R$):"},{"$nulls":4},{"$f":"SUM(F24:G24)","v":{"$error":"#REF!"}}]
[]
[]
["NOME DO INFORMANTE:",{"$nulls":4},"QUALIFICAÇÃO:"]
[]
["ASSINATURA:",{"$nulls":4},"DATA:"]
[]
["OBSERVAÇÃO:"]

{"sheet":"Custos Administração","index":22,"n_rows":29,"n_cols":3,"rows_kept":29,"cut":false,"hidden":false,"merged":[[0,1,0,2],[1,1,1,2],[2,1,2,2],[4,0,5,2],[7,0,7,2],[21,0,21,1],[24,0,24,1],[25,0,25,1],[31,0,31,2],[11,1,11,2],[26,0,26,1],[27,0,27,1],[28,0,28,2],[29,0,29,2],[30,0,30,2],[15,0,15,1],[18,0,18,2]]}
[null,"Ministério do Desenvolvimento Regional  - MDR"]
[null,"Companhia de Desenvolvimento dos Vales do São Francisco e do Parnaíba"]
[null,"Gerência de Operação do PISF - Centro de Controle e Operação (AD / GOI / CCO)"]
[]
["SERVIÇOS DE OPERAÇÃO E MANUTENÇÃO DAS INFRAESTRUTURAS DO EIXO LESTE DO PROJETO DE INTEGRAÇÃO DO RIO SÃO FRANCISCO COM AS BACIAS HIDROGRÁFICAS DO NORDESTE SETENTRIONAL – PISF"]
[]
[]
["CUSTOS ADMINISTRAÇÃO - DETALHAMENTO"]
[]
[]
["ITEM","DESCRIÇÃO","%"]
["1.","CUSTO DE ADMINISTRAÇÃO"]
["1.1","Custos da equipe da administração central da empresa contratada ( diretoria, pessoal técnico de apoio e pessoal administrativo não diretamente vinculado à prestação dos serviços)",7.0000000000000007E-2]
["1.2","Outras despesas que afetam o custo de produção como treinamento, biblioteca, programa de qualidade, auditoria interna e externa",1.4999999999999999E-2]
["1.3","Despesas com aluguéis, água, energia, comunicação, manutenção e transporte não diretamente relacionados com o custo direto dos serviços",1.4999999999999999E-2]
[{"$f":"\"Total - \"&B12&\" - (R$):\"","v":"Total - CUSTO DE ADMINISTRAÇÃO - (R$):"},null,{"$f":"SUBTOTAL(9,C12:C15)","v":0.1}]
[]
[]
[{"$f":"\"RESUMO - \"&A$8","v":"RESUMO - CUSTOS ADMINISTRAÇÃO - DETALHAMENTO"}]
["ITEM","DESCRIÇÃO","% TOTAL"]
[1,{"$f":"B12","v":"CUSTO DE ADMINISTRAÇÃO"},{"$f":"C16","v":0.1}]
[{"$f":"\"TOTAL GERAL - \"&A$8&\" - (R$):\"","v":"TOTAL GERAL - CUSTOS ADMINISTRAÇÃO - DETALHAMENTO - (R$):"},null,{"$f":"SUM(C21:C21)","v":0.1}]
[]
[]
["NOME DO INFORMANTE:",null,"QUALIFICAÇÃO:"]
[]
["ASSINATURA:",null,"DATA:"]
[]
["OBSERVAÇAO:"]

{"sheet":"Despesas Fiscais","index":23,"n_rows":34,"n_cols":4,"rows_kept":34,"cut":false,"hidden":false,"merged":[[4,0,5,3],[7,0,7,3],[0,1,0,3],[1,1,1,3],[2,1,2,3],[11,1,11,3],[15,0,15,1],[24,0,25,1],[24,2,25,3],[26,0,26,1],[18,0,18,3],[27,0,27,1],[26,2,26,3],[27,2,27,3],[21,0,21,1],[19,2,19,3],[20,2,20,3],[21,2,21,3],[28,0,28,3],[33,0,33,3],[29,0,29,3],[30,0,30,3],[34,0,34,3],[31,0,32,3]]}
[null,"Ministério do Desenvolvimento Regional  - MDR"]
[null,"Companhia de Desenvolvimento dos Vales do São Francisco e do Parnaíba"]
[null,"Gerência de Operação do PISF - Centro de Controle e Operação (AD / GOI / CCO)"]
[]
["SERVIÇOS DE OPERAÇÃO E MANUTENÇÃO DAS INFRAESTRUTURAS DO EIXO LESTE DO PROJETO DE INTEGRAÇÃO DO RIO SÃO FRANCISCO COM AS BACIAS HIDROGRÁFICAS DO NORDESTE SETENTRIONAL – PISF"]
[]
[]
["DESPESAS FISCAIS - DETALHAMENTO"]
[]
[]
["ITEM","DESCRIÇÃO","DF %","DF' %"]
["1.","DESPESAS FISCAIS"]
["1.1","ISS",0.05,{"$f":"ROUND((1/(1-$C$16))*C13,4)","v":5.8299999999999998E-2}]
["1.2","PIS",1.6500000000000001E-2,1.9199999999999998E-2]
["1.3","COFINS",7.5999999999999998E-2,{"$f":"ROUND((1/(1-$C$16))*C15,4)","v":8.8599999999999998E-2}]
[{"$f":"\"TOTAL - \"&B12&\" - (R$):\"","v":"TOTAL - DESPESAS FISCAIS - (R$):"},null,{"$f":"SUM(C13:C15)","v":0.14250000000000002},{"$f":"SUM(D13:D15)","v":0.1661}]
[]
[]
[{"$f":"\"RESUMO - \"&A$8","v":"RESUMO - DESPESAS FISCAIS - DETALHAMENTO"}]
["ITEM","DESCRIÇÃO","% TOTAL"]
[1,{"$f":"B12","v":"DESPESAS FISCAIS"},{"$f":"D16","v":0.1661}]
[{"$f":"\"TOTAL GERAL - \"&A$8&\" - (R$):\"","v":"TOTAL GERAL - DESPESAS FISCAIS - DETALHAMENTO - (R$):"},null,{"$f":"SUM(C21:C21)","v":0.1661}]
[]
[]
["NOME DO INFORMANTE:",null,"QUALIFICAÇÃO:"]
[]
["ASSINATURA:",null,"DATA:"]
[]
["OBSERVAÇAO:"]
["1. Ddiscriminar os tributos que incidem sobre os custos da prestação dos serviços."]
["2. DF = Indicar o % de cada tributo e soma dos mesmos (ex: ISS 5% + PIS 1,65% + COFINS 7,60% = 14,25%)"]
["3. As despesas fiscais (DF) incindem sobre o total da fatura  e não sobre os custos incorridos, devendo ser calculado o DF', aplicando-se a seguinte fórmula:"]
[]
["     DF' = { [ 1 / ( 1 - DF) ] - 1 } x 100"]