{"text_format":"2","workbook":"xlsx","n_sheets":2,"sheets":["ORÇAMENTO","RELAÇÃO DE COMPOSIÇÕES"],"not_rendered":{"charts":0,"images":1,"macros":0,"external_links":0,"defined_names":0,"comments":0,"pivot_tables":0},"unopened":[],"bounds":{"document_bytes":16777216,"sheet_cells":100000,"run_cost":"one","rows_first":2000,"rows_last":500,"rows_between":2000,"halvings":0,"cell_chars":16384,"cell_head_chars":4096},"cells_cut":0,"cells_raw":0,"read":"whole","date_system":"1900"}

{"sheet":"ORÇAMENTO","index":0,"n_rows":376,"n_cols":8,"rows_kept":376,"cut":false,"hidden":false,"merged":[[8,0,8,7],[0,0,0,7],[1,0,1,7],[2,0,2,7],[7,0,7,7],[3,0,3,5],[4,0,4,5],[6,0,6,5]]}
[]
[]
[]
[{"$nulls":6},"DATA BASE: "," junho -2020"]
["COMPLEXO (REFORMA DA PRAÇA TENISSON FONTES - PRAÇA DE ALIMENTAÇÃO  E CONSTRUÇÃO DE TERMINAL RODOVIÁRIO) - ETAPA 1",{"$nulls":5},"PREÇO GLOBAL:",{"$f":"H376","v":1099532.5900000001}]
[{"$f":"#REF!","v":{"$error":"#REF!"}},{"$nulls":5},"BDI:",0]
["LOCAL:    município de Itabaianinha, no estado de Sergipe",{"$nulls":5},"BDI ",21.39]
["PLANILHA ORÇAMENTÁRIA DA OBRA"]
[]
["ITEM","CÓDIGO","DESCRIÇÃO","UNID.","QUANTIDADE","CUST. UNIT","PREÇO UNIT.","PREÇO TOTAL"]
[1,null,"ADMINISTRAÇÃO LOCAL E SERVIÇOS PRELIMINARES"]
["1.1",null,"ADMINISTRAÇÃO LOCAL"]
["1.1.1",null,"Equipe Dirigente"]
["1.1.1.1","CPU_1","Engenheiro civil de obra junior com encargos complementares","h",96,{"$f":"IF(B14=\"\",\"\",VLOOKUP(B14,'RELAÇÃO DE COMPOSIÇÕES'!$A$10:$F$374,6,FALSE))","v":93.87},{"$f":"IF(B14=\"\",\"\",ROUND(F14*(1+$H$6),2))","v":93.87},{"$f":"IF(B14=\"\",\"\",ROUND(E14*G14,2))","v":9011.52}]
["1.1.1.2","CPU_2","Mestre de obras com encargos complementares","h",960,{"$f":"IF(B15=\"\",\"\",VLOOKUP(B15,'RELAÇÃO DE COMPOSIÇÕES'!$A$10:$F$374,6,FALSE))","v":43.19},{"$f":"IF(B15=\"\",\"\",ROUND(F15*(1+$H$6),2))","v":43.19},{"$f":"IF(B15=\"\",\"\",ROUND(E15*G15,2))","v":41462.400000000001}]
["1.1.2","CPU_3","Manutenção do Canteiro","un",1,{"$f":"IF(B16=\"\",\"\",VLOOKUP(B16,'RELAÇÃO DE COMPOSIÇÕES'!$A$10:$F$374,6,FALSE))","v":3098.21},3098.21,3098.21]
["1.2",null,"SERVIÇOS PRELIMINARES"]
["1.2.1","CPU_4","Placa de obra em chapa aço galvanizado, instalada","m2",6,{"$f":"IF(B18=\"\",\"\",VLOOKUP(B18,'RELAÇÃO DE COMPOSIÇÕES'!$A$10:$F$374,6,FALSE))","v":341.38},{"$f":"IF(B18=\"\",\"\",ROUND(F18*(1+$H$6),2))","v":341.38},{"$f":"IF(B18=\"\",\"\",ROUND(E18*G18,2))","v":2048.2800000000002}]
["1.2.2","CPU_5","Instalação provisória de energia elétrica, aerea, trifasica, em poste galvanizado, exclusive fornecimento do medidor","un",1,{"$f":"IF(B19=\"\",\"\",VLOOKUP(B19,'RELAÇÃO DE COMPOSIÇÕES'!$A$10:$F$374,6,FALSE))","v":1953.49},1953.49,1953.49]
["1.2.3","CPU_6","Ligação Predial de Água em Mureta de Concreto, Provisória ou Definitiva, com Fornecimento de Material, inclusive Mureta e Hidrômetro, Rede DN 50mm","UN",1,{"$f":"IF(B20=\"\",\"\",VLOOKUP(B20,'RELAÇÃO DE COMPOSIÇÕES'!$A$10:$F$374,6,FALSE))","v":459.67},459.67,459.67]
["1.2.4","CPU_7","Tapume com telha metálica. af_05/2018 (para o terminal rodoviário)","m2",345.6,{"$f":"IF(B21=\"\",\"\",VLOOKUP(B21,'RELAÇÃO DE COMPOSIÇÕES'!$A$10:$F$374,6,FALSE))","v":73.959999999999994},73.959999999999994,25560.58]
["1.2.5","CPU_8","Locação de container - Almoxarifado com banheiro - 6,00 x 2,30m","mês",5,{"$f":"IF(B22=\"\",\"\",VLOOKUP(B22,'RELAÇÃO DE COMPOSIÇÕES'!$A$10:$F$374,6,FALSE))","v":439.48},439.48,2197.4]
["1.2.6","CPU_9","Locação de container - Escritório com banheiro - 6,20 x 2,20m","mês",5,{"$f":"IF(B23=\"\",\"\",VLOOKUP(B23,'RELAÇÃO DE COMPOSIÇÕES'!$A$10:$F$374,6,FALSE))","v":562.53},{"$f":"IF(B23=\"\",\"\",ROUND(F23*(1+$H$6),2))","v":562.53},{"$f":"IF(B23=\"\",\"\",ROUND(E23*G23,2))","v":2812.65}]
[2,null,"TERMINAL RODOVIÁRIO"]
["2.1",null,"DEMOLIÇÃO"]
["2.1.1","CPU_10","Demolição de pavimentação em paralelepípedo sem reaproveitamento","m2",597.4,{"$f":"IF(B26=\"\",\"\",VLOOKUP(B26,'RELAÇÃO DE COMPOSIÇÕES'!$A$10:$F$374,6,FALSE))","v":9.4600000000000009},9.4600000000000009,5651.4]
["2.1.2","CPU_11","Carga manual de entulho em caminhao basculante 6 m3","m3",74.680000000000007,{"$f":"IF(B27=\"\",\"\",VLOOKUP(B27,'RELAÇÃO DE COMPOSIÇÕES'!$A$10:$F$374,6,FALSE))","v":21.29},21.29,1589.94]
["2.2",null,"MOVIMENTAÇÃO DE TERRA"]
["2.2.1","CPU_13","Escavacao, carga e transporte de  material de 1a categoria com trator sobre esteiras 347 hp e cacamba 6m3,  dmt 50 a 200m","m3",597.4,{"$f":"IF(B29=\"\",\"\",VLOOKUP(B29,'RELAÇÃO DE COMPOSIÇÕES'!$A$10:$F$374,6,FALSE))","v":3.9},3.9,2329.86]
["2.3",null,"PAVIMENTAÇÃO"]
["2.3.1","CPU_14","Regularização manual e compactão com placa vibratótia","m2",891.08,{"$f":"IF(B31=\"\",\"\",VLOOKUP(B31,'RELAÇÃO DE COMPOSIÇÕES'!$A$10:$F$374,6,FALSE))","v":5.55},5.55,4945.49]
["2.3.2","CPU_15","Pavimento em concreto armado fck=25mpa, desempolado, e=10cm, p/ sobrecargas de até 4t/m2 c/ tela soldada Q138","m2",391.42,{"$f":"IF(B32=\"\",\"\",VLOOKUP(B32,'RELAÇÃO DE COMPOSIÇÕES'!$A$10:$F$374,6,FALSE))","v":76.680000000000007},76.680000000000007,30014.09]
["2.3.3","CPU_16","Pavimentação em concreto usinado, bomb., lançado e adensado, não armado, pigment. BAYFERROX preto ou similar, fck=21Mpa, e = 10cm,regulariz. compac. subleito, lona plástica, incl. juntas serradas 5x10 a 40mm - Rev 03","m²",36.479999999999997,{"$f":"IF(B33=\"\",\"\",VLOOKUP(B33,'RELAÇÃO DE COMPOSIÇÕES'!$A$10:$F$374,6,FALSE))","v":100.19},100.19,3654.93]
["2.3.4","CPU_17","Piso tátil direcional e de alerta, em concreto colorido, p/deficientes visuais, dimensões 30x30cm, aplicado com argamassa industrializada ac-ii, rejuntado, exclusive regularização de base","m2",58.08,{"$f":"IF(B34=\"\",\"\",VLOOKUP(B34,'RELAÇÃO DE COMPOSIÇÕES'!$A$10:$F$374,6,FALSE))","v":88.04},88.04,5113.3599999999997]
["2.3.5","CPU_18","Lastro de brita graduada apiloada e=10cm","m2",339.81,{"$f":"IF(B35=\"\",\"\",VLOOKUP(B35,'RELAÇÃO DE COMPOSIÇÕES'!$A$10:$F$374,6,FALSE))","v":21.57},{"$f":"IF(B35=\"\",\"\",ROUND(F35*(1+$H$6),2))","v":21.57},{"$f":"IF(B35=\"\",\"\",ROUND(E35*G35,2))","v":7329.7}]
["2.3.6","CPU_19","Execução de pavimento com aplicação de concreto asfáltico, camada de binder - exclusive carga e transporte. af_11/2019","m3",16.989999999999998,{"$f":"IF(B36=\"\",\"\",VLOOKUP(B36,'RELAÇÃO DE COMPOSIÇÕES'!$A$10:$F$374,6,FALSE))","v":933.04},933.04,15852.35]
["2.3.7","CPU_20","Execução de pavimento com aplicação de concreto asfáltico, camada de rolamento - exclusive carga e transporte. af_11/2019","m3",16.989999999999998,{"$f":"IF(B37=\"\",\"\",VLOOKUP(B37,'RELAÇÃO DE COMPOSIÇÕES'!$A$10:$F$374,6,FALSE))","v":984.91},984.91,16733.62]
["2.3.8","CPU_21","Transporte de material asfaltico, com caminhão com capacidade de 30000 l em rodovia pavimentada para distâncias médias de transporte superiores a 100 km. af_02/2016","txkm",19573.060000000001,{"$f":"IF(B38=\"\",\"\",VLOOKUP(B38,'RELAÇÃO DE COMPOSIÇÕES'!$A$10:$F$374,6,FALSE))","v":0.48},0.48,9395.07]
["2.3.9","CPU_22","Imprimação - execução com fornecimento de material","m2",339.81,{"$f":"IF(B39=\"\",\"\",VLOOKUP(B39,'RELAÇÃO DE COMPOSIÇÕES'!$A$10:$F$374,6,FALSE))","v":10.69},10.69,3632.57]
["2.3.10","CPU_23","Rampa padrão para acesso de deficientes a passeio público, em concreto simples Fck=25MPa, desempolada, com pintura indicativa em novacor, 02 demãos","un",1,{"$f":"IF(B40=\"\",\"\",VLOOKUP(B40,'RELAÇÃO DE COMPOSIÇÕES'!$A$10:$F$374,6,FALSE))","v":283.04000000000002},283.04000000000002,283.04000000000002]
["2.3.11","CPU_24","Assentamento de guia (meio-fio) em trecho reto, confeccionada em concreto pré-fabricado, dimensões 100x15x13x30 cm (comprimento x base inferior x base superior x altura), para vias urbanas (uso viário). af_06/2016","m",184.32,{"$f":"IF(B41=\"\",\"\",VLOOKUP(B41,'RELAÇÃO DE COMPOSIÇÕES'!$A$10:$F$374,6,FALSE))","v":29.44},29.44,5426.38]
["2.4",null,"COBERTURA"]
["2.4.1","CPU_25","Escavação manual de vala ou cava em material de 1ª categoria, profundidade até 1,50m","m3",10.98,{"$f":"IF(B43=\"\",\"\",VLOOKUP(B43,'RELAÇÃO DE COMPOSIÇÕES'!$A$10:$F$374,6,FALSE))","v":42.12},42.12,462.48]
["2.4.2","CPU_26","Concreto Armado fck=21,0MPa, usinado, bombeado, adensado e lançado, para Uso Geral, com formas planas em compensado resinado 12mm (05 usos)","m3",6.91,{"$f":"IF(B44=\"\",\"\",VLOOKUP(B44,'RELAÇÃO DE COMPOSIÇÕES'!$A$10:$F$374,6,FALSE))","v":1647.33},1647.33,11383.05]
["2.4.3","CPU_27","Estrutura Metálica p/ Cobertura c/Vigas-Treliça Pratt UDC75 e terças em UDC 127, 2 águas, sem lanternin, vãos 6,0 a 10,0m, pintado 1 d oxido ferro + 2 d esmalte epóxi branco, exceto forn. Telhas - Executada","m2",897.6,{"$f":"IF(B45=\"\",\"\",VLOOKUP(B45,'RELAÇÃO DE COMPOSIÇÕES'!$A$10:$F$374,6,FALSE))","v":124.07},124.07,111365.23]
["2.4.4","CPU_28","Telhamento com telha metálica em chapa de aço galvanizado natural ondulada e=0,5mm","m²",897.6,{"$f":"IF(B46=\"\",\"\",VLOOKUP(B46,'RELAÇÃO DE COMPOSIÇÕES'!$A$10:$F$374,6,FALSE))","v":55.77},55.77,50059.15]
["2.4.5","CPU_29","Fornecimento e instalação de brise metálico de alumínio ref. 84F, 45º L, da Fibrocell ou similar","m2",149.80000000000001,{"$f":"IF(B47=\"\",\"\",VLOOKUP(B47,'RELAÇÃO DE COMPOSIÇÕES'!$A$10:$F$374,6,FALSE))","v":210.14},210.14,31478.97]
["2.5",null,"ESCADA E RAMPA"]
["2.5.1","CPU_30","Escavação manual de vala ou cava em material de 1ª categoria, profundidade até 1,50m","m3",25.71,{"$f":"IF(B49=\"\",\"\",VLOOKUP(B49,'RELAÇÃO DE COMPOSIÇÕES'!$A$10:$F$374,6,FALSE))","v":42.12},42.12,1082.9100000000001]
["2.5.2","CPU_31","Alvenaria pedra calcárea argamassada c/ cimento e areia traço t-4 (1:5) - 1 saco cimento 50kg / 5 padiolas areia dim. 0,35z0,45x0,23m - Confecção mecânica e transporte","m3",14.28,{"$f":"IF(B50=\"\",\"\",VLOOKUP(B50,'RELAÇÃO DE COMPOSIÇÕES'!$A$10:$F$374,6,FALSE))","v":381.53},381.53,5448.25]
["2.5.3","CPU_32","Alvenaria bloco cerâmico vedação, 9x19x24cm, e=19cm, com argamassa t5 - 1:2:8 (cimento/cal/areia), junta=1cm - Rev.08","m2",139.34,{"$f":"IF(B51=\"\",\"\",VLOOKUP(B51,'RELAÇÃO DE COMPOSIÇÕES'!$A$10:$F$374,6,FALSE))","v":72.44},72.44,10093.790000000001]
["2.5.4","CPU_33","Chapisco em parede com argamassa traço t1 - 1:3 (cimento / areia) - Revisado 08/2015","m2",69.67,{"$f":"IF(B52=\"\",\"\",VLOOKUP(B52,'RELAÇÃO DE COMPOSIÇÕES'!$A$10:$F$374,6,FALSE))","v":5.14},5.14,358.1]
["2.5.5","CPU_34","Reboco ou emboço externo, de parede, com argamassa traço t5 - 1:2:8 (cimento / cal / areia), espessura 2,0 cm","m2",69.67,{"$f":"IF(B53=\"\",\"\",VLOOKUP(B53,'RELAÇÃO DE COMPOSIÇÕES'!$A$10:$F$374,6,FALSE))","v":27.21},27.21,1895.72]
["2.5.6","CPU_35","Aterro manual de áreas, sem aquisição de material, com espalhamento e compactação","m3",116.86,{"$f":"IF(B54=\"\",\"\",VLOOKUP(B54,'RELAÇÃO DE COMPOSIÇÕES'!$A$10:$F$374,6,FALSE))","v":42.12},42.12,4922.1400000000003]
["2.5.7","CPU_36","Pavimento em concreto armado fck=25mpa, desempolado, e=10cm, p/ sobrecargas de até 4t/m2 c/ tela soldada Q138","m2",119.86,{"$f":"IF(B55=\"\",\"\",VLOOKUP(B55,'RELAÇÃO DE COMPOSIÇÕES'!$A$10:$F$374,6,FALSE))","v":76.680000000000007},76.680000000000007,9190.86]
["2.6",null,"INSTALAÇÕES DE COMBATE A INCÊNDIO"]
["2.6.1","CPU_37","Extintor de incendio portatil com carga de po quimico seco (pqs) de 8 kg, classe bc","un",4,{"$f":"IF(B57=\"\",\"\",VLOOKUP(B57,'RELAÇÃO DE COMPOSIÇÕES'!$A$10:$F$374,6,FALSE))","v":192.72},192.72,770.88]
["2.6.2","CPU_38","Placa de indicativa de \"EXTINTOR\" em pvc, dim.: 20 x 20 cm","Un",4,{"$f":"IF(B58=\"\",\"\",VLOOKUP(B58,'RELAÇÃO DE COMPOSIÇÕES'!$A$10:$F$374,6,FALSE))","v":20.18},20.18,80.72]
["2.6.3","CPU_39","Luminaria de emergencia 30 leds, potencia 2 w, bateria de litio, autonomia de 6 horas","un",7,{"$f":"IF(B59=\"\",\"\",VLOOKUP(B59,'RELAÇÃO DE COMPOSIÇÕES'!$A$10:$F$374,6,FALSE))","v":22.66},22.66,158.62]
["2.7",null,"DIVERSOS"]
["2.7.1","CPU_40","Demarcação de pavimentos com pintura de 1 demão de resina acrílica, e aplicação de micro-esferas para sinalização horizontal (Estacionamentos, faixas de pedrestres, etc.)","m2",67.52,{"$f":"IF(B61=\"\",\"\",VLOOKUP(B61,'RELAÇÃO DE COMPOSIÇÕES'!$A$10:$F$374,6,FALSE))","v":12.54},12.54,846.7]
["2.7.2","CPU_41","Corrimão em tubo ferro galvanizado, alt=0,92m, com barras verticais dupla (2\") e barras horizontais nas extremidades de 2\", inclusive curva em aço (padrão) - para deficientes físicos","m",76.63,{"$f":"IF(B62=\"\",\"\",VLOOKUP(B62,'RELAÇÃO DE COMPOSIÇÕES'!$A$10:$F$374,6,FALSE))","v":178.49},178.49,13677.69]
["2.7.3","CPU_42","Banco de concreto em alvenaria de tijolos, assento em concreto armado, sem encosto, pintado com tinta acrílica, 2 demãos","m",32.76,{"$f":"IF(B63=\"\",\"\",VLOOKUP(B63,'RELAÇÃO DE COMPOSIÇÕES'!$A$10:$F$374,6,FALSE))","v":147.97},147.97,4847.5]
["2.7.4","CPU_43","Grama esmeralda em placas, fornecimento e plantio","m2",13.26,{"$f":"IF(B64=\"\",\"\",VLOOKUP(B64,'RELAÇÃO DE COMPOSIÇÕES'!$A$10:$F$374,6,FALSE))","v":14.86},14.86,197.04]
["2.7.5","CPU_44","Lixeira em fibra de vidro, com capacidade 50l, com suporte (poste), FIOBERGLASS, REF. CLPD1085 ou similar","un",4,{"$f":"IF(B65=\"\",\"\",VLOOKUP(B65,'RELAÇÃO DE COMPOSIÇÕES'!$A$10:$F$374,6,FALSE))","v":351.82},351.82,1407.28]
["2.7.6","CPU_45","Placa de inauguração de obra em alumínio 0,60 x 0,80 m","un",1,{"$f":"IF(B66=\"\",\"\",VLOOKUP(B66,'RELAÇÃO DE COMPOSIÇÕES'!$A$10:$F$374,6,FALSE))","v":1492.84},1492.84,1492.84]
["2.7.7","CPU_46","Limpeza geral","m2",585.74,{"$f":"IF(B67=\"\",\"\",VLOOKUP(B67,'RELAÇÃO DE COMPOSIÇÕES'!$A$10:$F$374,6,FALSE))","v":1.87},1.87,1095.33]
[3,null,"REFORMA DA PRAÇA TENISSON FONTES - ETAPA 1 - PRAÇA DE ALIMENTAÇÃO"]
["3.1",null,"PRAÇA DE ALIMENTAÇÃO"]
["3.1.1",null,"DEMOLIÇÕES/REMOÇÕES/RETIRADAS"]
["3.1.1.1","CPU_47","Demolição de pavimentação em paralelepípedo sem reaproveitamento","m2",594.19000000000005,{"$f":"IF(B71=\"\",\"\",VLOOKUP(B71,'RELAÇÃO DE COMPOSIÇÕES'!$A$10:$F$374,6,FALSE))","v":9.4600000000000009},9.4600000000000009,5621.04]
["3.1.1.2","CPU_48","Demolição de reboco","m2",455.46,{"$f":"IF(B72=\"\",\"\",VLOOKUP(B72,'RELAÇÃO DE COMPOSIÇÕES'!$A$10:$F$374,6,FALSE))","v":7.01},7.01,3192.77]
["3.1.1.3","CPU_49","Demolição de madeiramento em coberturas com telhas cerâmicas","m2",351.49,{"$f":"IF(B73=\"\",\"\",VLOOKUP(B73,'RELAÇÃO DE COMPOSIÇÕES'!$A$10:$F$374,6,FALSE))","v":20.64},20.64,7254.75]
["3.1.1.4","CPU_50","Remoção de telhamento com telhas cerâmicas","m2",351.49,{"$f":"IF(B74=\"\",\"\",VLOOKUP(B74,'RELAÇÃO DE COMPOSIÇÕES'!$A$10:$F$374,6,FALSE))","v":9.4600000000000009},9.4600000000000009,3325.1]
["3.1.1.5","CPU_51","Demolição manual de piso cimentado sobre lastro de concreto - Rev 01","m2",198.9,{"$f":"IF(B75=\"\",\"\",VLOOKUP(B75,'RELAÇÃO DE COMPOSIÇÕES'!$A$10:$F$374,6,FALSE))","v":20.64},20.64,4105.3]
["3.1.1.6","CPU_52","Carga manual de entulho em caminhao basculante 6 m3","m3",121.03,{"$f":"IF(B76=\"\",\"\",VLOOKUP(B76,'RELAÇÃO DE COMPOSIÇÕES'!$A$10:$F$374,6,FALSE))","v":21.29},21.29,2576.73]
["3.1.2",null,"ELEVAÇÕES"]
["3.1.2.1","CPU_53","Alvenaria bloco cerâmico vedação, 9x19x24cm, e=24cm, com argamassa t5 - 1:2:8 (cimento/cal/areia), junta=2cm","m2",39.700000000000003,{"$f":"IF(B78=\"\",\"\",VLOOKUP(B78,'RELAÇÃO DE COMPOSIÇÕES'!$A$10:$F$374,6,FALSE))","v":104.31},104.31,4141.1099999999997]
["3.1.2.2","CPU_54","Chapisco em parede com argamassa traço t1 - 1:3 (cimento / areia) - Revisado 08/2015","m2",425.24,{"$f":"IF(B79=\"\",\"\",VLOOKUP(B79,'RELAÇÃO DE COMPOSIÇÕES'!$A$10:$F$374,6,FALSE))","v":5.14},5.14,2185.73]
["3.1.2.3","CPU_55","Chapisco em parede, rústico,  com argamassa traço t1 - 1:3 (cimento / areia) - revisado 08/2015","m2",109.62,{"$f":"IF(B80=\"\",\"\",VLOOKUP(B80,'RELAÇÃO DE COMPOSIÇÕES'!$A$10:$F$374,6,FALSE))","v":15.68},15.68,1718.84]
{"$rows_left_out":297}
{"sheet":"RELAÇÃO DE COMPOSIÇÕES","index":1,"n_rows":374,"n_cols":7,"rows_kept":374,"cut":false,"hidden":false,"merged":[[7,0,7,6],[6,4,6,5],[0,0,0,6],[1,0,1,6],[2,0,2,6],[3,0,3,4],[4,0,4,4],[5,0,5,6]]}
[]
[]
[]
["COMPLEXO (REFORMA DA PRAÇA TENISSON FONTES - PRAÇA DE ALIMENTAÇÃO  E CONSTRUÇÃO DE TERMINAL RODOVIÁRIO) - ETAPA 1",{"$nulls":4},"DATA BASE: ","JUNHO"]
["município de Itabaianinha, no estado de Sergipe",{"$nulls":4},"BDI:",0.21390000000000001]
[]
[null,null,"RELAÇÃO DE COMPOSIÇÕES",null,"DESCONTO (LICITAÇÃO):",null,0.123]
[]
["CÓDIGO ORÇAMENTO","CÓDIGO REFERÊNCIA","DESCRIÇÃO","UNID.","CUST UNIT. CODEVASF","CUST UNIT. C/ DESCONTO","PERCENT. DESC. FINAL"]
[null,null,"ADMINISTRAÇÃO LOCAL E SERVIÇOS PRELIMINARES"]
[null," ","ADMINISTRAÇÃO LOCAL"]
[null," ","Equipe Dirigente"]
["CPU_1","90777 / SINAPI","Engenheiro civil de obra junior com encargos complementares","h",107.04,{"$f":"TRUNC(E13*(1-$G$7),2)","v":93.87},{"$f":"ROUND(F13/E13,4)","v":0.877}]
["CPU_2","90780 / SINAPI","Mestre de obras com encargos complementares","h",49.25,43.19,0.877]
["CPU_3","codevasf  01","Manutenção do Canteiro","un",3532.74,3098.21,0.877]
[null," ","SERVIÇOS PRELIMINARES"]
["CPU_4","51 / ORSE","Placa de obra em chapa aço galvanizado, instalada","m2",389.26,341.38,0.877]
["CPU_5","9416 / ORSE","Instalação provisória de energia elétrica, aerea, trifasica, em poste galvanizado, exclusive fornecimento do medidor","un",2227.4699999999998,1953.49,0.877]
["CPU_6","6096 / ORSE","Ligação Predial de Água em Mureta de Concreto, Provisória ou Definitiva, com Fornecimento de Material, inclusive Mureta e Hidrômetro, Rede DN 50mm","UN",524.14,459.67,0.877]
["CPU_7","98459 / SINAPI","Tapume com telha metálica. af_05/2018 (para o terminal rodoviário)","m2",84.34,73.959999999999994,0.87690000000000001]
["CPU_8","4654 / ORSE","Locação de container - Almoxarifado com banheiro - 6,00 x 2,30m","mês",501.12,439.48,0.877]
["CPU_9","4657 / ORSE","Locação de container - Escritório com banheiro - 6,20 x 2,20m","mês",641.42999999999995,562.53,0.877]
[null,null,"TERMINAL RODOVIÁRIO",null,null,0]
[null," ","DEMOLIÇÃO",null,null,0]
["CPU_10","07989 / ORSE","Demolição de pavimentação em paralelepípedo sem reaproveitamento","m2",10.79,9.4600000000000009,0.87670000000000003]
["CPU_11","72897 / SINAPI","Carga manual de entulho em caminhao basculante 6 m3","m3",24.28,21.29,0.87690000000000001]
[null," ","MOVIMENTAÇÃO DE TERRA",null,null,0]
["CPU_13","741541 / SINAPI","Escavacao, carga e transporte de  material de 1a categoria com trator sobre esteiras 347 hp e cacamba 6m3,  dmt 50 a 200m","m3",4.45,3.9,0.87639999999999996]
[null," ","PAVIMENTAÇÃO",null,null,0]
["CPU_14","11472 / ORSE","Regularização manual e compactão com placa vibratótia","m2",6.33,5.55,{"$f":"ROUND(F30/E30,4)","v":0.87680000000000002}]
["CPU_15","11466 / ORSE","Pavimento em concreto armado fck=25mpa, desempolado, e=10cm, p/ sobrecargas de até 4t/m2 c/ tela soldada Q138","m2",87.44,76.680000000000007,{"$f":"ROUND(F31/E31,4)","v":0.87690000000000001}]
["CPU_16","8906 / ORSE","Pavimentação em concreto usinado, bomb., lançado e adensado, não armado, pigment. BAYFERROX preto ou similar, fck=21Mpa, e = 10cm,regulariz. compac. subleito, lona plástica, incl. juntas serradas 5x10 a 40mm - Rev 03","m²",114.25,100.19,0.87690000000000001]
["CPU_17","4864 / ORSE","Piso tátil direcional e de alerta, em concreto colorido, p/deficientes visuais, dimensões 30x30cm, aplicado com argamassa industrializada ac-ii, rejuntado, exclusive regularização de base","m2",100.39,88.04,0.877]
["CPU_18","9962 / ORSE","Lastro de brita graduada apiloada e=10cm","m2",24.6,21.57,0.87680000000000002]
["CPU_19","95996 / SINAPI","Execução de pavimento com aplicação de concreto asfáltico, camada de binder - exclusive carga e transporte. af_11/2019","m3",1063.9000000000001,933.04,0.877]
["CPU_20","95995 / SINAPI","Execução de pavimento com aplicação de concreto asfáltico, camada de rolamento - exclusive carga e transporte. af_11/2019","m3",1123.05,984.91,0.877]
["CPU_21","93176 / SINAPI","Transporte de material asfaltico, com caminhão com capacidade de 30000 l em rodovia pavimentada para distâncias médias de transporte superiores a 100 km. af_02/2016","txkm",0.55000000000000004,0.48,0.87270000000000003]
["CPU_22","2592 / ORSE","Imprimação - execução com fornecimento de material","m2",12.2,10.69,0.87619999999999998]
["CPU_23","12214 / ORSE","Rampa padrão para acesso de deficientes a passeio público, em concreto simples Fck=25MPa, desempolada, com pintura indicativa em novacor, 02 demãos","un",322.74,283.04000000000002,0.877]
["CPU_24","94273 / SINAPI","Assentamento de guia (meio-fio) em trecho reto, confeccionada em concreto pré-fabricado, dimensões 100x15x13x30 cm (comprimento x base inferior x base superior x altura), para vias urbanas (uso viário). af_06/2016","m",33.58,29.44,0.87670000000000003]
[null," ","COBERTURA",null,null,0]
["CPU_25","2497 / ORSE","Escavação manual de vala ou cava em material de 1ª categoria, profundidade até 1,50m","m3",48.03,42.12,0.877]
["CPU_26","6456 / ORSE","Concreto Armado fck=21,0MPa, usinado, bombeado, adensado e lançado, para Uso Geral, com formas planas em compensado resinado 12mm (05 usos)","m3",1878.38,1647.33,0.877]
["CPU_27","12508 / ORSE","Estrutura Metálica p/ Cobertura c/Vigas-Treliça Pratt UDC75 e terças em UDC 127, 2 águas, sem lanternin, vãos 6,0 a 10,0m, pintado 1 d oxido ferro + 2 d esmalte epóxi branco, exceto forn. Telhas - Executada","m2",141.47999999999999,124.07,0.87690000000000001]
["CPU_28","9961 / ORSE","Telhamento com telha metálica em chapa de aço galvanizado natural ondulada e=0,5mm","m²",63.6,55.77,0.87690000000000001]
["CPU_29","9054 / ORSE","Fornecimento e instalação de brise metálico de alumínio ref. 84F, 45º L, da Fibrocell ou similar","m2",239.62,210.14,0.877]
[null," ","ESCADA E RAMPA",null,null,0]
["CPU_30","2497 / ORSE","Escavação manual de vala ou cava em material de 1ª categoria, profundidade até 1,50m","m3",48.03,42.12,0.877]
["CPU_31","91 / ORSE","Alvenaria pedra calcárea argamassada c/ cimento e areia traço t-4 (1:5) - 1 saco cimento 50kg / 5 padiolas areia dim. 0,35z0,45x0,23m - Confecção mecânica e transporte","m3",435.04,381.53,0.877]
["CPU_32","153 / ORSE","Alvenaria bloco cerâmico vedação, 9x19x24cm, e=19cm, com argamassa t5 - 1:2:8 (cimento/cal/areia), junta=1cm - Rev.08","m2",82.61,72.44,0.87690000000000001]
["CPU_33","3310 / ORSE","Chapisco em parede com argamassa traço t1 - 1:3 (cimento / areia) - Revisado 08/2015","m2",5.87,5.14,{"$f":"ROUND(F51/E51,4)","v":0.87560000000000004}]
["CPU_34","1908 / ORSE","Reboco ou emboço externo, de parede, com argamassa traço t5 - 1:2:8 (cimento / cal / areia), espessura 2,0 cm","m2",31.03,27.21,{"$f":"ROUND(F52/E52,4)","v":0.87690000000000001}]
["CPU_35","71 / ORSE","Aterro manual de áreas, sem aquisição de material, com espalhamento e compactação","m3",48.03,42.12,0.877]
["CPU_36","11466 / ORSE","Pavimento em concreto armado fck=25mpa, desempolado, e=10cm, p/ sobrecargas de até 4t/m2 c/ tela soldada Q138","m2",87.44,76.680000000000007,0.87690000000000001]
[null," ","INSTALAÇÕES DE COMBATE A INCÊNDIO",null,null,0,{"$error":"#DIV/0!"}]
["CPU_37","20977/ORSE","Extintor de incendio portatil com carga de po quimico seco (pqs) de 8 kg, classe bc","un",219.76,192.72,0.877]
["CPU_38","12138 / ORSE","Placa de indicativa de \"EXTINTOR\" em pvc, dim.: 20 x 20 cm","Un",23.02,20.18,0.87660000000000005]
["CPU_39","38774/ORSE","Luminaria de emergencia 30 leds, potencia 2 w, bateria de litio, autonomia de 6 horas","un",25.84,22.66,0.87690000000000001]
[null," ","DIVERSOS",null,null,0]
["CPU_40","3724 / ORSE","Demarcação de pavimentos com pintura de 1 demão de resina acrílica, e aplicação de micro-esferas para sinalização horizontal (Estacionamentos, faixas de pedrestres, etc.)","m2",14.3,12.54,0.87690000000000001]
["CPU_41","10839 / ORSE","Corrimão em tubo ferro galvanizado, alt=0,92m, com barras verticais dupla (2\") e barras horizontais nas extremidades de 2\", inclusive curva em aço (padrão) - para deficientes físicos","m",203.53,178.49,0.877]
["CPU_42","3226 / ORSE","Banco de concreto em alvenaria de tijolos, assento em concreto armado, sem encosto, pintado com tinta acrílica, 2 demãos","m",168.73,147.97,0.877]
["CPU_43","10234 / ORSE","Grama esmeralda em placas, fornecimento e plantio","m2",16.95,14.86,0.87670000000000003]
["CPU_44","10536 / ORSE","Lixeira em fibra de vidro, com capacidade 50l, com suporte (poste), FIOBERGLASS, REF. CLPD1085 ou similar","un",401.17,351.82,0.877]
["CPU_45","3167 / ORSE","Placa de inauguração de obra em alumínio 0,60 x 0,80 m","un",1702.22,1492.84,0.877]
["CPU_46","2450 / ORSE","Limpeza geral","m2",2.14,1.87,0.87380000000000002]
[null,null,"REFORMA DA PRAÇA TENISSON FONTES - ETAPA 1 - PRAÇA DE ALIMENTAÇÃO"]
[null," ","PRAÇA DE ALIMENTAÇÃO"]
[null," ","DEMOLIÇÕES/REMOÇÕES/RETIRADAS"]
["CPU_47","07989 / ORSE","Demolição de pavimentação em paralelepípedo sem reaproveitamento","m2",10.79,9.4600000000000009,0.87670000000000003]
["CPU_48","17 / ORSE","Demolição de reboco","m2",8,7.01,0.87629999999999997]
["CPU_49","30 / ORSE","Demolição de madeiramento em coberturas com telhas cerâmicas","m2",23.54,20.64,{"$f":"ROUND(F72/E72,4)","v":0.87680000000000002}]
["CPU_50","9 / ORSE","Remoção de telhamento com telhas cerâmicas","m2",10.79,9.4600000000000009,{"$f":"ROUND(F73/E73,4)","v":0.87670000000000003}]
["CPU_51","16 / ORSE","Demolição manual de piso cimentado sobre lastro de concreto - Rev 01","m2",23.54,20.64,0.87680000000000002]
["CPU_52","72897 / SINAPI","Carga manual de entulho em caminhao basculante 6 m3","m3",24.28,21.29,0.87690000000000001]
[null," ","ELEVAÇÕES",null,null,0]
["CPU_53","165 / ORSE","Alvenaria bloco cerâmico vedação, 9x19x24cm, e=24cm, com argamassa t5 - 1:2:8 (cimento/cal/areia), junta=2cm","m2",118.95,{"$f":"TRUNC(E77*(1-$G$7),2)","v":104.31},0.87690000000000001]
["CPU_54","3310 / ORSE","Chapisco em parede com argamassa traço t1 - 1:3 (cimento / areia) - Revisado 08/2015","m2",5.87,5.14,0.87560000000000004]
["CPU_55","1907 / ORSE","Chapisco em parede, rústico,  com argamassa traço t1 - 1:3 (cimento / areia) - revisado 08/2015","m2",17.88,15.68,0.877]
["CPU_56","169 / ORSE","Cobogó de cimento, tipo \"escama\", dim: 50 x 50cm","m2",115,100.85,0.877]
{"$rows_left_out":294}