{"text_format":"2","workbook":"xlsx","n_sheets":3,"sheets":["MATRIZ TRANSPORTE FÁBRICA PÁTIO","TRANSPORTE PÁTIO CASA","MC TRANSPORTE"],"not_rendered":{"charts":0,"images":1,"macros":0,"external_links":1,"defined_names":4559,"comments":0,"pivot_tables":0},"unopened":[],"bounds":{"document_bytes":16777216,"sheet_cells":100000,"run_cost":"one","rows_first":2000,"rows_last":500,"rows_between":2000,"halvings":0,"cell_chars":16384,"cell_head_chars":4096},"cells_cut":0,"cells_raw":0,"read":"whole","date_system":"1900"}

{"sheet":"MATRIZ TRANSPORTE FÁBRICA PÁTIO","index":0,"n_rows":59,"n_cols":28,"rows_kept":59,"cut":false,"hidden":false,"merged":[]}
[]
["SISTEMA DE MENOR DISTÂNCIA ENTRE OS MUNICÍPIOS DO ESTADO DA BAHIA-2ªSR","QUANTIDADE CISTERNAS","DISTÂNCIA MÉDIA","Município - Centro de Distribuição","Município - A","Município - B","Município - C","Município - D","Município - E","Município - F","Município - G","Município - H","Município - I","Município - J","Município - K","Município - L","Município - M","Município - N","Município - O","Município - P","Município - Q","Município - R","Município - S","Município - T","Município - U","Município - V","Município - X","MUN_RESERVA"]
["Município - Centro de Distribuição",45,{"$f":"AVERAGE(D3:AB3)","v":137.99166666666667},0,164,136,227,142,118,156,143,249,231,139,97.4,140,243,154,156,73.2,66.099999999999994,92.8,95.5,88.9,59.9,104,236]
["Município - A",22,224.23333333333335,164,0,296,230,97.4,278,316,303,378,302,237,67.400000000000006,300,79.3,239,159,231,98.5,253,256,249,220,264,364]
["Município - B",66,168.08333333333331,136,296,0,241,274,96.9,193,177,69.3,268,112,229,177,278,262,196,178,198,122,75.599999999999994,127,168,36.200000000000003,124]
["Município - C",33,285.09583333333336,227,230,241,0,327,326,422,406,270,497,129,297,406,159,469,77.3,154,328,351,305,356,344,265,256]
["Município - D",47,221.04583333333335,142,97.4,274,327,0,256,295,282,388,211,334,45.8,279,176,148,256,210,76.900000000000006,231,234,227,198,243,374]
["Município - E",44,188.32500000000005,118,278,96.9,326,256,0,117,101,158,191,197,211,100,363,231,282,191,180,45.8,23.8,50.3,136,657,210]
["Município - F",49,197.93333333333331,156,316,193,422,295,117,0,76.7,254,75.3,294,250,32,396,141,378,230,219,71.2,123,68.2,175,162,306]
["Município - G",38,191.91249999999999,143,303,177,406,282,101,76.7,0,159,151,277,237,53.7,383,256,362,217,206,55.1,107,55.4,162,146,290]
["Município - H",37,225.67916666666667,249,378,69.3,270,388,158,254,159,0,328,141,343,238,307,376,225,207,312,183,136,188,281,162,64]
["Município - I",12,239.66666666666666,231,302,268,497,211,191,75.3,151,328,0,368,251,106,381,65.7,461,304,293,146,198,143,165,236,380]
["Município - J",20,194.39166666666665,139,237,112,129,334,197,294,277,141,368,0,231,277,166,309,84.2,66.2,199,223,176,227,215,137,127]
["Município - K",21,187.02916666666667,97.4,67.400000000000006,229,297,45.8,211,250,237,343,251,231,0,234,147,188,226,165,32.1,186,189,182,153,198,329]
["Município - L",10,186.03749999999999,140,300,177,406,279,100,32,53.7,238,106,277,234,0,380,154,362,214,203,55.1,107,52.1,159,146,290]
["Município - M",242,253.65,243,79.3,278,159,176,363,396,383,307,381,166,147,380,0,318,88.3,148,178,332,342,328,299,303,293]
["Município - N",23,227.19583333333333,154,239,262,469,148,231,141,256,376,65.7,309,188,154,318,0,398,228,189,206,215,202,111,231,362]
["Município - O",58,232.38750000000002,156,159,196,77.3,256,282,378,362,225,461,84.2,226,362,88.3,398,0,83.5,257,307,260,311,216,221,211]
["Município - P",171,169.16249999999999,73.2,231,178,154,210,191,230,217,207,304,66.2,165,214,148,228,83.5,0,134,166,169,162,133,203,193]
["Município - Q",143,175.81666666666669,66.099999999999994,98.5,198,328,76.900000000000006,180,219,206,312,293,199,32.1,203,178,189,257,134,0,155,158,151,122,166,298]
["Município - R",40,153.16666666666666,92.8,253,122,351,231,45.8,71.2,55.1,183,146,223,186,55.1,332,206,307,166,155,0,53,4.5,111,91.5,235]
["Município - S",84,151.20000000000002,95.5,256,75.599999999999994,305,234,23.8,123,107,136,198,176,189,107,342,215,260,169,158,53,0,56.9,121,41,187]
["Município - T",9,152.95000000000002,88.9,249,127,356,227,50.3,68.2,55.4,188,143,227,182,52.1,328,202,311,162,151,4.5,56.9,0,107,95.5,239]
["Município - U",81,169.16249999999999,59.9,220,168,344,198,136,175,162,281,165,215,153,159,299,111,216,133,122,111,121,107,0,136,268]
["Município - V",236,183.04999999999998,104,264,36.200000000000003,265,243,657,162,146,162,236,137,198,146,303,231,221,203,166,91.5,41,95.5,136,0,149]
["Município - X",59,241.04166666666666,236,364,124,256,374,210,306,290,64,380,127,329,290,293,362,211,193,298,235,187,239,268,149,0]
["MUN_RESERVA"]
[]
["TOTAL DE CISTERNAS",{"$f":"SUM(B3:B28)","v":1590}]
[]
[1,{"$f":"A31+1","v":2},{"$f":"B31+1","v":3},4,5,6,7,8,9,10,11,12,13,14,15,16,17,18,19,20,21,22,23,24,25,26,27,28]
["DISTÂNCIA ACUMULADA TRANSPORTE RODOVIÁRIO (CAPACIDADE DE CARGA\n05 CISTERNAS / CAMINHÃO)","QUANTIDADE CISTERNAS","FATOR TRANSPORTE RODOVIÁRIO",{"$f":"D2","v":"Município - Centro de Distribuição"},"Município - A","Município - B","Município - C","Município - D","Município - E","Município - F","Município - G","Município - H","Município - I","Município - J","Município - K","Município - L","Município - M","Município - N","Município - O","Município - P","Município - Q","Município - R","Município - S","Município - T","Município - U","Município - V","Município - X","MUN_RESERVA"]
[{"$f":"A3","v":"Município - Centro de Distribuição"},45,{"$f":"HLOOKUP($A33,$D$32:$AB$59,28,FALSE)","v":43920.900000000009},{"$f":"ROUNDUP($B33/5,0)*D3","v":0},1476,1224,2043,1278,1062,1404,1287,2241,2079,1251,876.6,1260,2187,1386,1404,658.80000000000007,594.9,835.19999999999993,859.5,800.1,539.1,936,2124,0]
["Município - A",22,{"$f":"HLOOKUP($A34,$D$32:$AB$59,28,FALSE)","v":67689.2},{"$f":"ROUNDUP($B34/5,0)*D4","v":820},0,1480,1150,487,1390,1580,1515,1890,1510,1185,337,1500,396.5,1195,795,1155,492.5,1265,1280,1245,1100,1320,1820,0]
["Município - B",66,52507.299999999996,{"$f":"ROUNDUP($B35/5,0)*D5","v":1904},4144,0,3374,3836,1356.6000000000001,2702,2478,970.19999999999993,3752,1568,3206,2478,3892,3668,2744,2492,2772,1708,1058.3999999999999,1778,2352,506.80000000000007,1736,0]
["Município - C",33,83013.600000000006,{"$f":"ROUNDUP($B36/5,0)*D6","v":1589},1610,1687,0,2289,2282,2954,2842,1890,3479,903,2079,2842,1113,3283,541.1,1078,2296,2457,2135,2492,2408,1855,1792,0]
["Município - D",47,69074.100000000006,{"$f":"ROUNDUP($B37/5,0)*D7","v":1420},974,2740,3270,0,2560,2950,2820,3880,2110,3340,458,2790,1760,1480,2560,2100,769,2310,2340,2270,1980,2430,3740,0]
["Município - E",44,85979.199999999997,{"$f":"ROUNDUP($B38/5,0)*D8","v":1062},2502,872.1,2934,2304,0,1053,909,1422,1719,1773,1899,900,3267,2079,2538,1719,1620,412.2,214.20000000000002,452.7,1224,5913,1890,0]
["Município - F",49,74270.5,{"$f":"ROUNDUP($B39/5,0)*D9","v":1560},3160,1930,4220,2950,1170,0,767,2540,753,2940,2500,320,3960,1410,3780,2300,2190,712,1230,682,1750,1620,3060,0]
["Município - G",38,70316,{"$f":"ROUNDUP($B40/5,0)*D10","v":1144},2424,1416,3248,2256,808,613.6,0,1272,1208,2216,1896,429.6,3064,2048,2896,1736,1648,440.8,856,443.2,1296,1168,2320,0]
["Município - H",37,73233.2,{"$f":"ROUNDUP($B41/5,0)*D11","v":1992},3024,554.4,2160,3104,1264,2032,1272,0,2624,1128,2744,1904,2456,3008,1800,1656,2496,1464,1088,1504,2248,1296,512,0]
["Município - I",12,89352.5,{"$f":"ROUNDUP($B42/5,0)*D12","v":693},906,804,1491,633,573,225.89999999999998,453,984,0,1104,753,318,1143,197.10000000000002,1383,912,879,438,594,429,495,708,1140,0]
["Município - J",20,54879.4,{"$f":"ROUNDUP($B43/5,0)*D13","v":556},948,448,516,1336,788,1176,1108,564,1472,0,924,1108,664,1236,336.8,264.8,796,892,704,908,860,548,508,0]
["Município - K",21,56819.5,{"$f":"ROUNDUP($B44/5,0)*D14","v":487},337,1145,1485,229,1055,1250,1185,1715,1255,1155,0,1170,735,940,1130,825,160.5,930,945,910,765,990,1645,0]
["Município - L",10,69685.600000000006,{"$f":"ROUNDUP($B45/5,0)*D15","v":280},600,354,812,558,200,64,107.4,476,212,554,468,0,760,308,724,428,406,110.2,214,104.2,318,292,580,0]
["Município - M",242,70658.100000000006,{"$f":"ROUNDUP($B46/5,0)*D16","v":11907},3885.7,13622,7791,8624,17787,19404,18767,15043,18669,8134,7203,18620,0,15582,4326.7,7252,8722,16268,16758,16072,14651,14847,14357,0]
["Município - N",23,79083.100000000006,{"$f":"ROUNDUP($B47/5,0)*D17","v":770},1195,1310,2345,740,1155,705,1280,1880,328.5,1545,940,770,1590,0,1990,1140,945,1030,1075,1010,555,1155,1810,0]
["Município - O",58,63634.1,{"$f":"ROUNDUP($B48/5,0)*D18","v":1872},1908,2352,927.59999999999991,3072,3384,4536,4344,2700,5532,1010.4000000000001,2712,4344,1059.5999999999999,4776,0,1002,3084,3684,3120,3732,2592,2652,2532,0]
["Município - P",171,49450.6,{"$f":"ROUNDUP($B49/5,0)*D19","v":2562},8085,6230,5390,7350,6685,8050,7595,7245,10640,2317,5775,7490,5180,7980,2922.5,0,4690,5810,5915,5670,4655,7105,6755,0]
["Município - Q",143,52406.9,{"$f":"ROUNDUP($B50/5,0)*D20","v":1916.8999999999999},2856.5,5742,9512,2230.1000000000004,5220,6351,5974,9048,8497,5771,930.90000000000009,5887,5162,5481,7453,3886,0,4495,4582,4379,3538,4814,8642,0]
["Município - R",40,55270.400000000001,{"$f":"ROUNDUP($B51/5,0)*D21","v":742.4},2024,976,2808,1848,366.4,569.6,440.8,1464,1168,1784,1488,440.8,2656,1648,2456,1328,1240,0,424,36,888,732,1880,0]
["Município - S",84,51774.9,{"$f":"ROUNDUP($B52/5,0)*D22","v":1623.5},4352,1285.1999999999998,5185,3978,404.6,2091,1819,2312,3366,2992,3213,1819,5814,3655,4420,2873,2686,901,0,967.3,2057,697,3179,0]
["Município - T",9,55155.500000000007,{"$f":"ROUNDUP($B53/5,0)*D23","v":177.8},498,254,712,454,100.6,136.4,110.8,376,286,454,364,104.2,656,404,622,324,302,9,113.8,0,214,191,478,0]
["Município - U",81,56229.1,{"$f":"ROUNDUP($B54/5,0)*D24","v":1018.3},3740,2856,5848,3366,2312,2975,2754,4777,2805,3655,2601,2703,5083,1887,3672,2261,2074,1887,2057,1819,0,2312,4556,0]
["Município - V",236,55875.8,{"$f":"ROUNDUP($B55/5,0)*D25","v":4992},12672,1737.6000000000001,12720,11664,31536,7776,7008,7776,11328,6576,9504,7008,14544,11088,10608,9744,7968,4392,1968,4584,6528,0,7152,0]
["Município - X",59,74208,{"$f":"ROUNDUP($B56/5,0)*D26","v":2832},4368,1488,3072,4488,2520,3672,3480,768,4560,1524,3948,3480,3516,4344,2532,2316,3576,2820,2244,2868,3216,1788,0,0]
["MUN_RESERVA",0,0,{"$f":"ROUNDUP($B57/5,0)*D27","v":0},0,0,0,0,0,0,0,0,0,0,0,0,0,0,0,0,0,0,0,0,0,0,0,0]
[]
["TOTAIS",{"$f":"SUM(B33:B58)","v":1590},null,{"$f":"SUM(D33:D58)","v":43920.900000000009},67689.2,52507.299999999996,83013.600000000006,69074.100000000006,85979.199999999997,74270.5,70316,73233.2,89352.5,54879.4,56819.5,69685.600000000006,70658.100000000006,79083.100000000006,63634.1,49450.6,52406.9,55270.400000000001,51774.9,55155.500000000007,56229.1,55875.8,74208,0]

{"sheet":"TRANSPORTE PÁTIO CASA","index":1,"n_rows":30,"n_cols":6,"rows_kept":30,"cut":false,"hidden":false,"merged":[]}
[]
[]
["DISTÂNCIA ESTIMADA DO TRANSPORTE DO PÁTIO DE TRANSBORDO ATÉ O LOCAL DE INSTALAÇÃO DA CISTERNA\n(CAPACIDADE DE CARGA\n02 CISTERNAS / CAMINHÃO)","QUANTIDADE CISTERNAS","ÁREA TERRITORIAL (KM2)\nFONTE IBGE/2019","DISTÂNCIA MÉDIA DA SEDE\nDO MUNICÍPIO AO LOCAL DE INSTALAÇÃO (KM) - 70% D EQUIV","DISTÂNCIA DO  TRANSPORTE\nEM RODOVIA PAVIMENTADA (KM)\nARBITRADO 25%","DISTÂNCIA DO  TRANSPORTE\nEM LEITO NATURAL (KM)\nARBITRADO 75%"]
[{"$f":"'MATRIZ TRANSPORTE FÁBRICA PÁTIO'!A3","v":"Município - Centro de Distribuição"},{"$f":"'MATRIZ TRANSPORTE FÁBRICA PÁTIO'!B3","v":45},4115.51,{"$f":"ROUND(0.7*SQRT((C4*4)/PI()),2)","v":50.67},{"$f":"ROUND(ROUNDUP(B4/2,0)*D4*0.25,2)","v":291.35000000000002},{"$f":"ROUND(ROUNDUP(B4/2,0)*D4*0.75,2)","v":874.06}]
[{"$f":"'MATRIZ TRANSPORTE FÁBRICA PÁTIO'!A4","v":"Município - A"},{"$f":"'MATRIZ TRANSPORTE FÁBRICA PÁTIO'!B4","v":22},627.61199999999997,{"$f":"ROUND(0.7*SQRT((C5*4)/PI()),2)","v":19.79},{"$f":"ROUND(ROUNDUP(B5/2,0)*D5*0.25,2)","v":54.42},{"$f":"ROUND(ROUNDUP(B5/2,0)*D5*0.75,2)","v":163.27000000000001}]
[{"$f":"'MATRIZ TRANSPORTE FÁBRICA PÁTIO'!A5","v":"Município - B"},{"$f":"'MATRIZ TRANSPORTE FÁBRICA PÁTIO'!B5","v":66},2247.2080000000001,37.44,308.88,926.64]
[{"$f":"'MATRIZ TRANSPORTE FÁBRICA PÁTIO'!A6","v":"Município - C"},{"$f":"'MATRIZ TRANSPORTE FÁBRICA PÁTIO'!B6","v":33},2370.4859999999999,38.46,163.46,490.37]
[{"$f":"'MATRIZ TRANSPORTE FÁBRICA PÁTIO'!A7","v":"Município - D"},{"$f":"'MATRIZ TRANSPORTE FÁBRICA PÁTIO'!B7","v":47},2651.5360000000001,40.67,244.02,732.06]
[{"$f":"'MATRIZ TRANSPORTE FÁBRICA PÁTIO'!A8","v":"Município - E"},{"$f":"'MATRIZ TRANSPORTE FÁBRICA PÁTIO'!B8","v":44},460.38799999999998,16.95,93.23,279.68]
[{"$f":"'MATRIZ TRANSPORTE FÁBRICA PÁTIO'!A9","v":"Município - F"},{"$f":"'MATRIZ TRANSPORTE FÁBRICA PÁTIO'!B9","v":49},2662.819,40.76,254.75,764.25]
[{"$f":"'MATRIZ TRANSPORTE FÁBRICA PÁTIO'!A10","v":"Município - G"},{"$f":"'MATRIZ TRANSPORTE FÁBRICA PÁTIO'!B10","v":38},11504.31,84.72,402.42,1207.26]
[{"$f":"'MATRIZ TRANSPORTE FÁBRICA PÁTIO'!A11","v":"Município - H"},{"$f":"'MATRIZ TRANSPORTE FÁBRICA PÁTIO'!B11","v":37},1052.837,25.63,121.74,365.23]
[{"$f":"'MATRIZ TRANSPORTE FÁBRICA PÁTIO'!A12","v":"Município - I"},{"$f":"'MATRIZ TRANSPORTE FÁBRICA PÁTIO'!B12","v":12},1176.1110000000001,27.09,40.64,121.91]
[{"$f":"'MATRIZ TRANSPORTE FÁBRICA PÁTIO'!A13","v":"Município - J"},{"$f":"'MATRIZ TRANSPORTE FÁBRICA PÁTIO'!B13","v":20},1740.1130000000001,32.950000000000003,82.38,247.13]
[{"$f":"'MATRIZ TRANSPORTE FÁBRICA PÁTIO'!A14","v":"Município - K"},{"$f":"'MATRIZ TRANSPORTE FÁBRICA PÁTIO'!B14","v":21},836.58600000000001,22.85,62.84,188.51]
[{"$f":"'MATRIZ TRANSPORTE FÁBRICA PÁTIO'!A15","v":"Município - L"},{"$f":"'MATRIZ TRANSPORTE FÁBRICA PÁTIO'!B15","v":10},9955.1129999999994,78.81,98.51,295.54000000000002]
[{"$f":"'MATRIZ TRANSPORTE FÁBRICA PÁTIO'!A16","v":"Município - M"},{"$f":"'MATRIZ TRANSPORTE FÁBRICA PÁTIO'!B16","v":242},2459.1019999999999,39.17,1184.8900000000001,3554.68]
[{"$f":"'MATRIZ TRANSPORTE FÁBRICA PÁTIO'!A17","v":"Município - N"},{"$f":"'MATRIZ TRANSPORTE FÁBRICA PÁTIO'!B17","v":23},1979.194,35.14,105.42,316.26]
[{"$f":"'MATRIZ TRANSPORTE FÁBRICA PÁTIO'!A18","v":"Município - O"},{"$f":"'MATRIZ TRANSPORTE FÁBRICA PÁTIO'!B18","v":58},3313.4180000000001,45.47,329.66,988.97]
[{"$f":"'MATRIZ TRANSPORTE FÁBRICA PÁTIO'!A19","v":"Município - P"},{"$f":"'MATRIZ TRANSPORTE FÁBRICA PÁTIO'!B19","v":171},2624.998,40.47,870.11,2610.3200000000002]
[{"$f":"'MATRIZ TRANSPORTE FÁBRICA PÁTIO'!A20","v":"Município - Q"},{"$f":"'MATRIZ TRANSPORTE FÁBRICA PÁTIO'!B20","v":143},3183.9110000000001,44.57,802.26,2406.7800000000002]
[{"$f":"'MATRIZ TRANSPORTE FÁBRICA PÁTIO'!A21","v":"Município - R"},{"$f":"'MATRIZ TRANSPORTE FÁBRICA PÁTIO'!B21","v":40},1984.91,35.19,175.95,527.85]
[{"$f":"'MATRIZ TRANSPORTE FÁBRICA PÁTIO'!A22","v":"Município - S"},{"$f":"'MATRIZ TRANSPORTE FÁBRICA PÁTIO'!B22","v":84},1909.3530000000001,34.51,362.36,1087.07]
[{"$f":"'MATRIZ TRANSPORTE FÁBRICA PÁTIO'!A23","v":"Município - T"},{"$f":"'MATRIZ TRANSPORTE FÁBRICA PÁTIO'!B23","v":9},1751.671,33.06,41.33,123.98]
[{"$f":"'MATRIZ TRANSPORTE FÁBRICA PÁTIO'!A24","v":"Município - U"},{"$f":"'MATRIZ TRANSPORTE FÁBRICA PÁTIO'!B24","v":81},2340.6840000000002,38.21,391.65,1174.96]
[{"$f":"'MATRIZ TRANSPORTE FÁBRICA PÁTIO'!A25","v":"Município - V"},{"$f":"'MATRIZ TRANSPORTE FÁBRICA PÁTIO'!B25","v":236},1592.2449999999999,31.52,929.84,2789.52]
[{"$f":"'MATRIZ TRANSPORTE FÁBRICA PÁTIO'!A26","v":"Município - X"},{"$f":"'MATRIZ TRANSPORTE FÁBRICA PÁTIO'!B26","v":59},2920.5790000000002,42.69,320.18,960.53]
[]
[null,{"$f":"SUM(B4:B28)","v":1590},{"$f":"SUM(C4:C28)","v":67460.694000000018},{"$f":"SUMPRODUCT(B4:B27,D4:D27)/B29","v":38.619433962264146},{"$f":"SUM(E4:E28)","v":7732.29},{"$f":"SUM(F4:F28)","v":23196.829999999994}]
[null,"TOTAL","TOTAL","MÉDIA","TOTAL","TOTAL"]

{"sheet":"MC TRANSPORTE","index":2,"n_rows":56,"n_cols":4,"rows_kept":56,"cut":false,"hidden":false,"merged":[[5,0,5,3],[0,0,0,3],[1,0,1,3],[2,0,2,3],[7,0,7,3]]}
["MINISTÉRIO DO DESENVOLVIMENTO REGIONAL"]
["COMPANHIA DE DESENVOLVIMENTO DOS VALES DO SÃO FRANCISCO E DO PARNAÍBA"]
["PROGRAMA NACIONAL DE UNIVERSALIZAÇÃO DO ACESSO E USO DA ÁGUA - “ÁGUA PARA TODOS\""]
[]
[]
["TRANSPORTE E INSTALAÇÃO DE CISTERNAS PARA CAPTAÇÃO DA ÁGUA DA CHUVA - BAHIA 2ªSR"]
[]
["MEMÓRIA DE CÁLCULO DOS TRANSPORTES"]
[]
["01","MOBILIZAÇÃO E DESMOBILIZAÇÃO"]
[]
[null,"Dist. Média (Km):",{"$f":"AVERAGE('MATRIZ TRANSPORTE FÁBRICA PÁTIO'!C3:C26)","v":198.17534722222226}]
[null,"nº De municípios:",{"$f":"ROW('MATRIZ TRANSPORTE FÁBRICA PÁTIO'!A27)-ROW('MATRIZ TRANSPORTE FÁBRICA PÁTIO'!A3)","v":24},"und"]
[null,"V = Velocidade Rodovia pavimentada (Km/h)",60,"DNIT"]
[null,"F = Fator de Eficiência",0.83,"DNIT"]
[null,"C = Capacidade de mobilização/desmobilização",1]
[null,"P = Produção = ( C x E x V ) / 2 (unxkm/h)",{"$f":"C14*C15*C16/2","v":24.9}]
[null,"I = Indice da composição = 1/P x D x N (h)",{"$f":"1/C17*C12*C13","v":191.01238286479253}]
[]
["02","TRANSPORTE FÁBRICA P/ MUNICÍPIO - VIA PAVIMENTADA"]
[]
[null,"Ponto ótimo para distribuição:","Município - Centro de Distribuição"]
[]
[null,"Dist. Média (Km):",{"$f":"VLOOKUP(C22,'MATRIZ TRANSPORTE FÁBRICA PÁTIO'!A33:C57,3,FALSE)","v":43920.900000000009}]
[null,"nº De cisternas:",{"$f":"'MATRIZ TRANSPORTE FÁBRICA PÁTIO'!B29","v":1590},"und"]
[null,"Dist. Média/Cisterna (Km):",{"$f":"ROUND(C24/C25,2)","v":27.62},"Km"]
[]
[null,"V = Velocidade Rodovia pavimentada (Km/h)",60,"DNIT"]
[null,"F = Fator de Eficiência",0.83,"DNIT"]
[null,"C = Capacidade de Cisternas Transportada pelo caminhão",5]
[null,"P = Produção = ( C x E x V ) / 2 (unxkm/h)",{"$f":"C28*C29*C30/2","v":124.5}]
[null,"I = Indice da composição = 1/P (h/unxkm)",{"$f":"1/C31","v":8.0321285140562242E-3}]
[]
["03","TRANSPORTE MUNICÍPIO P/ LOCAL - VIA PAVIMENTADA"]
[]
[null,"Dist. Média (Km):",{"$f":"'TRANSPORTE PÁTIO CASA'!E29","v":7732.29}]
[null,"nº De cisternas:",3960,"und"]
[null,"Dist. Média/Cisterna (Km):",{"$f":"ROUND(C36/C37,2)","v":1.95},"Km"]
[]
[null,"V = Velocidade Rodovia pavimentada (Km/h)",60,"DNIT"]
[null,"F = Fator de Eficiência",0.83,"DNIT"]
[null,"C = Capacidade de Cisternas Transportada pelo caminhão",2]
[null,"P = Produção = ( C x E x V ) / 2 (unxkm/h)",{"$f":"C40*C41*C42/2","v":49.8}]
[null,"I = Indice da composição = 1/P (h/unxkm)",{"$f":"1/C43","v":2.0080321285140562E-2}]
[]
["04","TRANSPORTE MUNICÍPIO P/ LOCAL - NÃO PAVIMENTADA"]
[]
[null,"Dist. Média (Km):",{"$f":"'TRANSPORTE PÁTIO CASA'!F29","v":23196.829999999994}]
[null,"nº De cisternas:",3960,"und"]
[null,"Dist. Média/Cisterna (Km):",{"$f":"ROUND(C48/C49,2)","v":5.86},"Km"]
[]
[null,"V = Velocidade Rodovia pavimentada (Km/h)",40,"DNIT"]
[null,"F = Fator de Eficiência",0.83,"DNIT"]
[null,"C = Capacidade de Cisternas Transportada pelo caminhão",2]
[null,"P = Produção = ( C x E x V ) / 2 (unxkm/h)",{"$f":"C52*C53*C54/2","v":33.199999999999996}]
[null,"I = Indice da composição = 1/P (h/unxkm)",{"$f":"1/C55","v":3.0120481927710847E-2}]