{"text_format":"2","workbook":"xlsx","n_sheets":6,"sheets":["ORÇAMENTO","MEMÓRIA","CPU","BDI SERV","BDI FORN","CRONOGRAMA"],"not_rendered":{"charts":0,"images":1,"macros":0,"external_links":0,"defined_names":6,"comments":1,"pivot_tables":0},"unopened":[],"bounds":{"document_bytes":16777216,"sheet_cells":100000,"run_cost":"one","rows_first":2000,"rows_last":500,"rows_between":2000,"halvings":0,"cell_chars":16384,"cell_head_chars":4096},"cells_cut":0,"cells_raw":0,"read":"whole","date_system":"1900"}

{"sheet":"ORÇAMENTO","index":0,"n_rows":26,"n_cols":10,"rows_kept":26,"cut":false,"hidden":false,"merged":[[6,6,6,7],[25,1,25,2],[0,0,7,0],[0,2,0,8],[1,2,1,8],[2,2,2,8],[4,2,4,8],[5,6,5,7]]}
["<---- NUMERAR SERVIÇOS PARA CPU",null,"Ministério da Integração Nacional"]
[null,null,"Companhia de Desenvolvimento dos Vales do São Francisco e do Parnaíba"]
[null,null,"1ª Superintendência Regional"]
[]
[null,"OBRA: ","RECAPEAMENTO - FELIXLÂNDIA - RUAS CORONEL EFRAIM EPIFÂNIO, RAIMUNDO FERREIRA DA SILVA,  MARCOS ANTERO"]
[null,"DATA:","JANEIRO / 2020",null,null,null,"BDI Serviços:",null,{"$f":"'BDI SERV'!D31/100","v":0.21479999999999999}]
[null,"PRAZO DE EXECUÇÃO:     120 DIAS"]
[null,"ITEM","DISCRIMINAÇÃO","REFER.","UNID.","QUANT.","P. UNITÁRIO","P.UNIT.C/ BDI","P. TOTAL",{"$f":"I26","v":475158.24000000005}]
["A",1,"SERVIÇOS PRELIMINARES E URBANIZAÇÃO",{"$nulls":5},{"$f":"SUM(I10:I14)","v":31047.309999999998},{"$f":"I9/I26","v":6.5340990403533764E-2}]
[1,{"$f":"MEMÓRIA!B11","v":"1.1"},{"$f":"MEMÓRIA!C11","v":"MOBILIZAÇÃO E DESMOBILIZAÇÃO"},"CPU",{"$f":"MEMÓRIA!D11","v":"GL"},{"$f":"MEMÓRIA!I11","v":1},{"$f":"VLOOKUP(A10,CPU!$A$1:$N$4634,9)","v":3844.98},{"$f":"VLOOKUP(A10,CPU!$A$1:$N$4634,10)","v":4670.8817039999994},{"$f":"ROUND(F10*H10,2)","v":4670.88}]
[2,{"$f":"MEMÓRIA!B14","v":"1.2"},{"$f":"MEMÓRIA!C14","v":"ADMINISTRAÇÃO LOCAL"},"CPU",{"$f":"MEMÓRIA!D14","v":"GL"},{"$f":"MEMÓRIA!I14","v":1},{"$f":"VLOOKUP(A11,CPU!$A$1:$N$4634,9)","v":17587.810000000001},{"$f":"VLOOKUP(A11,CPU!$A$1:$N$4634,10)","v":21365.671588000001},{"$f":"ROUND(F11*H11,2)","v":21365.67},{"$f":"I11/I26","v":4.496537827061569E-2}]
[3,{"$f":"MEMÓRIA!B17","v":"1.3"},{"$f":"MEMÓRIA!C17","v":"CANTEIRO DE OBRAS"},"CPU",{"$f":"MEMÓRIA!D17","v":"GL"},{"$f":"MEMÓRIA!I17","v":1},{"$f":"VLOOKUP(A12,CPU!$A$1:$N$4634,9)","v":2600},{"$f":"VLOOKUP(A12,CPU!$A$1:$N$4634,10)","v":3158.4799999999996},{"$f":"ROUND(F12*H12,2)","v":3158.48}]
[4,{"$f":"MEMÓRIA!B20","v":"1.4"},{"$f":"MEMÓRIA!C20","v":"PLACA DE OBRA EM CHAPA DE AÇO GALVANIZADO"},"74209/001",{"$f":"MEMÓRIA!D20","v":"M2"},{"$f":"MEMÓRIA!I20","v":4},{"$f":"VLOOKUP(A13,CPU!$A$1:$N$4634,9)","v":306.17689999999993},{"$f":"VLOOKUP(A13,CPU!$A$1:$N$4634,10)","v":371.94369811999991},{"$f":"ROUND(F13*H13,2)","v":1487.77}]
[5,{"$f":"MEMÓRIA!B23","v":"1.5"},{"$f":"MEMÓRIA!C23","v":"EXECUÇÃO E COMPACTAÇÃO DE BASE E OU SUB BASE PARA PAVIMENTAÇÃO DE BRITA GRADUADA SIMPLES TRATADA COM CIMENTO, PARA TRATAMENTO DOS BURACOS"},96397,{"$f":"MEMÓRIA!D23","v":"M3"},{"$f":"MEMÓRIA!I23","v":2},{"$f":"VLOOKUP(A14,CPU!$A$1:$N$4634,9)","v":150.02915000000002},{"$f":"VLOOKUP(A14,CPU!$A$1:$N$4634,10)","v":182.25541142},{"$f":"ROUND(F14*H14,2)","v":364.51}]
["B",{"$f":"MEMÓRIA!B26","v":2},{"$f":"MEMÓRIA!C26","v":"RECAPEAMENTO"},{"$nulls":5},{"$f":"SUM(I16:I17)","v":343777.74},{"$f":"I15/I26","v":0.72350158549286647}]
[6,{"$f":"MEMÓRIA!B28","v":"2.1"},{"$f":"MEMÓRIA!C28","v":"EXECUÇÃO DE PINTURA DE LIGAÇÃO COM EMULSÃO ASFÁLTICA RR-2C, INCLUSIVE LIMPEZA DO PAVIMENTO"},96402,{"$f":"MEMÓRIA!D28","v":"M2"},{"$f":"MEMÓRIA!I28","v":14233.02},{"$f":"VLOOKUP(A16,CPU!$A$1:$N$4634,9)","v":1.9028119999999999},{"$f":"VLOOKUP(A16,CPU!$A$1:$N$4634,10)","v":2.3115360175999995},{"$f":"ROUND(F16*H16,2)","v":32900.14}]
[7,{"$f":"MEMÓRIA!B31","v":"2.2"},{"$f":"MEMÓRIA!C31","v":"PRE-MISTURADO A FRIO COM EMULSAO RL-1C, INCLUSO USINAGEM E APLICACAO EXCLUSIVE TRANSPORTE"},"73759/002",{"$f":"MEMÓRIA!D31","v":"M3"},{"$f":"MEMÓRIA!I31","v":569.32080000000008},{"$f":"VLOOKUP(A17,CPU!$A$1:$N$4634,9)","v":449.49781999999999},{"$f":"VLOOKUP(A17,CPU!$A$1:$N$4634,10)","v":546.04995173599991},{"$f":"ROUND(F17*H17,2)","v":310877.59999999998}]
["C",{"$f":"MEMÓRIA!B34","v":3},{"$f":"MEMÓRIA!C34","v":"TRANSPORTE DE MATERIAIS"},{"$nulls":5},{"$f":"SUM(I19:I20)","v":40542.589999999997},{"$f":"I18/I26","v":8.5324396352676093E-2}]
[8,{"$f":"MEMÓRIA!B36","v":"3.1"},{"$f":"MEMÓRIA!C36","v":"TRANSPORTE COM CAMINHÃO BASCULANTE DE 18 M3, EM VIA URBANA PAVIMENTADA, DMT ACIMA DE 30 KM(UNIDADE: M3XKM)."},95427,{"$f":"MEMÓRIA!D36","v":"M3XKM"},{"$f":"MEMÓRIA!I36","v":48163.828874080005},{"$f":"VLOOKUP(A19,CPU!$A$1:$N$4634,9)","v":0.55520709999999995},{"$f":"VLOOKUP(A19,CPU!$A$1:$N$4634,10)","v":0.67446558507999987},{"$f":"ROUND(F19*H19,2)","v":32484.85}]
[9,"3.3",{"$f":"MEMÓRIA!C40","v":"TRANSPORTE DE MATERIAL ASFALTICO, COM CAMINHÃO COM CAPACIDADE DE 30000L EM RODOVIA PAVIMENTADA PARA DISTÂNCIAS MÉDIAS DE TRANSPORTE SUPERIORES A 100 KM."},93176,"M²",{"$f":"MEMÓRIA!I40","v":12850.709097600002},{"$f":"VLOOKUP(A20,CPU!$A$1:$N$4634,9)","v":0.51615620000000006},{"$f":"VLOOKUP(A20,CPU!$A$1:$N$4634,10)","v":0.62702655175999999},{"$f":"ROUND(F20*H20,2)","v":8057.74}]
["D",{"$f":"MEMÓRIA!B43","v":4},{"$f":"MEMÓRIA!C43","v":"SINALIZAÇÃO"},{"$nulls":5},{"$f":"SUM(I22:I22)","v":8964.27},{"$f":"I21/I26","v":1.886586245457934E-2}]
[10,{"$f":"MEMÓRIA!B45","v":"4.1"},{"$f":"MEMÓRIA!C45","v":"SINALIZACAO HORIZONTAL COM TINTA RETRORREFLETIVA A BASE DE RESINA ACRILICA COM MICROESFERAS DE VIDRO"},72947,{"$f":"MEMÓRIA!D45","v":"M2"},{"$f":"MEMÓRIA!I45","v":509.07000000000005},14.495477409999999,{"$f":"VLOOKUP(A22,CPU!$A$1:$N$4634,10)","v":17.609105957667996},{"$f":"ROUND(F22*H22,2)","v":8964.27}]
["E","5.",{"$f":"MEMÓRIA!C50","v":"OBRAS COMPLEMENTARES"},{"$nulls":5},{"$f":"SUM(I24:I25)","v":50826.33},{"$f":"I23/I26","v":0.10696716529634422}]
[11,"5.1",{"$f":"MEMÓRIA!C52","v":"GUIA (MEIO-FIO) CONCRETO, MOLDADA IN LOCO EM TRECHO RETO COM EXTRUSORA, 13 CM BASE X 22 CM ALTURA."},94263,{"$f":"MEMÓRIA!D52","v":"M"},{"$f":"MEMÓRIA!I52","v":1575.38},{"$f":"VLOOKUP(A24,CPU!$A$1:$N$4634,9)","v":21.627050000000001},{"$f":"VLOOKUP(A24,CPU!$A$1:$N$4634,10)","v":26.272540339999999},{"$f":"ROUND(F24*H24,2)","v":41389.230000000003}]
[12,"5.2",{"$f":"MEMÓRIA!C55","v":"TRANSPORTE COM CAMINHÃO BASCULANTE DE 18 M3, EM VIA URBANA PAVIMENTADA, DMT ACIMA DE 30 KM(UNIDADE: M3XKM)."},95427,"M3XKM",{"$f":"MEMÓRIA!I55","v":14363.340897233664},{"$f":"VLOOKUP(A25,CPU!$A$1:$N$4634,9)","v":0.54085179999999999},{"$f":"VLOOKUP(A25,CPU!$A$1:$N$4634,10)","v":0.65702676663999993},{"$f":"ROUND(F25*H25,2)","v":9437.1}]
[null,"TOTAL GERAL DA OBRA COM BDI ",{"$nulls":6},{"$f":"SUM(I9,I15,I18,I21,I23)","v":475158.24000000005}]

{"sheet":"MEMÓRIA","index":1,"n_rows":96,"n_cols":13,"rows_kept":96,"cut":false,"hidden":false,"merged":[[0,0,7,0],[6,6,6,7],[8,2,8,8],[25,2,25,8],[33,2,33,8],[42,2,42,8],[0,2,0,8],[1,2,1,8],[2,2,2,8],[4,2,4,8],[5,6,5,7]]}
["<---- NUMERAR SERVIÇOS PARA CPU",null,"Ministério da Integração Nacional"]
[null,null,"Companhia de Desenvolvimento dos Vales do São Francisco e do Parnaíba"]
[null,null,"1ª Superintendência Regional"]
[]
[null,"OBRA: ",{"$f":"ORÇAMENTO!C5","v":"RECAPEAMENTO - FELIXLÂNDIA - RUAS CORONEL EFRAIM EPIFÂNIO, RAIMUNDO FERREIRA DA SILVA,  MARCOS ANTERO"}]
[null,"DATA:","JANEIRO / 2020",null,null,null,"BDI Serviços:",null,{"$f":"'BDI SERV'!D31/100","v":0.21479999999999999}]
[null,"PRAZO DE EXECUÇÃO:     120 DIAS",{"$nulls":4},"BDI Materiais:",null,{"$f":"'BDI FORN'!D31/100","v":0.18059999999999998}]
[null,"ITEM","DISCRIMINAÇÃO","COMPRIM.","LARGURA","ALTURA","DISTANCIA","REPET.","TOTAL"]
["A",1,"SERVIÇOS PRELIMINARES"]
[]
[1,"1.1","MOBILIZAÇÃO E DESMOBILIZAÇÃO","GL",{"$nulls":4},{"$f":"SUM(I12:I12)","v":1}]
[null,null,"MOBILIZAÇÃO E DESMOBILIZAÇÃO DA OBRA",1,{"$nulls":4},{"$f":"D12","v":1}]
[]
[2,"1.2","ADMINISTRAÇÃO LOCAL","GL",{"$nulls":4},{"$f":"SUM(I15:I15)","v":1}]
[null,null,"ADMINISTRAÇÃO LOCAL DA OBRA",1,{"$nulls":4},{"$f":"D15","v":1}]
[]
[3,"1.3","CANTEIRO DE OBRAS","GL",{"$nulls":4},{"$f":"SUM(I18:I18)","v":1}]
[null,null,"CANTEIRO DE OBRAS",1,{"$nulls":4},{"$f":"D18","v":1}]
[]
[4,"1.4","PLACA DE OBRA EM CHAPA DE AÇO GALVANIZADO","M2",{"$nulls":4},{"$f":"SUM(I21:I21)","v":4}]
[null,null,"PLACA DE OBRA",2,1,null,null,2,{"$f":"D21*E21*H21","v":4}]
[]
[5,"1.5","EXECUÇÃO E COMPACTAÇÃO DE BASE E OU SUB BASE PARA PAVIMENTAÇÃO DE BRITA GRADUADA SIMPLES TRATADA COM CIMENTO, PARA TRATAMENTO DOS BURACOS","M3",{"$nulls":4},{"$f":"SUM(I24:I24)","v":2}]
[null,null,"ESTIMATIVA PARA TRATAR OS BURACOS",{"$f":"2","v":2},{"$nulls":4},{"$f":"D24","v":2}]
[]
["B",2,"RECAPEAMENTO"]
[]
[6,"2.1","EXECUÇÃO DE PINTURA DE LIGAÇÃO COM EMULSÃO ASFÁLTICA RR-2C, INCLUSIVE LIMPEZA DO PAVIMENTO","M2",{"$nulls":4},{"$f":"SUM(I29:I29)","v":14233.02}]
[null,null,"ÁREA DE PAVIMENTO (LEVANT. CAD)",{"$nulls":5},14233.02,null,3.29]
[]
[7,"2.2","PRE-MISTURADO A FRIO COM EMULSAO RL-1C, INCLUSO USINAGEM E APLICACAO EXCLUSIVE TRANSPORTE","M3",{"$nulls":4},{"$f":"SUM(I32:I32)","v":569.32080000000008}]
[null,null,"PAVIMENTAÇÃO RUA",{"$f":"I28","v":14233.02},0.04,null,null,null,{"$f":"E32*D32","v":569.32080000000008}]
[]
["C",3,"TRANSPORTE DE MATERIAIS"]
[]
[8,"3.1","TRANSPORTE COM CAMINHÃO BASCULANTE DE 18 M3, EM VIA URBANA PAVIMENTADA, DMT ACIMA DE 30 KM(UNIDADE: M3XKM).","M3XKM",{"$nulls":4},{"$f":"SUM(I37:I38)","v":48163.828874080005}]
[null,null,"TRANSPORTE BRITA",0.70399999999999996,{"$f":"I31+I23","v":571.32080000000008},null,59.4,null,{"$f":"(D37*E37)*G37","v":23891.264686080001}]
[null,null,"TRANSPORTE AREIA",0.29299999999999998,{"$f":"I31+I23","v":571.32080000000008},null,145,null,{"$f":"(D38*E38)*G38","v":24272.564188}]
[]
[9,"3.2","TRANSPORTE DE MATERIAL ASFALTICO, COM CAMINHÃO COM CAPACIDADE DE 30000L EM RODOVIA PAVIMENTADA PARA DISTÂNCIAS MÉDIAS DE TRANSPORTE SUPERIORES A 100 KM.","TXKM",{"$nulls":4},{"$f":"SUM(I41)","v":12850.709097600002}]
{"$rows_left_out":57}
{"sheet":"CPU","index":2,"n_rows":186,"n_cols":13,"rows_kept":186,"cut":false,"hidden":false,"merged":[[175,4,175,7],[175,10,175,11],[176,2,176,5],[177,2,177,3],[178,1,178,7],[182,1,182,3],[182,5,182,6],[170,1,170,3],[170,5,170,6],[171,1,171,6],[172,1,172,6],[173,1,173,6],[0,0,12,0],[13,0,29,0],[30,0,40,0],[41,0,57,0],[58,0,75,0],[76,0,93,0],[94,0,115,0],[116,0,127,0],[128,0,139,0],[140,0,156,0],[157,1,157,3],[157,4,157,7],[157,10,157,11],[158,2,158,5],[159,2,159,3],[160,1,160,7],[185,1,185,6],[183,1,183,6],[184,1,184,6],[154,1,154,6],[155,1,155,6],[140,1,140,3],[140,4,140,7],[140,10,140,11],[141,2,141,5],[142,2,142,3],[143,1,143,7],[152,1,152,3],[152,5,152,6],[153,1,153,6],[157,0,174,0],[175,0,186,0],[175,1,175,3],[130,2,130,3],[131,1,131,7],[135,1,135,3],[135,5,135,6],[136,1,136,6],[137,1,137,6],[138,1,138,6],[123,1,123,3],[123,5,123,6],[124,1,124,6],[125,1,125,6],[126,1,126,6],[128,1,128,3],[128,4,128,7],[128,10,128,11],[129,2,129,5],[112,1,112,6],[113,1,113,6],[114,1,114,6],[116,1,116,3],[116,4,116,7],[116,10,116,11],[117,2,117,5],[118,2,118,3],[119,1,119,7],[91,1,91,6],[92,1,92,6],[94,1,94,3],[94,4,94,7],[94,10,94,11],[95,2,95,5],[96,2,96,3],[97,1,97,7],[111,1,111,3],[111,5,111,6],[76,1,76,3],[76,4,76,7],[76,10,76,11],[77,2,77,5],[78,2,78,3],[79,1,79,7],[89,1,89,3],[89,5,89,6],[90,1,90,6],[58,10,58,11],[59,2,59,5],[60,2,60,3],[61,1,61,7],[71,1,71,3],[71,5,71,6],[72,1,72,6],[73,1,73,6],[74,1,74,6],[43,2,43,3],[44,1,44,7],[53,1,53,3],[53,5,53,6],[54,1,54,6],[55,1,55,6],[56,1,56,6],[58,1,58,3],[58,4,58,7],[36,1,36,3],[36,5,36,6],[37,1,37,6],[38,1,38,6],[39,1,39,6],[41,1,41,3],[41,4,41,7],[41,10,41,11],[42,2,42,5],[26,1,26,6],[27,1,27,6],[28,1,28,6],[30,1,30,3],[30,4,30,7],[30,10,30,11],[31,2,31,5],[32,2,32,3],[33,1,33,7],[10,1,10,6],[11,1,11,6],[13,1,13,3],[13,4,13,7],[13,10,13,11],[14,2,14,5],[15,2,15,3],[16,1,16,7],[25,1,25,3],[25,5,25,6],[0,1,0,3],[0,4,0,7],[0,10,0,11],[1,2,1,5],[2,2,2,3],[3,1,3,7],[8,1,8,3],[8,5,8,6],[9,1,9,6]]}
[1,"CODEVASF",null,null," COMPOSIÇÃO DE PREÇO UNITÁRIO",null,null,null,{"$f":"H10","v":3844.98},{"$f":"H12","v":4670.8817039999994},"BDI CALCULADO:",null,{"$f":"ORÇAMENTO!I6","v":0.21479999999999999}]
[null,"OBRA:  ",{"$f":"ORÇAMENTO!C5","v":"RECAPEAMENTO - FELIXLÂNDIA - RUAS CORONEL EFRAIM EPIFÂNIO, RAIMUNDO FERREIRA DA SILVA,  MARCOS ANTERO"},null,null,null,"DATA: ",{"$f":"ORÇAMENTO!C6","v":"JANEIRO / 2020"}]
[null,"SERVIÇO:  ",{"$f":"VLOOKUP(A1,ORÇAMENTO!A10:I25,3)","v":"MOBILIZAÇÃO E DESMOBILIZAÇÃO"},null,"Referência:",{"$f":"VLOOKUP(A1,ORÇAMENTO!A10:I25,4)","v":"CPU"},"UNIDADE: ",{"$f":"VLOOKUP(A1,ORÇAMENTO!A10:I25,5)","v":"GL"}]
[]
[null,"TIPO ITEM","CODIGO ITEM","DESCRIÇÃO ITEM","UNIDADE ITEM","COEFICIENTE","PRECO UNITARIO","CUSTO TOTAL"]
[null,"COMPOSICAO",89876,"CAMINHÃO BASCULANTE 14 M3, COM CAVALO MECÂNICO DE CAPACIDADE MÁXIMA DE TRAÇÃO COMBINADO DE 36000 KG, POTÊNCIA 286 CV, INCLUSIVE SEMIREBOQUE COM CAÇAMBA METÁLICA","CHP DIURNO.",16,192.71,{"$f":"F6*G6","v":3083.36}]
[null,"COMPOSICAO",89877,"CAMINHÃO BASCULANTE 14 M3, COM CAVALO MECÂNICO DE CAPACIDADE MÁXIMA DE TRAÇÃO COMBINADO DE 36000 KG, POTÊNCIA 286 CV, INCLUSIVE SEMIREBOQUE COM CAÇAMBA METÁLICA","CHI DIURNO.",16,45.75,{"$f":"F7*G7","v":732}]
[null,"COMPOSIÇÃO",88316,"SERVENTE COM ENCARGOS COMPLEMENTARES","H",2,14.81,{"$f":"G8*F8","v":29.62}]
[null,"PRODUÇÃO DA EQUIPE",null,null,1,"CUSTO ",null,{"$f":"SUM(H6:H8)","v":3844.98}]
[null,"TOTAL",{"$nulls":5},{"$f":"H9/E9","v":3844.98}]
[null,"BDI                %",{"$nulls":5},{"$f":"1+$M$1","v":1.2147999999999999}]
[null,"TOTAL DO SERVIÇO - R$",{"$nulls":5},{"$f":"H10*H11","v":4670.8817039999994}]
[]
[{"$f":"A1+1","v":2},"CODEVASF",null,null," COMPOSIÇÃO DE PREÇO UNITÁRIO",null,null,null,{"$f":"H27","v":17587.810000000001},{"$f":"H29","v":21365.671588000001}]
[null,"OBRA:  ",{"$f":"$C$2","v":"RECAPEAMENTO - FELIXLÂNDIA - RUAS CORONEL EFRAIM EPIFÂNIO, RAIMUNDO FERREIRA DA SILVA,  MARCOS ANTERO"},null,null,null,"DATA: ",{"$f":"$H$2","v":"JANEIRO / 2020"}]
[null,"SERVIÇO:  ",{"$f":"VLOOKUP(A14,ORÇAMENTO!$A$10:$I$25,3)","v":"ADMINISTRAÇÃO LOCAL"},null,"SINAPI","CPU","UNIDADE: ",{"$f":"VLOOKUP(A14,ORÇAMENTO!$A$10:$I$25,5)","v":"GL"}]
[]
[null,"TIPO ITEM","CODIGO ITEM","DESCRIÇÃO ITEM","UNIDADE ITEM","COEFICIENTE","PRECO UNITARIO","CUSTO TOTAL"]
[null,"INSUMO",14250,"ENERGIA ELÉTRICA","kwh",600,0.62,{"$f":"F19*G19","v":372}]
[null,"INSUMO",14583,"ÁGUA/ESGOTO ","m³",15,{"$f":"1.9*11.73","v":22.286999999999999},334.30500000000001]
[null,"COTAÇÃO","MERC.","TELEFONE (PLANO CONTROLE)","UNID",3,65,195]
[null,"COMPOSICAO",2708,"Engenheiro Civil","H",20,130.41,2608.1999999999998]
[null,"COMPOSICAO",4083,"Encarregado Geral","H",110,32.39,3562.9]
[null,"COMPOSICAO",7153,"Técnico Laboratorista de Solos","H",0,28.3,0]
[null,"COMPOSICAO",2350,"Auxiliar de escritório","H",110,15.65,1721.5]
[null,"PRODUÇÃO DA EQUIPE",null,null,0.5,"CUSTO ",null,{"$f":"SUM(H19:H25)","v":8793.9050000000007}]
[null,"TOTAL",{"$nulls":5},{"$f":"H26/E26","v":17587.810000000001}]
[null,"BDI                %",{"$nulls":5},{"$f":"1+$M$1","v":1.2147999999999999}]
[null,"TOTAL DO SERVIÇO - R$",{"$nulls":5},{"$f":"H27*H28","v":21365.671588000001}]
[]
[{"$f":"A14+1","v":3},"CODEVASF",null,null," COMPOSIÇÃO DE PREÇO UNITÁRIO",null,null,null,{"$f":"H38","v":2600},{"$f":"H40","v":3158.4799999999996}]
[null,"OBRA:  ",{"$f":"$C$2","v":"RECAPEAMENTO - FELIXLÂNDIA - RUAS CORONEL EFRAIM EPIFÂNIO, RAIMUNDO FERREIRA DA SILVA,  MARCOS ANTERO"},null,null,null,"DATA: ",{"$f":"$H$2","v":"JANEIRO / 2020"}]
[null,"SERVIÇO:  ",{"$f":"VLOOKUP(A31,ORÇAMENTO!$A$10:$I$25,3)","v":"CANTEIRO DE OBRAS"},null,"SINAPI",{"$f":"VLOOKUP(A31,ORÇAMENTO!$A$10:$I$25,4)","v":"CPU"},"UNIDADE: ",{"$f":"VLOOKUP(A31,ORÇAMENTO!$A$10:$I$25,5)","v":"GL"}]
[]
[null,"TIPO ITEM","CODIGO ITEM","DESCRIÇÃO ITEM","UNIDADE ITEM","COEFICIENTE","PRECO UNITARIO","CUSTO TOTAL"]
[null,"COTAÇÃO","MERC.","ALUGUEL DE IMÓVEL OU CONTEINER QUE ATENDA AOS REQUISITOS MÍNIMOS PARA INSTALAÇÃO DO CANTEIRO DE OBRAS ","MÊS",4,650,{"$f":"F36*G36","v":2600}]
[null,"PRODUÇÃO DA EQUIPE",null,null,1,"CUSTO ",null,{"$f":"SUM(H36:H36)","v":2600}]
[null,"TOTAL",{"$nulls":5},{"$f":"H37/E37","v":2600}]
[null,"BDI                %",{"$nulls":5},{"$f":"1+$M$1","v":1.2147999999999999}]
[null,"TOTAL DO SERVIÇO - R$",{"$nulls":5},{"$f":"H38*H39","v":3158.4799999999996}]
{"$rows_left_out":147}
{"sheet":"BDI SERV","index":3,"n_rows":37,"n_cols":5,"rows_kept":37,"cut":false,"hidden":false,"merged":[[36,0,36,5],[3,1,4,1],[3,2,4,2],[0,1,2,4],[32,0,34,5],[28,0,28,5],[30,1,30,2],[31,1,31,2]]}
[null,"DETALHAMENTO DO BDI - SERVIÇOS"]
[]
[]
[null,"Item","Descrição dos Serviços","%","%"]
[null,null,null,"PV","CD"]
[]
[null,1,"ADMINISTRAÇÃO CENTRAL"," ",4.01]
[null,"1.1","ESCRITÓRIO CENTRAL"," "," "]
[null,"1.2","VIAGENS"," "," "]
[null,"1.3","OUTROS"," "," "]
[null," "," "," "," "]
[null,2,"IMPOSTOS E TAXAS",{"$f":"SUM(D13:D16)","v":5.65},{"$f":"SUM(E13:E16)","v":7.0600000000000005}]
[null,"2.1","ISS (*)",2,{"$f":"ROUND(D13*1.2515,2)","v":2.5}]
[null,"2.2","PIS",0.65,0.81]
[null,"2.3","Cofins",3,3.75]
[null,"2.4","CONTRIBUIÇÃO PREVIDENCIÁRIA SOBRE A RENDA BRUTA",0,0]
[]
[null,3,"TAXA DE RISCO"," ",{"$f":"SUM(E19:E22)","v":0.96}]
[null,"3.1","SEGURO",null,0.2]
[null,"3.2","RISCO",null,0.56000000000000005]
[null,"3.3","GARANTIA",null,0.2]
[]
[null,4,"DESPESAS FINANCEIRAS"," ",1.1000000000000001]
[]
[null,5,"LUCRO",null,8]
[]
[null," ","BDI - CALCULADO"," ",{"$f":"ROUND((((1+(E7+E18)/100)*(1+E23/100)*(1+E25/100)/(1-D12/100)-1)*100),2)","v":21.48}]
[]
["BDI = ((1+((AC+S+R+G)/100))x(1+DF/100)x(1+L/100)/(1-I/100)-1)*100"]
[]
[null,"BDI (CALCULADO):",null,{"$f":"ROUND((((1+((E7+E18)/100))*(1+E23/100)*(1+E25/100))/(1-D12/100)-1)*100,2)","v":21.48},"%"]
[null," "]
["(*) ISS CONFORME LEI COMPLEMENTAR Nº 13 / 2017 - ANEXO IV  (ITEM 7.02)"]
[]
[]
[]
["BDI EM CONFORMIDADE COM OS ACÓRDÃOS Nº 2369/2011 e ACÓRDÃO Nº 2.622/2013 - TCU - PLENÁRIO"]

{"sheet":"BDI FORN","index":4,"n_rows":37,"n_cols":5,"rows_kept":37,"cut":false,"hidden":false,"merged":[[36,0,36,5],[3,1,4,1],[3,2,4,2],[0,1,2,4],[32,0,34,5],[28,0,28,5],[30,1,30,2],[31,1,31,2]]}
[null,"DETALHAMENTO DO BDI - FORNECIMENTOS"]
[]
[]
[null,"Item","Descrição dos Serviços","%","%"]
[null,null,null,"PV","CD"]
[]
[null,1,"ADMINISTRAÇÃO CENTRAL"," ",4]
[null,"1.1","ESCRITÓRIO CENTRAL"," "," "]
[null,"1.2","VIAGENS"," "," "]
[null,"1.3","OUTROS"," "," "]
[null," "," "," "," "]
[null,2,"IMPOSTOS E TAXAS",{"$f":"SUM(D13:D16)","v":3.65},{"$f":"SUM(E13:E16)","v":4.5600000000000005}]
[null,"2.1","ISS (*)",null,{"$f":"ROUND(D13*1.2515,2)","v":0}]
[null,"2.2","PIS",0.65,0.81]
[null,"2.3","Cofins",3,3.75]
[null,"2.4","CONTRIBUIÇÃO PREVIDENCIÁRIA SOBRE A RENDA BRUTA",0,0]
[]
[null,3,"TAXA DE RISCO"," ",{"$f":"SUM(E19:E22)","v":0.96}]
[null,"3.1","SEGURO",null,0.2]
[null,"3.2","RISCO",null,0.56000000000000005]
[null,"3.3","GARANTIA",null,0.2]
[]
[null,4,"DESPESAS FINANCEIRAS"," ",1]
[]
[null,5,"LUCRO",null,7.3]
[]
[null," ","BDI - CALCULADO"," ",{"$f":"ROUND((((1+(E7+E18)/100)*(1+E23/100)*(1+E25/100)/(1-D12/100)-1)*100),2)","v":18.059999999999999}]
[]
["BDI = ((1+((AC+S+R+G)/100))x(1+DF/100)x(1+L/100)/(1-I/100)-1)*100"]
[]
[null,"BDI (CALCULADO):",null,{"$f":"ROUND((((1+((E7+E18)/100))*(1+E23/100)*(1+E25/100))/(1-D12/100)-1)*100,2)","v":18.059999999999999},"%"]
[null," "]
[]
[]
[]
[]
["BDI EM CONFORMIDADE COM OS ACÓRDÃOS Nº 2369/2011 e ACÓRDÃO Nº 2.622/2013 - TCU - PLENÁRIO"]

{"sheet":"CRONOGRAMA","index":5,"n_rows":19,"n_cols":8,"rows_kept":19,"cut":false,"hidden":false,"merged":[[15,1,16,2],[18,1,22,7],[7,2,8,2],[9,2,10,2],[11,2,12,2],[13,2,14,2],[7,1,8,1],[9,1,10,1],[11,1,12,1],[13,1,14,1],[7,0,8,0],[9,0,10,0],[11,0,12,0],[13,0,14,0],[0,1,0,7],[1,6,1,7],[2,6,2,7],[3,1,3,6],[5,0,6,0],[5,2,6,2],[1,1,2,1],[5,1,6,1],[1,2,2,4]]}
[null,"CRONOGRAMA FÍSICO-FINANCEIRO"]
[null,"OBRA: ",{"$f":"ORÇAMENTO!C5","v":"RECAPEAMENTO - FELIXLÂNDIA - RUAS CORONEL EFRAIM EPIFÂNIO, RAIMUNDO FERREIRA DA SILVA,  MARCOS ANTERO"},null,null,"VALOR:",{"$f":"ORÇAMENTO!I26","v":475158.24000000005}]
[{"$nulls":5},"PRAZO: ","60 DIAS "]
[]
[null,"ITEM","ETAPAS/DESCRIÇAO","FISICO/  FINANCEIRO","TOTAL    ETAPAS","MÊS 1","MÊS 2","TOTAL"]
["A",{"$f":"VLOOKUP(A6,ORÇAMENTO!$A$9:$I$26,2)","v":1},{"$f":"VLOOKUP(A6,ORÇAMENTO!$A$9:$I$26,3)","v":"SERVIÇOS PRELIMINARES E URBANIZAÇÃO"},"FISICO ",{"$f":"ROUND(E7/$G$2,4)","v":6.5299999999999997E-2},0.6,0.4,{"$f":"SUM(F6:G6)","v":1}]
[null,null,null,"FINANCEIRO",{"$f":"ORÇAMENTO!I9","v":31047.309999999998},{"$f":"ROUND($E$7*F6,2)","v":18628.39},12418.92,31047.309999999998]
["B",{"$f":"VLOOKUP(A8,ORÇAMENTO!$A$9:$I$26,2)","v":2},{"$f":"VLOOKUP(A8,ORÇAMENTO!$A$9:$I$26,3)","v":"RECAPEAMENTO"},"FISICO ",{"$f":"ROUND(E9/$G$2,4)","v":0.72350000000000003},0.5,0.5,1]
[null,null,null,"FINANCEIRO",{"$f":"ORÇAMENTO!I15","v":343777.74},{"$f":"ROUND($E$9*F8,2)","v":171888.87},171888.87,343777.74]
["C",{"$f":"VLOOKUP(A10,ORÇAMENTO!$A$9:$I$26,2)","v":3},{"$f":"VLOOKUP(A10,ORÇAMENTO!$A$9:$I$26,3)","v":"TRANSPORTE DE MATERIAIS"},"FISICO ",{"$f":"ROUND(E11/$G$2,4)","v":8.5300000000000001E-2},0.5,0.5,1]
[null,null,null,"FINANCEIRO",{"$f":"ORÇAMENTO!I18","v":40542.589999999997},{"$f":"ROUND($E$11*F10,2)","v":20271.3},{"$f":"ROUND($E$11*G10,2)","v":20271.3},40542.6]
["D",{"$f":"VLOOKUP(A12,ORÇAMENTO!$A$9:$I$26,2)","v":4},{"$f":"VLOOKUP(A12,ORÇAMENTO!$A$9:$I$26,3)","v":"SINALIZAÇÃO"},"FISICO ",{"$f":"ROUND(E13/$G$2,4)","v":1.89E-2},0.2,0.8,1]
[null,null,null,"FINANCEIRO",{"$f":"ORÇAMENTO!I21","v":8964.27},{"$f":"ROUND($E$13*F12,2)","v":1792.85},7171.42,8964.27]
["E",{"$f":"VLOOKUP(A14,ORÇAMENTO!$A$9:$I$26,2)","v":"5."},{"$f":"VLOOKUP(A14,ORÇAMENTO!$A$9:$I$26,3)","v":"OBRAS COMPLEMENTARES"},"FISICO ",{"$f":"ROUND(E15/$G$2,4)","v":0.107},0.5,0.5,1]
[null,null,null,"FINANCEIRO",{"$f":"ORÇAMENTO!I23","v":50826.33},{"$f":"ROUND($E$15*F14,2)","v":25413.17},25413.17,50826.34]
[null,"TOTAL",null,"FISICO ",{"$f":"SUM(F16:G16)","v":1.0000000420912412},{"$f":"F17/E17","v":0.50087436134960017},{"$f":"G17/E17","v":0.49912568074164093},1.0000000420912412]
[null,null,null,"FINANCEIRO",{"$f":"E11+E9+E7+E13+E15","v":475158.24},{"$f":"F11+F9+F7+F13+F15","v":237994.58000000002},{"$f":"G11+G9+G7+G13+G15","v":237163.68},475158.26]
[]
[null,"OBSERVAÇÕES:"]